{"text_format":"1","workbook":"xlsx","n_sheets":4,"sheets":["Post Code Calculator","Post Code data","Score Guide","Quick Reference Guide"],"not_rendered":{"charts":0,"images":1,"macros":1,"external_links":1,"defined_names":6,"comments":0,"pivot_tables":0},"unopened":[],"bounds":{"document_bytes":16777216,"sheet_cells":100000,"rows_first":2000,"rows_last":500,"rows_between":2000,"halvings":0,"cell_chars":16384,"cell_head_chars":4096},"cells_cut":0,"cells_raw":0,"read":"whole","date_system":"1900"}

{"sheet":"Post Code Calculator","index":0,"n_rows":117,"n_cols":22,"rows_kept":117,"cut":false,"hidden":false,"merged":[[2,3,2,4],[1,3,1,4]]}
[null,null,null,null,null,null,null,null,null,null,null,null,null,null," ",{"$f":"IF(B4<=H2,2,IF(AND(B4>H2,B4<=I2),3,IF(AND(B4>I2,B4<=J2),4,IF(AND(B4>J2,B4<=K2),5,IF(AND(B4>K2,B4<=L2),6,IF(AND(B4>L2,B4<=M2),7,\"N/A\"))))))","v":2},null,"Rating","Type","Product"]
["Input Post Code",null,"Funder Rating",{"$f":"IF(OR(B2=3308,B2=4184,B2=6701),\"Not Acceptable Postcode\",IF(_xlfn.XLOOKUP('Post Code Calculator'!B2,'Post Code data'!A:A,'Post Code data'!O:O,\"\",0,1)=\"\",\"\",_xlfn.XLOOKUP('Post Code Calculator'!B2,'Post Code data'!A:A,'Post Code data'!O:O,\"\",0,1)))","v":""},null,null,"Products - Max LVR",0.6,0.7,0.75,0.8,0.9,0.95,"Comments",null,null,null,"High Density","House/Townhouse/Unit","Residential - Owner OCC (metro)","High Density"]
["Select type of security",null,"Geographic Region",{"$f":"IF(OR(B2=3308,B2=4184,B2=6701),\"Not Acceptable Postcode\",IF(_xlfn.XLOOKUP(B2,'Post Code data'!A:A,'Post Code data'!E:E,\"\",0,1)=\"\",\"\",_xlfn.XLOOKUP(B2,'Post Code data'!A:A,'Post Code data'!E:E,\"\",0,1)))","v":""},null,null,"Residential - Owner OCC (metro)",0.6,0.7,0.75,0.8,{"$f":"IF($D$2=\"High Density\",\"N/A\",L66)","v":0.9},{"$f":"IF($D$2=\"High Density\",\"N/A\",M66)","v":"95%"},{"$f":"IF($B$4>80%,\"Approval is subject to LMI\",\"\")","v":""},{"$f":"MAX(IFERROR(_xlfn.NUMBERVALUE(H3:M3),0))","v":0.95},null,null,"High Density","House/Townhouse/Unit","Residential - Investment (metro)","Metro"]
["Requested LVR",null,null,null,null,null,"Residential - Investment (metro)",0.6,0.7,0.75,0.8,{"$f":"IF($D$2=\"High Density\",\"N/A\",L67)","v":0.9},"95%",{"$f":"IF($B$4>80%,\"Approval is subject to LMI\",\"\")","v":""},{"$f":"MAX(IFERROR(_xlfn.NUMBERVALUE(H4:M4),0))","v":0.95},null,null,"High Density","House/Townhouse/Unit","Residential - Non Coded","Non Metro "]
[null,null,null,null,null,null,"Residential - Owner Occ (Non Metro)",0.6,0.7,0.75,0.8,0.9,"95%",{"$f":"IF($B$4>80%,\"Approval is subject to LMI\",\"\")","v":""},{"$f":"MAX(IFERROR(_xlfn.NUMBERVALUE(H5:M5),0))","v":0.95},null,null,"High Density","House/Townhouse/Unit","Residential - Non Conforming Full/Alt Doc","Regional"]
["Available Products","Max LVR","Requested LVR and pricing band","Max Loan Amount within LVR Band","Funder Comments",null,"Residential - Investment (Non Metro) ",0.6,0.7,0.75,0.8,0.9,"95%",{"$f":"IF($B$4>80%,\"Approval is subject to LMI\",\"\")","v":""},{"$f":"MAX(IFERROR(_xlfn.NUMBERVALUE(H6:M6),0))","v":0.95},null,null,"High Density","House/Townhouse/Unit","SMSF - Residential","Refer to Distribution Partner"]
[{"$f":"IF(_xlfn._xlws.SORT(_xlfn.UNIQUE(_xlfn._xlws.FILTER(T:T, (R:R=D2) *(S:S=B3), \"--\")))=0,\"\",_xlfn._xlws.SORT(_xlfn.UNIQUE(_xlfn._xlws.FILTER(T:T, (R:R=D2) *(S:S=B3), \"--\"))))","v":""},{"$f":"IFERROR(VLOOKUP(_xlfn.ANCHORARRAY(A7),G2:O27,9,FALSE),\"\")","v":""},{"$f":"IFERROR(VLOOKUP(_xlfn.ANCHORARRAY(A7),G2:M27,P1,FALSE),\"\")","v":""},{"$f":"IFERROR(VLOOKUP(_xlfn.ANCHORARRAY(A7),G30:M54,P1,FALSE),\"\")","v":""},{"$f":"IFERROR(IF(VLOOKUP(_xlfn.ANCHORARRAY(A7),G2:N27,8,FALSE)=\"\",\"\",VLOOKUP(_xlfn.ANCHORARRAY(A7),G2:N27,8,FALSE)),\"\")","v":""},null,"Residential - Regional Full Doc",0.6,0.7,0.75,0.8,0.9,"N/A",{"$f":"IF(ISNUMBER(SEARCH(\"Apartment\",$B$3)),\"See Credit Help prior to proceeding\",IF($B$4>80%,\"Approval is subject to LMI\",\"\"))","v":""},{"$f":"MAX(IFERROR(_xlfn.NUMBERVALUE(H7:M7),0))","v":0.9},null,null,"High Density","House/Townhouse/Unit","Non Resident"]
[null,null,null,null,null,null,"Residential - Regional Alt Doc",0.6,"N/A","N/A","N/A","N/A","N/A","",{"$f":"MAX(IFERROR(_xlfn.NUMBERVALUE(H8:M8),0))","v":0.6},null,null,"High Density","House/Townhouse/Unit","Ex Pat","House/Townhouse/Unit","Apartments >10 (OTP/New/Existing)"]
[null,null,null,null,null,null,"Residential - Non Coded",0.6,{"$f":"IF(B4<=65%,65%,70%)","v":0.65},0.75,0.8,"N/A","N/A","",{"$f":"MAX(IFERROR(_xlfn.NUMBERVALUE(H9:M9),0))","v":0.8},null,null,"High Density","Apartments >10 (OTP/New/Existing)","Residential - Owner OCC (metro)","Apartments >10 (OTP/New/Existing)","House/Townhouse/Unit"]
[null,null,null,null,null,null,"Residential - Non Conforming Full/Alt Doc",0.6,{"$f":"IF($B$4<=65%,65%,70%)","v":0.65},0.75,0.8,"N/A","N/A","See Credit Help prior to proceeding",{"$f":"MAX(IFERROR(_xlfn.NUMBERVALUE(H10:M10),0))","v":0.8},null,null,"High Density","Apartments >10 (OTP/New/Existing)","Residential - Investment (metro)","Construction","Construction"]
[null,null,null,null,null,null,"Residential - Non Conforming Regional",0.6,"N/A","N/A","N/A","N/A","N/A","See Credit Help prior to proceeding",{"$f":"MAX(IFERROR(_xlfn.NUMBERVALUE(H11:M11),0))","v":0.6},null,null,"High Density","Apartments >10 (OTP/New/Existing)","Residential - Non Conforming Full/Alt Doc","Commercial","Commercial"]
[null,null,null,null,null,null,"SMSF - Residential",0.6,{"$f":"IF($B$4<=65%,65%,70%)","v":0.65},0.75,0.8,"N/A","N/A",null,{"$f":"MAX(IFERROR(_xlfn.NUMBERVALUE(H12:M12),0))","v":0.8},null,null,"High Density","Apartments >10 (OTP/New/Existing)","Residential - Non Coded","Vacant Land","Vacant Land"]
[null,null,null,null,null,null,"SMSF - Residential Regional",0.6,"N/A","N/A","N/A","N/A","N/A",null,{"$f":"MAX(IFERROR(_xlfn.NUMBERVALUE(H13:M13),0))","v":0.6},null,null,"High Density","Apartments >10 (OTP/New/Existing)","SMSF - Residential"]
[null,null,null,null,null,null,"SMSF - Commercial",0.6,{"$f":"IF($B$4<=65%,65%,70%)","v":0.65},0.75,{"$f":"IF(AND($B$4>70%,$B$4<=80%),\"N/A\",\"N/A\")","v":"N/A"},"N/A","N/A",null,{"$f":"MAX(IFERROR(_xlfn.NUMBERVALUE(H14:M14),0))","v":0.75},null,null,"High Density","Apartments >10 (OTP/New/Existing)","Non Resident"]
[null,null,null,null,null,null,"SMSF - Commercial Regional",0.6,"N/A","N/A","N/A","N/A","N/A",null,{"$f":"MAX(IFERROR(_xlfn.NUMBERVALUE(H15:M15),0))","v":0.6},null,null,"High Density","Apartments >10 (OTP/New/Existing)","Ex Pat"]
[null,null,null,null,null,null,"Commercial - Residential",0.6,{"$f":"IF($B$4<=65%,65%,70%)","v":0.65},{"$f":"IF($B$4<=80%,80%,\"N/A\")","v":0.8},0.8,"N/A","N/A","See Credit Help prior to proceeding",{"$f":"MAX(IFERROR(_xlfn.NUMBERVALUE(H16:M16),0))","v":0.8},null,null,"High Density","Construction","Construction - Prime (Owner OCC)"]
[null,null,null,null,null,null,"Commercial - Commercial",0.6,{"$f":"IF($B$4<=65%,65%,70%)","v":0.65},0.75,{"$f":"IF(AND($B$4>70%,$B$4<=80%),\"N/A\",\"N/A\")","v":"N/A"},"N/A","N/A","See Credit Help prior to proceeding",{"$f":"MAX(IFERROR(_xlfn.NUMBERVALUE(H17:M17),0))","v":0.75},null,null,"High Density","Construction","Construction - Prime (Investment)"]
[null,null,null,null,null,null,"Vacant Land",0.5,"N/A","N/A","N/A","N/A","N/A","See Credit Help prior to proceeding",{"$f":"MAX(IFERROR(_xlfn.NUMBERVALUE(H18:M18),0))","v":0.5},null,null,"High Density","Construction","Construction - Alt Doc"]
[null,null,null,null,null,null,"Construction - Prime (Owner OCC)",0.6,0.7,0.75,0.8,0.9,0.95,{"$f":"IF(ISNUMBER(SEARCH(\"Apartment\",$B$3)),\"See Credit Help prior to proceeding\",IF($B$4>80%,\"Approval is subject to LMI\",\"\"))","v":""},{"$f":"MAX(IFERROR(_xlfn.NUMBERVALUE(H19:M19),0))","v":0.95},null,null,"High Density","Construction","Construction - Foreign"]
[null,null,null,null,null,null,"Construction - Prime (Investment)",0.6,0.7,0.75,0.8,0.9,"N/A",{"$f":"IF(ISNUMBER(SEARCH(\"Apartment\",$B$3)),\"See Credit Help prior to proceeding\",IF($B$4>80%,\"Approval is subject to LMI\",\"\"))","v":""},{"$f":"MAX(IFERROR(_xlfn.NUMBERVALUE(H20:M20),0))","v":0.9},null,null,"High Density","Commercial","Commercial - Residential"]
[null,null,null,null,null,null,"Construction - Alt Doc",0.6,0.7,0.75,0.8,"N/A","N/A",{"$f":"IF(ISNUMBER(SEARCH(\"Apartment\",$B$3)),\"See Credit Help prior to proceeding\",IF($B$4>80%,\"Approval is subject to LMI\",\"\"))","v":""},{"$f":"MAX(IFERROR(_xlfn.NUMBERVALUE(H21:M21),0))","v":0.8},null,null,"High Density","Commercial","SMSF - Commercial"]
[null,null,null,null,null,null,"Construction - Foreign",0.6,0.7,0.75,"N/A","N/A","N/A","See Credit Help prior to proceeding",{"$f":"MAX(IFERROR(_xlfn.NUMBERVALUE(H22:M22),0))","v":0.75},null,null,"Metro","House/Townhouse/Unit","Residential - Owner OCC (metro)"]
[null,null,null,null,null,null,"Non Resident",0.6,0.7,0.75,"N/A","N/A","N/A","See Credit Help prior to proceeding",{"$f":"MAX(IFERROR(_xlfn.NUMBERVALUE(H23:M23),0))","v":0.75},null,null,"Metro","House/Townhouse/Unit","Residential - Investment (metro)"]
[null,null,null,null,null,null,"Ex Pat",0.6,0.7,0.75,"N/A","N/A","N/A","See Credit Help prior to proceeding",{"$f":"MAX(IFERROR(_xlfn.NUMBERVALUE(H24:M24),0))","v":0.75},null,null,"Metro","House/Townhouse/Unit","Residential - Non Coded"]
[null,null,null,null,null,null,"Construction - Foreign (Non Metro)","Quote","Quote","Quote","N/A","N/A","N/A","See Credit Help prior to proceeding","Quote",null,null,"Metro","House/Townhouse/Unit","Residential - Non Conforming Full/Alt Doc"]
[null,null,null,null,null,null,"Non Resident (Non Metro)",0.6,0.7,0.75,"N/A","N/A","N/A","See Credit Help prior to proceeding",{"$f":"MAX(IFERROR(_xlfn.NUMBERVALUE(H26:M26),0))","v":0.75},null,null,"Metro","House/Townhouse/Unit","SMSF - Residential"]
[null,null,null,null,null,null,"Ex Pat (Non Metro)",0.6,0.7,0.75,"N/A","N/A","N/A","See Credit Help prior to proceeding",{"$f":"MAX(IFERROR(_xlfn.NUMBERVALUE(H27:M27),0))","v":0.75},null,null,"Metro","House/Townhouse/Unit","Non Resident"]
[null,null,null,null,null,null,null,null,null,null,null,null,null,null,null,null,null,"Metro","House/Townhouse/Unit","Ex Pat"]
[null,null,null,null,null,null,"Products - Max Loan amount",0.6,0.7,0.75,0.8,0.9,0.95,"Comments",null,null,null,"Metro","Apartments >10 (OTP/New/Existing)","Residential - Owner OCC (metro)"]
[null,null,null,null,null,null,"Residential - Owner OCC (metro)",2000000,2000000,1500000,1500000,{"$f":"IF($D$2=\"High Density\",\"N/A\",L93)","v":1000000},{"$f":"IF($D$2=\"High Density\",\"N/A\",M93)","v":500000},{"$f":"IF(ISNUMBER(SEARCH(\"Apartment\",$B$3)),\"See Credit Help prior to proceeding\",IF($B$4>80%,\"Approval is subject to LMI\",\"\"))","v":""},null,null,null,"Metro","Apartments >10 (OTP/New/Existing)","Residential - Investment (metro)"]
[null,null,null,null,null,null,"Residential - Investment (metro)",2000000,2000000,1500000,1500000,{"$f":"IF($D$2=\"High Density\",\"N/A\",L94)","v":1000000},500000,"",null,null,null,"Metro","Apartments >10 (OTP/New/Existing)","Residential - Non Coded"]
[null,null,null,null,null,null,"Residential - Owner Occ (Non Metro)",1000000,1000000,1000000,1000000,750000,500000,"",null,null,null,"Metro","Apartments >10 (OTP/New/Existing)","Residential - Non Conforming Full/Alt Doc"]
[null,null,null,null,null,null,"Residential - Investment (Non Metro) ",1000000,1000000,1000000,1000000,750000,500000,"",null,null,null,"Metro","Apartments >10 (OTP/New/Existing)","SMSF - Residential"]
[null,null,null,null,null,null,"Residential - Regional Full Doc",1000000,1000000,1000000,1000000,750000,"N/A","",null,null,null,"Metro","Apartments >10 (OTP/New/Existing)","Non Resident"]
[null,null,null,null,null,null,"Residential - Regional Alt Doc",750000,"N/A","N/A","N/A","N/A","N/A","",null,null,null,"Metro","Apartments >10 (OTP/New/Existing)","Ex Pat"]
[null,null,null,null,null,null,"Residential - Non Coded",3000000,{"$f":"IF(B4<=65%,3000000,2000000)","v":3000000},{"$f":"IF(B4<=70%,2000000,1500000)","v":2000000},1500000,"N/A","N/A",{"$f":"\"$3,000,000 up to 65% & $2,000,000 up to 70% \" &IF(ISNUMBER(SEARCH(\"Apartment\",$B$3)),\"See Credit Help prior to proceeding\",\"\")","v":"$3,000,000 up to 65% & $2,000,000 up to 70% "},null,null,null,"Metro","Construction","Construction - Prime (Owner OCC)"]
[null,null,null,null,null,null,"Residential - Non Conforming Full/Alt Doc",1500000,1250000,1250000,1250000,"N/A","N/A","See Credit Help prior to proceeding",null,null,null,"Metro","Construction","Construction - Prime (Investment)"]
[null,null,null,null,null,null,"Residential - Non Conforming Regional",750000,"N/A","N/A","N/A","N/A","N/A","See Credit Help prior to proceeding",null,null,null,"Metro","Construction","Construction - Alt Doc"]
[null,null,null,null,null,null,"SMSF - Residential",1500000,1500000,1500000,1250000,"N/A","N/A",{"$f":"\"$2,000,000 up to 65% LVR \"&IF(ISNUMBER(SEARCH(\"Apartment\",$B$3)),\"See Credit Help prior to proceeding\",\"\")","v":"$2,000,000 up to 65% LVR "},null,null,null,"Metro","Construction","Construction - Foreign"]
[null,null,null,null,null,null,"SMSF - Residential Regional",1250000,"N/A","N/A","N/A","N/A","N/A",{"$f":"IF(ISNUMBER(SEARCH(\"Apartment\",$B$3)),\"See Credit Help prior to proceeding\",\"\")","v":""},null,null,null,"Metro","Commercial","Commercial - Residential"]
[null,null,null,null,null,null,"SMSF - Commercial",2000000,2000000,1500000,{"$f":"IF(AND($B$4>70%,$B$4<=75%),\"N/A\",\"N/A\")","v":"N/A"},"N/A","N/A","$2,500,000 up to 65% LVR See Credit Help prior to proceeding",null,null,null,"Metro","Commercial","Commercial - Commercial"]
[null,null,null,null,null,null,"SMSF - Commercial Regional",1500000,"N/A","N/A","N/A","N/A","N/A",{"$f":"IF(ISNUMBER(SEARCH(\"Apartment\",$B$3)),\"See Credit Help prior to proceeding\",\"\")","v":""},null,null,null,"Metro","Commercial","SMSF - Commercial"]
[null,null,null,null,null,null,"Commercial - Residential",2500000,{"$f":"IF($B$4<=65%,2500000,2000000)","v":2500000},{"$f":"IF($B$4<=80%,1500000,\"N/A\")","v":1500000},1500000,"N/A","N/A","See Credit Help prior to proceeding",null,null,null,"Metro","Vacant Land","Vacant Land"]
[null,null,null,null,null,null,"Commercial - Commercial",3000000,{"$f":"IF($B$4<=65%,3000000,2000000)","v":3000000},1500000,{"$f":"IF(AND($B$4>70%,$B$4<=75%),\"N/A\",\"N/A\")","v":"N/A"},"N/A","N/A","See Credit Help prior to proceeding",null,"Exposure ratings",null,"Non Metro","House/Townhouse/Unit","Residential - Owner Occ (Non Metro)"]
[null,null,null,null,null,null,"Vacant Land",1000000,"N/A","N/A","N/A","N/A","N/A","See Credit Help prior to proceeding",null,"Apartment - removes apartment to Quote only",null,"Non Metro","House/Townhouse/Unit","Residential - Investment (Non Metro) "]
[null,null,null,null,null,null,"Construction - Prime (Owner OCC)","Quote","Quote","Quote","Quote","Quote","Quote",{"$f":"IF(ISNUMBER(SEARCH(\"Apartment\",$B$3)),\"See Credit Help prior to proceeding\",IF($B$4>80%,\"Approval is subject to LMI\",\"\"))","v":""},null,null,null,"Non Metro","House/Townhouse/Unit","Residential - Non Conforming Full/Alt Doc"]
[null,null,null,null,null,null,"Construction - Prime (Investment)","Quote","Quote","Quote","Quote","Quote","N/A",{"$f":"IF(ISNUMBER(SEARCH(\"Apartment\",$B$3)),\"See Credit Help prior to proceeding\",IF($B$4>80%,\"Approval is subject to LMI\",\"\"))","v":""},null,null,null,"Non Metro","House/Townhouse/Unit","SMSF - Residential"]
[null,null,null,null,null,null,"Construction - Alt Doc","Quote","Quote","Quote","Quote","N/A","N/A",{"$f":"IF(ISNUMBER(SEARCH(\"Apartment\",$B$3)),\"See Credit Help prior to proceeding\",\"\")","v":""},null,null,null,"Non Metro","House/Townhouse/Unit","Non Resident (Non Metro)"]
[null,null,null,null,null,null,"Construction - Foreign",900000,900000,900000,"N/A","N/A","N/A","See Credit Help prior to proceeding",null,null,null,"Non Metro","House/Townhouse/Unit","Ex Pat (Non Metro)"]
[null,null,null,null,null,null,"Non Resident",1500000,1500000,1500000,"N/A","N/A","N/A","See Credit Help prior to proceeding",null,null,null,"Non Metro","Apartments >10 (OTP/New/Existing)","Residential - Owner Occ (Non Metro)"]
[null,null,null,null,null,null,"Ex Pat",1500000,1500000,1500000,"N/A","N/A","N/A","See Credit Help prior to proceeding",null,null,null,"Non Metro","Apartments >10 (OTP/New/Existing)","Residential - Investment (Non Metro) "]
[null,null,null,null,null,null,"Construction - Foreign (Non Metro)","Quote","Quote","Quote","N/A","N/A","N/A","See Credit Help prior to proceeding",null,null,null,"Non Metro","Apartments >10 (OTP/New/Existing)","Residential - Non Conforming Full/Alt Doc"]
[null,null,null,null,null,null,"Non Resident (Non Metro)",500000,500000,500000,"N/A","N/A","N/A","See Credit Help prior to proceeding",null,null,null,"Non Metro","Apartments >10 (OTP/New/Existing)","SMSF - Residential"]
[null,null,null,null,null,null,"Ex Pat (Non Metro)",750000,750000,750000,"N/A","N/A","N/A","See Credit Help prior to proceeding",null,null,null,"Non Metro","Apartments >10 (OTP/New/Existing)","Non Resident (Non Metro)"]
[null,null,null,null,null,null,null,null,null,null,null,null,null,null,null,null,null,"Non Metro","Apartments >10 (OTP/New/Existing)","Ex Pat (Non Metro)"]
[null,null,null,null,null,null,"Gradings","House/Unit","Apartments >10","Construction","Commercial",null,"Definitions to add",null,null,null,null,"Non Metro","Construction","Construction - Prime (Owner OCC)"]
[null,null,null,null,null,null,"High Density","Yes","Yes","Yes","Yes",null,"Apartments >10 *80% LVR Cap",null,null,null,null,"Non Metro","Construction","Construction - Prime (Investment)"]
[null,null,null,null,null,null,"Metro","Yes","Yes","Yes","Yes",null,"NDIS *65% LVR Cap",null,null,null,null,"Non Metro","Construction","Construction - Alt Doc"]
[null,null,null,null,null,null,"Non Metro ","Yes","Yes","Yes","Quote",null,"Duplex *80% LVR Cap",null,null,null,null,"Non Metro","Construction","Construction - Foreign (Non Metro)"]
[null,null,null,null,null,null,"Regional","Yes","N/A","N/A","N/A",null,"Also have a min SQ meter table with LVR restrictions",null,null,null,null,"Non Metro","Commercial","Quote"]
[null,null,null,null,null,null,"Refer to Distribution Partner","Quote","N/A","N/A","N/A",null,null,null,null,null,null,"Non Metro","Commercial","SMSF - Commercial"]
[null,null,null,null,null,null,null,null,null,null,null,null,null,null,null,null,null,"Non Metro","Vacant Land","Vacant Land"]
[null,null,null,null,null,null,null,null,null,null,null,null,null,null,null,null,null,"Regional","House/Townhouse/Unit","Residential - Regional Full Doc"]
[null,null,null,null,null,null,null,null,null,null,null,null,null,null,null,null,null,"Regional","House/Townhouse/Unit","Residential - Regional Alt Doc"]
[null,null,null,null,null,null,null,null,null,null,null,null,null,null,null,null,null,"Regional","House/Townhouse/Unit","SMSF - Residential Regional"]
[null,null,null,null,null,null,null,null,null,null,null,0.9,{"$f":"IF(AND(ISNUMBER(SEARCH(\"Apartment\",$B$3))),\"N/A\",\"95%\")","v":"95%"},null,null,null,null,"Regional","House/Townhouse/Unit","Residential - Non Conforming Regional"]
[null,null,null,null,null,null,null,null,null,null,null,0.9,{"$f":"IF(AND(ISNUMBER(SEARCH(\"Apartment\",$B$3))),\"N/A\",\"95%\")","v":"95%"},null,null,null,null,"Refer to Distribution Partner","House/Townhouse/Unit","Quote"]
[null,null,null,null,null,null,null,null,null,null,null,0.9,{"$f":"IF(AND(ISNUMBER(SEARCH(\"Apartment\",$B$3))),\"N/A\",\"95%\")","v":"95%"},null,null,null,null,"Refer to Distribution Partner","Apartments >10 ","N/A"]
[null,null,null,null,null,null,null,null,null,null,null,0.9,{"$f":"IF(AND(ISNUMBER(SEARCH(\"Apartment\",$B$3)),$D$2=\"Non Metro\"),\"N/A\",\"95%\")","v":"95%"},null,null,null,null,"Refer to Distribution Partner","Construction","N/A"]
[null,null,null,null,null,null,null,null,null,null,null,0.9,"N/A",null,null,null,null,"Refer to Distribution Partner","Commercial","N/A"]
[null,null,null,null,null,null,null,null,null,null,null,"N/A","N/A"]
[null,null,null,null,null,null,null,null,null,null,null,"N/A","N/A"]
[null,null,null,null,null,null,null,null,null,null,null,"N/A","N/A"]
[null,null,null,null,null,null,null,null,null,null,null,"N/A","N/A"]
[null,null,null,null,null,null,null,null,null,null,null,"N/A","N/A"]
[null,null,null,null,null,null,null,null,null,null,null,"N/A","N/A"]
[null,null,null,null,null,null,null,null,null,null,null,"N/A","N/A"]
[null,null,null,null,null,null,null,null,null,null,null,"N/A","N/A"]
[null,null,null,null,null,null,null,null,null,null,null,"N/A","N/A"]
[null,null,null,null,null,null,null,null,null,null,null,"N/A","N/A"]
[null,null,null,null,null,null,null,null,null,null,null,"N/A","N/A"]
[null,null,null,null,null,null,null,null,null,null,null,0.9,0.95]
[null,null,null,null,null,null,null,null,null,null,null,0.9,"N/A"]
[null,null,null,null,null,null,null,null,null,null,null,"N/A","N/A"]
[null,null,null,null,null,null,null,null,null,null,null,"N/A","N/A"]
[null,null,null,null,null,null,null,null,null,null,null,"N/A","N/A"]
[null,null,null,null,null,null,null,null,null,null,null,"N/A","N/A"]
[null,null,null,null,null,null,null,null,null,null,null,"N/A","N/A"]
[null,null,null,null,null,null,null,null,null,null,null,"N/A","N/A"]
[null,null,null,null,null,null,null,null,null,null,null,"N/A","N/A"]
[]
[]
[null,null,null,null,null,null,null,null,null,null,null,1000000,{"$f":"IF(AND(ISNUMBER(SEARCH(\"Apartment\",$B$3))),\"N/A\",IF($B$3=\"House/Townhouse/Unit\",1000000,500000))","v":500000}]
[null,null,null,null,null,null,null,null,null,null,null,1000000,{"$f":"IF(AND(ISNUMBER(SEARCH(\"Apartment\",$B$3))),\"N/A\",IF($B$3=\"House/Townhouse/Unit\",1000000,500000))","v":500000}]
[null,null,null,null,null,null,null,null,null,null,null,750000,{"$f":"IF(AND(ISNUMBER(SEARCH(\"Apartment\",$B$3))),\"N/A\",500000)","v":500000}]
[null,null,null,null,null,null,null,null,null,null,null,750000,{"$f":"IF(AND(ISNUMBER(SEARCH(\"Apartment\",$B$3)),$D$2=\"Non Metro\"),\"N/A\",500000)","v":500000}]
[null,null,null,null,null,null,null,null,null,null,null,750000,"N/A"]
[null,null,null,null,null,null,null,null,null,null,null,"N/A","N/A"]
[null,null,null,null,null,null,null,null,null,null,null,"N/A","N/A"]
[null,null,null,null,null,null,null,null,null,null,null,"N/A","N/A"]
[null,null,null,null,null,null,null,null,null,null,null,"N/A","N/A"]
[null,null,null,null,null,null,null,null,null,null,null,"N/A","N/A"]
[null,null,null,null,null,null,null,null,null,null,null,"N/A","N/A"]
[null,null,null,null,null,null,null,null,null,null,null,"N/A","N/A"]
[null,null,null,null,null,null,null,null,null,null,null,"N/A","N/A"]
[null,null,null,null,null,null,null,null,null,null,null,"N/A","N/A"]
[null,null,null,null,null,null,null,null,null,null,null,"N/A","N/A"]
[null,null,null,null,null,null,null,null,null,null,null,"N/A","N/A"]
[null,null,null,null,null,null,null,null,null,null,null,"Quote","Quote"]
[null,null,null,null,null,null,null,null,null,null,null,"Quote","N/A"]
[null,null,null,null,null,null,null,null,null,null,null,"N/A","N/A"]
[null,null,null,null,null,null,null,null,null,null,null,"N/A","N/A"]
[null,null,null,null,null,null,null,null,null,null,null,"N/A","N/A"]
[null,null,null,null,null,null,null,null,null,null,null,"N/A","N/A"]
[null,null,null,null,null,null,null,null,null,null,null,"N/A","N/A"]
[null,null,null,null,null,null,null,null,null,null,null,"N/A","N/A"]
[null,null,null,null,null,null,null,null,null,null,null,"N/A","N/A"]

{"sheet":"Post Code data","index":1,"n_rows":2646,"n_cols":30,"rows_kept":2646,"cut":false,"hidden":true,"merged":[]}
["Postcode","Active/Retired","LMI Location","Ratings Location","Geographic Region","S&P Rating","La Trobe Risk Location","Origin rating","Genworth rating","Population ABS 2016","Avg Distance from Post Office","Extra Data","Exposure","BC Overwrite","BC Rating","BC Score Test",null,"Geographic Region","S&P","Latrobe","Origin ","ABS","Distance Po ","Mining",null,null,null,null,null,{"$f":"_xlfn._xlws.SORT(_xlfn._xlws.FILTER(A:A,ISNUMBER(SEARCH('Post Code Calculator'!B2,A:A)),\"not found\"))","v":800}]
[800,"A","Metro","Metro","701 NT  Metro - Darwin","Metro","A Metro",1,"High Density",6464,0.5,null,null,null,{"$f":"IF(ISBLANK(N2),IF(AND(H2<>\"\",IF(I2=\"High Density\",\"High Density\",IF(AND(P2<=45,P2>0),\"Refer to Distribution Partner\",IF(AND(P2<=55,P2>45),\"Regional\",IF(AND(P2>55,P2<=70),\"Non Metro\",IF(F2=\"Nonmetro\",\"Non Metro\",IF(P2>70,\"Metro\",\"\"))))))=\"Refer to Distribution Partner\"),\"Regional\",IF(I2=\"High Density\",\"High Density\",IF(AND(P2<=45,P2>0),\"Refer to Distribution Partner\",IF(AND(P2<=55,P2>45),\"Regional\",IF(AND(P2>55,P2<=70),\"Non Metro\",IF(F2=\"Nonmetro\",\"Non Metro\",IF(P2>70,\"Metro\",\"\"))))))),N2)","v":"High Density"},{"$f":"(R2/$AB$3*$AA$3+S2/$AB$4*$AA$4+T2/$AB$5*$AA$5+U2/$AB$6*$AA$6+V2/$AB$7*$AA$7+W2/$AB$8*$AA$8+X2/$AB$9*$AA$9)*100","v":86.666666666666671},null,{"$f":"IF(ISNUMBER(SEARCH(\"Metro\",E2)),3,IF(ISNUMBER(SEARCH(\"Rural\",E2)),2,1))","v":3},{"$f":"IF(ISNUMBER(FIND(\"Metro\",F2)),3,IF(ISNUMBER(FIND(\"Nonmetro\",F2)),2,3))","v":3},{"$f":"IF(G2=\"A Metro\",3,IF(G2=\"B Regional\",2,IF(G2=\"C Pop > 7,000\",1,IF(G2=\"D Pop > 2,000\",1,0))))","v":3},{"$f":"IF(H2=1,3,IF(H2=2,2,IF(H2=3,1,0)))","v":3},{"$f":"IF(J2>=100000,3,IF(AND(J2>=10000,J2<100000),2,IF(AND(J2>=5000,J2<10000),1,0)))","v":1},{"$f":"IF(AND(K2>=0.1,K2<25),3,IF(AND(K2>=25,K2<50),2,IF(AND(K2>=50,K2<150),1,0)))","v":3},{"$f":"IF(L2=\"\",3,0)","v":3},null,null,null,null,null,810]
[810,"A","Metro","Metro","701 NT  Metro - Darwin","Metro","A Metro",1,null,33302,10.1,null,null,null,"Metro",93.333333333333329,null,3,3,3,3,2,3,3,null,null,0.05,3,null,812]
[812,"A","Metro","Metro","701 NT  Metro - Darwin","Metro","A Metro",1,null,18873,10.5,null,null,null,"Metro",93.333333333333329,null,3,3,3,3,2,3,3,null,null,0.2,3,null,820]
[820,"A","Metro","Metro","701 NT  Metro - Darwin","Metro","A Metro",1,null,19447,3.2,null,null,null,"Metro",93.333333333333329,null,3,3,3,3,2,3,3,null,null,0.2,3,null,822]
[822,"A","Regional","Regional","702 NT  Rural - Outback","Nonmetro","B Regional",null,null,25560,38.1,null,null,null,"Regional",55.000000000000007,null,2,2,2,0,2,2,3,null,null,0.2,3,null,828]
[828,"A","Metro","Metro","701 NT  Metro - Darwin","Metro","A Metro",1,null,1201,11.1,null,null,null,"Metro",80,null,3,3,3,3,0,3,3,null,null,0.2,3,null,829]
[829,"A","Metro","Metro","701 NT  Metro - Darwin","Metro","A Metro",1,null,1839,11.1,null,null,null,"Metro",80,null,3,3,3,3,0,3,3,null,null,0.1,3,null,830]
[830,"A","Metro","Metro","701 NT  Metro - Darwin","Metro","A Metro",1,null,18207,15.4,null,null,null,"Metro",93.333333333333329,null,3,3,3,3,2,3,3,null,null,0.05,3,null,832]
[832,"A","Metro","Metro","701 NT  Metro - Darwin","Metro","A Metro",1,null,15570,17.399999999999999,null,null,null,"Metro",93.333333333333329,null,3,3,3,3,2,3,3,null,null,{"$f":"SUM(AA3:AA9)","v":1},{"$f":"SUM(AB3:AB9)","v":21},null,834]
[834,"A","Regional","Regional","Unknown","Nonmetro","B Regional",null,null,1836,23.1,null,null,null,"Refer to Distribution Partner",43.333333333333329,null,1,2,2,0,0,3,3,null,null,null,null,null,835]
[835,"A","Regional","Regional","701 NT  Metro - Darwin","Nonmetro","B Regional",2,null,5132,23.6,null,null,null,"Non Metro",66.666666666666657,null,3,2,2,2,1,3,3,null,null,null,null,null,836]
[836,"A","Regional","Regional","701 NT  Metro - Darwin","Nonmetro","B Regional",2,null,7756,33,null,null,null,"Non Metro",63.333333333333329,null,3,2,2,2,1,2,3,null,null,null,null,null,837]
[837,"A","Other","Regional","701 NT  Metro - Darwin","Nonmetro","E Pop > 500",null,null,412,33,null,null,null,"Refer to Distribution Partner",30,null,3,2,0,0,0,2,3,null,null,null,null,null,838]
[838,"A","Other","Regional","701 NT  Metro - Darwin","Nonmetro","E Pop > 500",null,null,818,34.700000000000003,null,null,null,"Refer to Distribution Partner",30,null,3,2,0,0,0,2,3,null,null,null,null,null,839]
[839,"A","Other","Regional","Unknown","Nonmetro","F Pop <= 500",null,null,548,61,null,null,null,"Refer to Distribution Partner",23.333333333333332,null,1,2,0,0,0,1,3,null,null,null,null,null,840]
[840,"A","Other","Regional","702 NT  Rural - Outback","Nonmetro","E Pop > 500",null,null,363,61,"Mining",null,null,"Refer to Distribution Partner",20,null,2,2,0,0,0,1,0,null,null,null,null,null,841]
[841,"A","Other","Regional","701 NT  Metro - Darwin","Nonmetro","E Pop > 500",null,null,696,61,null,null,null,"Refer to Distribution Partner",26.666666666666668,null,3,2,0,0,0,1,3,null,null,null,null,null,845]
[845,"A","Other","Regional","702 NT  Rural - Outback","Nonmetro","F Pop <= 500",null,null,507,271.3,"Mining",null,null,"Refer to Distribution Partner",16.666666666666664,null,2,2,0,0,0,0,0,null,null,null,null,null,846]
[846,"A","Other","Regional","702 NT  Rural - Outback","Nonmetro","F Pop <= 500",null,null,353,271.3,null,null,null,"Refer to Distribution Partner",21.666666666666668,null,2,2,0,0,0,0,3,null,null,null,null,null,847]
[847,"A","Other","Regional","702 NT  Rural - Outback","Nonmetro","F Pop <= 500",null,null,358,271.3,"Mining",null,null,"Refer to Distribution Partner",16.666666666666664,null,2,2,0,0,0,0,0,null,null,null,null,null,850]
[850,"A","Other","Regional","702 NT  Rural - Outback","Nonmetro","C Pop > 7,000",3,null,8138,271.3,null,null,null,"Regional",41.666666666666664,null,2,2,1,1,1,0,3,null,null,null,null,null,852]
[852,"A","Other","Regional","702 NT  Rural - Outback","Nonmetro","C Pop > 7,000",null,null,8299,271.3,null,null,null,"Refer to Distribution Partner",35,null,2,2,1,0,1,0,3,null,null,null,null,null,853]
[853,"A","Other","Regional","702 NT  Rural - Outback","Nonmetro","E Pop > 500",null,null,857,271.3,null,null,null,"Refer to Distribution Partner",21.666666666666668,null,2,2,0,0,0,0,3,null,null,null,null,null,854]
[854,"A","Other","Regional","702 NT  Rural - Outback","Nonmetro","E Pop > 500",null,null,871,271.3,"Mining",null,null,"Refer to Distribution Partner",16.666666666666664,null,2,2,0,0,0,0,0,null,null,null,null,null,860]
[860,"A","Other","Regional","702 NT  Rural - Outback","Nonmetro","D Pop > 2,000",null,null,2991,875.8,null,null,null,"Refer to Distribution Partner",28.333333333333332,null,2,2,1,0,0,0,3,null,null,null,null,null,862]
[862,"A","Other","Regional","702 NT  Rural - Outback","Nonmetro","E Pop > 500",null,null,765,875.8,null,null,null,"Refer to Distribution Partner",21.666666666666668,null,2,2,0,0,0,0,3,null,null,null,null,null,870]
[870,"A","Regional","Regional","702 NT  Rural - Outback","Nonmetro","B Regional",2,null,19628,1290.4000000000001,null,null,null,"Non Metro",61.666666666666671,null,2,2,2,2,2,0,3,null,null,null,null,null,872]
[872,"A","Other","Regional","702 NT  Rural - Outback","Nonmetro","C Pop > 7,000",null,null,15469,1290.4000000000001,null,null,null,"Refer to Distribution Partner",41.666666666666671,null,2,2,1,0,2,0,3,null,null,null,null,null,874]
[874,"A","Other","Regional","Unknown","Nonmetro","F Pop <= 500",null,null,553,1290.4000000000001,null,null,null,"Refer to Distribution Partner",20,null,1,2,0,0,0,0,3,null,null,null,null,null,875]
[875,"A","Other","Regional","Unknown","Nonmetro","D Pop > 2,000",null,null,2371,1288.5,null,null,null,"Refer to Distribution Partner",26.666666666666668,null,1,2,1,0,0,0,3,null,null,null,null,null,880]
[880,"A","Other","Regional","702 NT  Rural - Outback","Nonmetro","D Pop > 2,000",null,null,5214,1288.5,"Mining",null,null,"Refer to Distribution Partner",30,null,2,2,1,0,1,0,0,null,null,null,null,null,885]
[885,"A","Other","Regional","702 NT  Rural - Outback","Nonmetro","E Pop > 500",null,null,873,1288.5,"Mining",null,null,"Refer to Distribution Partner",16.666666666666664,null,2,2,0,0,0,0,0,null,null,null,null,null,886]
[886,"A","Other","Regional","702 NT  Rural - Outback","Nonmetro","E Pop > 500",null,null,1081,1288.5,"Mining",null,null,"Refer to Distribution Partner",16.666666666666664,null,2,2,0,0,0,0,0,null,null,null,null,null,2000]
[2000,"A","Metro","Inner City","117 NSW Metro - CBD & Inner South","Inner city","A Metro",1,"High Density",27411,1.2,null,null,null,"High Density",93.333333333333329,null,3,3,3,3,2,3,3,null,null,null,null,null,2006]
[2006,"A","Metro","Metro","117 NSW Metro - CBD & Inner South","Metro","A Metro",1,null,1259,0,null,null,null,"Non Metro",70,null,3,3,3,3,0,0,3,null,null,null,null,null,2007]
[2007,"A","Metro","Metro","117 NSW Metro - CBD & Inner South","Metro","A Metro",1,null,8845,1.8,null,null,null,"Metro",86.666666666666671,null,3,3,3,3,1,3,3,null,null,null,null,null,2008]
[2008,"A","Metro","Metro","117 NSW Metro - CBD & Inner South","Metro","A Metro",1,null,11712,2.7,null,null,null,"Metro",93.333333333333329,null,3,3,3,3,2,3,3,null,null,null,null,null,2009]
[2009,"A","Metro","Metro","117 NSW Metro - CBD & Inner South","Metro","A Metro",1,null,12813,1.4,null,null,null,"Metro",93.333333333333329,null,3,3,3,3,2,3,3,null,null,null,null,null,2010]
[2010,"A","Metro","Metro","117 NSW Metro - CBD & Inner South","Metro","A Metro",1,null,27734,1.9,null,null,null,"Metro",93.333333333333329,null,3,3,3,3,2,3,3,null,null,null,null,null,2011]
[2011,"A","Metro","Metro","117 NSW Metro - CBD & Inner South","Metro","A Metro",1,null,21196,1.7,null,null,null,"Metro",93.333333333333329,null,3,3,3,3,2,3,3,null,null,null,null,null,2015]
[2015,"A","Metro","Metro","117 NSW Metro - CBD & Inner South","Metro","A Metro",1,null,9918,4.3,null,null,null,"Metro",86.666666666666671,null,3,3,3,3,1,3,3,null,null,null,null,null,2016]
[2016,"A","Metro","Metro","117 NSW Metro - CBD & Inner South","Metro","A Metro",1,null,13213,2.9,null,null,null,"Metro",93.333333333333329,null,3,3,3,3,2,3,3,null,null,null,null,null,2017]
[2017,"A","Metro","Metro","117 NSW Metro - CBD & Inner South","Metro","A Metro",1,"High Density",24695,3.9,null,null,null,"High Density",93.333333333333329,null,3,3,3,3,2,3,3,null,null,null,null,null,2018]
[2018,"A","Metro","Metro","117 NSW Metro - CBD & Inner South","Metro","A Metro",1,null,17028,6.1,null,null,null,"Metro",93.333333333333329,null,3,3,3,3,2,3,3,null,null,null,null,null,2019]
[2019,"A","Metro","Metro","117 NSW Metro - CBD & Inner South","Metro","A Metro",1,null,10838,9,null,null,null,"Metro",93.333333333333329,null,3,3,3,3,2,3,3,null,null,null,null,null,2020]
[2020,"A","Metro","Metro","117 NSW Metro - CBD & Inner South","Metro","A Metro",1,null,14772,7,null,null,null,"Metro",93.333333333333329,null,3,3,3,3,2,3,3,null,null,null,null,null,2021]
[2021,"A","Metro","Metro","118 NSW Metro - Bondi","Metro","A Metro",1,null,15313,2.9,null,null,null,"Metro",93.333333333333329,null,3,3,3,3,2,3,3,null,null,null,null,null,2022]
[2022,"A","Metro","Metro","118 NSW Metro - Bondi","Metro","A Metro",1,null,12507,4.8,null,null,null,"Metro",93.333333333333329,null,3,3,3,3,2,3,3,null,null,null,null,null,2023]
[2023,"A","Metro","Metro","118 NSW Metro - Bondi","Metro","A Metro",1,null,10716,5.0999999999999996,null,null,null,"Metro",93.333333333333329,null,3,3,3,3,2,3,3,null,null,null,null,null,2024]
[2024,"A","Metro","Metro","118 NSW Metro - Bondi","Metro","A Metro",1,null,11073,6.3,null,null,null,"Metro",93.333333333333329,null,3,3,3,3,2,3,3,null,null,null,null,null,2025]
[2025,"A","Metro","Metro","118 NSW Metro - Bondi","Metro","A Metro",1,null,7405,4,null,null,null,"Metro",86.666666666666671,null,3,3,3,3,1,3,3,null,null,null,null,null,2026]
[2026,"A","Metro","Metro","118 NSW Metro - Bondi","Metro","A Metro",1,null,32490,6.4,null,null,null,"Metro",93.333333333333329,null,3,3,3,3,2,3,3,null,null,null,null,null,2027]
[2027,"A","Metro","Metro","118 NSW Metro - Bondi","Metro","A Metro",1,null,8195,3.3,null,null,null,"Metro",86.666666666666671,null,3,3,3,3,1,3,3,null,null,null,null,null,2028]
[2028,"A","Metro","Metro","118 NSW Metro - Bondi","Metro","A Metro",1,null,4642,3.5,null,null,null,"Metro",80,null,3,3,3,3,0,3,3,null,null,null,null,null,2029]
[2029,"A","Metro","Metro","118 NSW Metro - Bondi","Metro","A Metro",1,null,9961,6.1,null,null,null,"Metro",86.666666666666671,null,3,3,3,3,1,3,3,null,null,null,null,null,2030]
[2030,"A","Metro","Metro","118 NSW Metro - Bondi","Metro","A Metro",1,null,14079,6.8,null,null,null,"Metro",93.333333333333329,null,3,3,3,3,2,3,3,null,null,null,null,null,2031]
[2031,"A","Metro","Metro","118 NSW Metro - Bondi","Metro","A Metro",1,null,34726,6.3,null,null,null,"Metro",93.333333333333329,null,3,3,3,3,2,3,3,null,null,null,null,null,2032]
[2032,"A","Metro","Metro","118 NSW Metro - Bondi","Metro","A Metro",1,null,16689,6.8,null,null,null,"Metro",93.333333333333329,null,3,3,3,3,2,3,3,null,null,null,null,null,2033]
[2033,"A","Metro","Metro","118 NSW Metro - Bondi","Metro","A Metro",1,null,14079,5.0999999999999996,null,null,null,"Metro",93.333333333333329,null,3,3,3,3,2,3,3,null,null,null,null,null,2034]
[2034,"A","Metro","Metro","118 NSW Metro - Bondi","Metro","A Metro",1,null,20713,7.8,null,null,null,"Metro",93.333333333333329,null,3,3,3,3,2,3,3,null,null,null,null,null,2035]
[2035,"A","Metro","Metro","118 NSW Metro - Bondi","Metro","A Metro",1,null,34490,9.1,null,null,null,"Metro",93.333333333333329,null,3,3,3,3,2,3,3,null,null,null,null,null,2036]
[2036,"A","Metro","Metro","118 NSW Metro - Bondi","Metro","A Metro",1,null,30407,11.3,null,null,null,"Metro",93.333333333333329,null,3,3,3,3,2,3,3,null,null,null,null,null,2037]
[2037,"A","Metro","Metro","117 NSW Metro - CBD & Inner South","Metro","A Metro",1,null,16115,2.6,null,null,null,"Metro",93.333333333333329,null,3,3,3,3,2,3,3,null,null,null,null,null,2038]
[2038,"A","Metro","Metro","120 NSW Metro - Homebush","Metro","A Metro",1,null,9451,3.7,null,null,null,"Metro",86.666666666666671,null,3,3,3,3,1,3,3,null,null,null,null,null,2039]
[2039,"A","Metro","Metro","120 NSW Metro - Homebush","Metro","A Metro",1,null,8725,3.6,null,null,null,{"$f":"IF(ISBLANK(N66),IF(AND(H66<>\"\",IF(I66=\"High Density\",\"High Density\",IF(AND(P66<=45,P66>0),\"Refer to Distribution Partner\",IF(AND(P66<=55,P66>45),\"Regional\",IF(AND(P66>55,P66<=70),\"Non Metro\",IF(F66=\"Nonmetro\",\"Non Metro\",IF(P66>70,\"Metro\",\"\"))))))=\"Refer to Distribution Partner\"),\"Regional\",IF(I66=\"High Density\",\"High Density\",IF(AND(P66<=45,P66>0),\"Refer to Distribution Partner\",IF(AND(P66<=55,P66>45),\"Regional\",IF(AND(P66>55,P66<=70),\"Non Metro\",IF(F66=\"Nonmetro\",\"Non Metro\",IF(P66>70,\"Metro\",\"\"))))))),N66)","v":"Metro"},{"$f":"(R66/$AB$3*$AA$3+S66/$AB$4*$AA$4+T66/$AB$5*$AA$5+U66/$AB$6*$AA$6+V66/$AB$7*$AA$7+W66/$AB$8*$AA$8+X66/$AB$9*$AA$9)*100","v":86.666666666666671},null,{"$f":"IF(ISNUMBER(SEARCH(\"Metro\",E66)),3,IF(ISNUMBER(SEARCH(\"Rural\",E66)),2,1))","v":3},{"$f":"IF(ISNUMBER(FIND(\"Metro\",F66)),3,IF(ISNUMBER(FIND(\"Nonmetro\",F66)),2,3))","v":3},{"$f":"IF(G66=\"A Metro\",3,IF(G66=\"B Regional\",2,IF(G66=\"C Pop > 7,000\",1,IF(G66=\"D Pop > 2,000\",1,0))))","v":3},{"$f":"IF(H66=1,3,IF(H66=2,2,IF(H66=3,1,0)))","v":3},{"$f":"IF(J66>=100000,3,IF(AND(J66>=10000,J66<100000),2,IF(AND(J66>=5000,J66<10000),1,0)))","v":1},{"$f":"IF(AND(K66>=0.1,K66<25),3,IF(AND(K66>=25,K66<50),2,IF(AND(K66>=50,K66<150),1,0)))","v":3},{"$f":"IF(L66=\"\",3,0)","v":3},null,null,null,null,null,2040]
[2040,"A","Metro","Metro","120 NSW Metro - Homebush","Metro","A Metro",1,null,22242,5.2,null,null,null,"Metro",93.333333333333329,null,3,3,3,3,2,3,3,null,null,null,null,null,2041]
[2041,"A","Metro","Metro","120 NSW Metro - Homebush","Metro","A Metro",1,null,15690,2.8,null,null,null,"Metro",93.333333333333329,null,3,3,3,3,2,3,3,null,null,null,null,null,2042]
[2042,"A","Metro","Metro","117 NSW Metro - CBD & Inner South","Metro","A Metro",1,null,19129,4.5,null,null,null,"Metro",93.333333333333329,null,3,3,3,3,2,3,3,null,null,null,null,null,2043]
[2043,"A","Metro","Metro","117 NSW Metro - CBD & Inner South","Metro","A Metro",1,null,8014,4.5,null,null,null,"Metro",86.666666666666671,null,3,3,3,3,1,3,3,null,null,null,null,null,2044]
[2044,"A","Metro","Metro","117 NSW Metro - CBD & Inner South","Metro","A Metro",1,null,7846,6.8,null,null,null,"Metro",86.666666666666671,null,3,3,3,3,1,3,3,null,null,null,null,null,2045]
[2045,"A","Metro","Metro","120 NSW Metro - Homebush","Metro","A Metro",1,null,6457,6.4,null,null,null,"Metro",86.666666666666671,null,3,3,3,3,1,3,3,null,null,null,null,null,2046]
[2046,"A","Metro","Metro","120 NSW Metro - Homebush","Metro","A Metro",1,null,26822,7.2,null,null,null,"Metro",93.333333333333329,null,3,3,3,3,2,3,3,null,null,null,null,null,2047]
[2047,"A","Metro","Metro","120 NSW Metro - Homebush","Metro","A Metro",1,null,11950,5.4,null,null,null,"Metro",93.333333333333329,null,3,3,3,3,2,3,3,null,null,null,null,null,2048]
[2048,"A","Metro","Metro","117 NSW Metro - CBD & Inner South","Metro","A Metro",1,null,7938,4.7,null,null,null,"Metro",86.666666666666671,null,3,3,3,3,1,3,3,null,null,null,null,null,2049]
[2049,"A","Metro","Metro","117 NSW Metro - CBD & Inner South","Metro","A Metro",1,null,11282,6,null,null,null,"Metro",93.333333333333329,null,3,3,3,3,2,3,3,null,null,null,null,null,2050]
[2050,"A","Metro","Metro","117 NSW Metro - CBD & Inner South","Metro","A Metro",1,null,8963,4,null,null,null,"Metro",86.666666666666671,null,3,3,3,3,1,3,3,null,null,null,null,null,2060]
[2060,"A","Metro","Metro","121 NSW Metro - Hornsby","Metro","A Metro",1,null,13988,3.3,null,null,null,"Metro",93.333333333333329,null,3,3,3,3,2,3,3,null,null,null,null,null,2061]
[2061,"A","Metro","Metro","121 NSW Metro - Hornsby","Metro","A Metro",1,null,5943,2.4,null,null,null,"Metro",86.666666666666671,null,3,3,3,3,1,3,3,null,null,null,null,null,2062]
[2062,"A","Metro","Metro","121 NSW Metro - Hornsby","Metro","A Metro",1,null,7006,5.2,null,null,null,"Metro",86.666666666666671,null,3,3,3,3,1,3,3,null,null,null,null,null,2063]
[2063,"A","Metro","Metro","121 NSW Metro - Hornsby","Metro","A Metro",1,null,6347,6.4,null,null,null,"Metro",86.666666666666671,null,3,3,3,3,1,3,3,null,null,null,null,null,2064]
[2064,"A","Metro","Metro","121 NSW Metro - Hornsby","Metro","A Metro",1,null,9523,7.1,null,null,null,"Metro",86.666666666666671,null,3,3,3,3,1,3,3,null,null,null,null,null,2065]
[2065,"A","Metro","Metro","121 NSW Metro - Hornsby","Metro","A Metro",1,null,30119,5.0999999999999996,null,null,null,"Metro",93.333333333333329,null,3,3,3,3,2,3,3,null,null,null,null,null,2066]
[2066,"A","Metro","Metro","121 NSW Metro - Hornsby","Metro","A Metro",1,null,31626,7.5,null,null,null,"Metro",93.333333333333329,null,3,3,3,3,2,3,3,null,null,null,null,null,2067]
[2067,"A","Metro","Metro","121 NSW Metro - Hornsby","Metro","A Metro",1,null,26403,8.6,null,null,null,"Metro",93.333333333333329,null,3,3,3,3,2,3,3,null,null,null,null,null,2068]
[2068,"A","Metro","Metro","121 NSW Metro - Hornsby","Metro","A Metro",1,null,16813,7.5,null,null,null,"Metro",93.333333333333329,null,3,3,3,3,2,3,3,null,null,null,null,null,2069]
[2069,"A","Metro","Metro","121 NSW Metro - Hornsby","Metro","A Metro",1,null,14253,9.6999999999999993,null,null,null,"Metro",93.333333333333329,null,3,3,3,3,2,3,3,null,null,null,null,null,2070]
[2070,"A","Metro","Metro","121 NSW Metro - Hornsby","Metro","A Metro",1,null,13505,11,null,null,null,"Metro",93.333333333333329,null,3,3,3,3,2,3,3,null,null,null,null,null,2071]
[2071,"A","Metro","Metro","121 NSW Metro - Hornsby","Metro","A Metro",1,null,13545,12.4,null,null,null,"Metro",93.333333333333329,null,3,3,3,3,2,3,3,null,null,null,null,null,2072]
[2072,"A","Metro","Metro","121 NSW Metro - Hornsby","Metro","A Metro",1,null,7668,13.6,null,null,null,"Metro",86.666666666666671,null,3,3,3,3,1,3,3,null,null,null,null,null,2073]
[2073,"A","Metro","Metro","121 NSW Metro - Hornsby","Metro","A Metro",1,null,16352,15.1,null,null,null,"Metro",93.333333333333329,null,3,3,3,3,2,3,3,null,null,null,null,null,2074]
[2074,"A","Metro","Metro","121 NSW Metro - Hornsby","Metro","A Metro",1,null,22258,17.100000000000001,null,null,null,"Metro",93.333333333333329,null,3,3,3,3,2,3,3,null,null,null,null,null,2075]
[2075,"A","Metro","Metro","121 NSW Metro - Hornsby","Metro","A Metro",1,null,20451,16.399999999999999,null,null,null,"Metro",93.333333333333329,null,3,3,3,3,2,3,3,null,null,null,null,null,2076]
[2076,"A","Metro","Metro","121 NSW Metro - Hornsby","Metro","A Metro",1,null,24648,18.899999999999999,null,null,null,"Metro",93.333333333333329,null,3,3,3,3,2,3,3,null,null,null,null,null,2077]
[2077,"A","Metro","Metro","121 NSW Metro - Hornsby","Metro","A Metro",1,null,37791,22.5,null,null,null,"Metro",93.333333333333329,null,3,3,3,3,2,3,3,null,null,null,null,null,2079]
[2079,"A","Metro","Metro","121 NSW Metro - Hornsby","Metro","A Metro",1,null,7095,23.9,null,null,null,"Metro",86.666666666666671,null,3,3,3,3,1,3,3,null,null,null,null,null,2080]
[2080,"A","Metro","Metro","121 NSW Metro - Hornsby","Metro","A Metro",1,null,1708,24.5,null,null,null,"Metro",80,null,3,3,3,3,0,3,3,null,null,null,null,null,2081]
[2081,"A","Metro","Metro","121 NSW Metro - Hornsby","Metro","A Metro",1,null,5369,28,null,null,null,"Metro",83.333333333333343,null,3,3,3,3,1,2,3,null,null,null,null,null,2082]
[2082,"A","Metro","Metro","121 NSW Metro - Hornsby","Metro","A Metro",1,null,5397,30.2,null,null,null,"Metro",83.333333333333343,null,3,3,3,3,1,2,3,null,null,null,null,null,2083]
[2083,"A","Metro","Metro","121 NSW Metro - Hornsby","Metro","A Metro",1,null,1519,37.799999999999997,null,null,null,"Metro",76.666666666666671,null,3,3,3,3,0,2,3,null,null,null,null,null,2084]
[2084,"A","Metro","Metro","122 NSW Metro - North Shore","Metro","A Metro",1,null,3625,22.4,null,null,null,"Metro",80,null,3,3,3,3,0,3,3,null,null,null,null,null,2085]
[2085,"A","Metro","Metro","122 NSW Metro - North Shore","Metro","A Metro",1,null,11624,16.5,null,null,null,"Metro",93.333333333333329,null,3,3,3,3,2,3,3,null,null,null,null,null,2086]
[2086,"A","Metro","Metro","122 NSW Metro - North Shore","Metro","A Metro",1,null,13414,13.5,null,null,null,"Metro",93.333333333333329,null,3,3,3,3,2,3,3,null,null,null,null,null,2087]
[2087,"A","Metro","Metro","122 NSW Metro - North Shore","Metro","A Metro",1,null,12798,11.8,null,null,null,"Metro",93.333333333333329,null,3,3,3,3,2,3,3,null,null,null,null,null,2088]
[2088,"A","Metro","Metro","121 NSW Metro - Hornsby","Metro","A Metro",1,null,28475,5.5,null,null,null,"Metro",93.333333333333329,null,3,3,3,3,2,3,3,null,null,null,null,null,2089]
[2089,"A","Metro","Metro","121 NSW Metro - Hornsby","Metro","A Metro",1,null,11918,3.8,null,null,null,"Metro",93.333333333333329,null,3,3,3,3,2,3,3,null,null,null,null,null,2090]
[2090,"A","Metro","Metro","121 NSW Metro - Hornsby","Metro","A Metro",1,null,13724,4.7,null,null,null,"Metro",93.333333333333329,null,3,3,3,3,2,3,3,null,null,null,null,null,2092]
[2092,"A","Metro","Metro","122 NSW Metro - North Shore","Metro","A Metro",1,null,7139,8.8000000000000007,null,null,null,"Metro",86.666666666666671,null,3,3,3,3,1,3,3,null,null,null,null,null,2093]
[2093,"A","Metro","Metro","122 NSW Metro - North Shore","Metro","A Metro",1,null,22873,10.199999999999999,null,null,null,"Metro",93.333333333333329,null,3,3,3,3,2,3,3,null,null,null,null,null,2094]
[2094,"A","Metro","Metro","122 NSW Metro - North Shore","Metro","A Metro",1,null,5840,10.199999999999999,null,null,null,"Metro",86.666666666666671,null,3,3,3,3,1,3,3,null,null,null,null,null,2095]
[2095,"A","Metro","Metro","122 NSW Metro - North Shore","Metro","A Metro",1,null,15866,10.8,null,null,null,"Metro",93.333333333333329,null,3,3,3,3,2,3,3,null,null,null,null,null,2096]
[2096,"A","Metro","Metro","122 NSW Metro - North Shore","Metro","A Metro",1,null,14657,12.5,null,null,null,"Metro",93.333333333333329,null,3,3,3,3,2,3,3,null,null,null,null,null,2097]
[2097,"A","Metro","Metro","122 NSW Metro - North Shore","Metro","A Metro",1,null,15529,17.5,null,null,null,"Metro",93.333333333333329,null,3,3,3,3,2,3,3,null,null,null,null,null,2099]
[2099,"A","Metro","Metro","122 NSW Metro - North Shore","Metro","A Metro",1,null,39925,15,null,null,null,"Metro",93.333333333333329,null,3,3,3,3,2,3,3,null,null,null,null,null,2100]
[2100,"A","Metro","Metro","122 NSW Metro - North Shore","Metro","A Metro",1,null,20911,13.1,null,null,null,"Metro",93.333333333333329,null,3,3,3,3,2,3,3,null,null,null,null,null,2101]
[2101,"A","Metro","Metro","122 NSW Metro - North Shore","Metro","A Metro",1,null,19395,19.8,null,null,null,"Metro",93.333333333333329,null,3,3,3,3,2,3,3,null,null,null,null,null,2102]
[2102,"A","Metro","Metro","122 NSW Metro - North Shore","Metro","A Metro",1,null,7501,21.6,null,null,null,"Metro",86.666666666666671,null,3,3,3,3,1,3,3,null,null,null,null,null,2103]
[2103,"A","Metro","Metro","122 NSW Metro - North Shore","Metro","A Metro",1,null,10670,23.3,null,null,null,"Metro",93.333333333333329,null,3,3,3,3,2,3,3,null,null,null,null,null,2104]
[2104,"A","Metro","Metro","122 NSW Metro - North Shore","Metro","A Metro",1,null,3620,24.3,null,null,null,"Metro",80,null,3,3,3,3,0,3,3,null,null,null,null,null,2105]
[2105,"A","Metro","Metro","122 NSW Metro - North Shore","Metro","A Metro",1,null,1848,25.8,null,null,null,"Metro",76.666666666666671,null,3,3,3,3,0,2,3,null,null,null,null,null,2106]
[2106,"A","Metro","Metro","122 NSW Metro - North Shore","Metro","A Metro",1,null,9301,25.5,null,null,null,"Metro",83.333333333333343,null,3,3,3,3,1,2,3,null,null,null,null,null,2107]
[2107,"A","Metro","Metro","122 NSW Metro - North Shore","Metro","A Metro",1,null,14669,28.5,null,null,null,"Metro",90,null,3,3,3,3,2,2,3,null,null,null,null,null,2108]
[2108,"A","Metro","Metro","122 NSW Metro - North Shore","Metro","A Metro",1,null,1673,31.3,null,null,null,"Metro",76.666666666666671,null,3,3,3,3,0,2,3,null,null,null,null,null,2110]
[2110,"A","Metro","Metro","126 NSW Metro - Ryde","Metro","A Metro",1,null,10343,7,null,null,null,"Metro",93.333333333333329,null,3,3,3,3,2,3,3,null,null,null,null,null,2111]
[2111,"A","Metro","Metro","126 NSW Metro - Ryde","Metro","A Metro",1,null,14412,8.6999999999999993,null,null,null,"Metro",93.333333333333329,null,3,3,3,3,2,3,3,null,null,null,null,null,2112]
[2112,"A","Metro","Metro","126 NSW Metro - Ryde","Metro","A Metro",1,null,32852,11.3,null,null,null,"Metro",93.333333333333329,null,3,3,3,3,2,3,3,null,null,null,null,null,2113]
[2113,"A","Metro","Metro","126 NSW Metro - Ryde","Metro","A Metro",1,null,18371,11.9,null,null,null,"Metro",93.333333333333329,null,3,3,3,3,2,3,3,null,null,null,null,null,2114]
[2114,"A","Metro","Metro","126 NSW Metro - Ryde","Metro","A Metro",1,null,24057,13.4,null,null,null,"Metro",93.333333333333329,null,3,3,3,3,2,3,3,null,null,null,null,null,2115]
[2115,"A","Metro","Metro","125 NSW Metro - Parramatta","Metro","A Metro",1,null,10737,15.2,null,null,null,"Metro",93.333333333333329,null,3,3,3,3,2,3,3,null,null,null,null,null,2116]
[2116,"A","Metro","Metro","125 NSW Metro - Parramatta","Metro","A Metro",1,null,6642,16.5,null,null,null,{"$f":"IF(ISBLANK(N130),IF(AND(H130<>\"\",IF(I130=\"High Density\",\"High Density\",IF(AND(P130<=45,P130>0),\"Refer to Distribution Partner\",IF(AND(P130<=55,P130>45),\"Regional\",IF(AND(P130>55,P130<=70),\"Non Metro\",IF(F130=\"Nonmetro\",\"Non Metro\",IF(P130>70,\"Metro\",\"\"))))))=\"Refer to Distribution Partner\"),\"Regional\",IF(I130=\"High Density\",\"High Density\",IF(AND(P130<=45,P130>0),\"Refer to Distribution Partner\",IF(AND(P130<=55,P130>45),\"Regional\",IF(AND(P130>55,P130<=70),\"Non Metro\",IF(F130=\"Nonmetro\",\"Non Metro\",IF(P130>70,\"Metro\",\"\"))))))),N130)","v":"Metro"},{"$f":"(R130/$AB$3*$AA$3+S130/$AB$4*$AA$4+T130/$AB$5*$AA$5+U130/$AB$6*$AA$6+V130/$AB$7*$AA$7+W130/$AB$8*$AA$8+X130/$AB$9*$AA$9)*100","v":86.666666666666671},null,{"$f":"IF(ISNUMBER(SEARCH(\"Metro\",E130)),3,IF(ISNUMBER(SEARCH(\"Rural\",E130)),2,1))","v":3},{"$f":"IF(ISNUMBER(FIND(\"Metro\",F130)),3,IF(ISNUMBER(FIND(\"Nonmetro\",F130)),2,3))","v":3},{"$f":"IF(G130=\"A Metro\",3,IF(G130=\"B Regional\",2,IF(G130=\"C Pop > 7,000\",1,IF(G130=\"D Pop > 2,000\",1,0))))","v":3},{"$f":"IF(H130=1,3,IF(H130=2,2,IF(H130=3,1,0)))","v":3},{"$f":"IF(J130>=100000,3,IF(AND(J130>=10000,J130<100000),2,IF(AND(J130>=5000,J130<10000),1,0)))","v":1},{"$f":"IF(AND(K130>=0.1,K130<25),3,IF(AND(K130>=25,K130<50),2,IF(AND(K130>=50,K130<150),1,0)))","v":3},{"$f":"IF(L130=\"\",3,0)","v":3},null,null,null,null,null,2117]
[2117,"A","Metro","Metro","125 NSW Metro - Parramatta","Metro","A Metro",1,null,21285,17.399999999999999,null,null,null,"Metro",93.333333333333329,null,3,3,3,3,2,3,3,null,null,null,null,null,2118]
[2118,"A","Metro","Metro","125 NSW Metro - Parramatta","Metro","A Metro",1,null,24341,18.100000000000001,null,null,null,"Metro",93.333333333333329,null,3,3,3,3,2,3,3,null,null,null,null,null,2119]
[2119,"A","Metro","Metro","126 NSW Metro - Ryde","Metro","A Metro",1,null,11643,18.7,null,null,null,"Metro",93.333333333333329,null,3,3,3,3,2,3,3,null,null,null,null,null,2120]
[2120,"A","Metro","Metro","121 NSW Metro - Hornsby","Metro","A Metro",1,null,20208,20,null,null,null,"Metro",93.333333333333329,null,3,3,3,3,2,3,3,null,null,null,null,null,2121]
[2121,"A","Metro","Metro","126 NSW Metro - Ryde","Metro","A Metro",1,null,28214,16.2,null,null,null,"Metro",93.333333333333329,null,3,3,3,3,2,3,3,null,null,null,null,null,2122]
[2122,"A","Metro","Metro","126 NSW Metro - Ryde","Metro","A Metro",1,null,31160,14.5,null,null,null,"Metro",93.333333333333329,null,3,3,3,3,2,3,3,null,null,null,null,null,2125]
[2125,"A","Metro","Metro","115 NSW Metro - Hawkesbury","Metro","A Metro",1,null,16374,20.9,null,null,null,"Metro",93.333333333333329,null,3,3,3,3,2,3,3,null,null,null,null,null,2126]
[2126,"A","Metro","Metro","115 NSW Metro - Hawkesbury","Metro","A Metro",1,null,18765,22.1,null,null,null,"Metro",93.333333333333329,null,3,3,3,3,2,3,3,null,null,null,null,null,2127]
[2127,"A","Metro","Metro","125 NSW Metro - Parramatta","Metro","A Metro",1,"High Density",14532,14.7,null,null,null,"High Density",93.333333333333329,null,3,3,3,3,2,3,3,null,null,null,null,null,2128]
[2128,"A","Metro","Metro","125 NSW Metro - Parramatta","Metro","A Metro",1,null,4166,15.5,null,null,null,"Metro",80,null,3,3,3,3,0,3,3,null,null,null,null,null,2130]
[2130,"A","Metro","Metro","120 NSW Metro - Homebush","Metro","A Metro",1,null,7311,7.1,null,null,null,"Metro",86.666666666666671,null,3,3,3,3,1,3,3,null,null,null,null,null,2131]
[2131,"A","Metro","Metro","120 NSW Metro - Homebush","Metro","A Metro",1,null,23841,8,null,null,null,"Metro",93.333333333333329,null,3,3,3,3,2,3,3,null,null,null,null,null,2132]
[2132,"A","Metro","Metro","120 NSW Metro - Homebush","Metro","A Metro",1,null,10612,8.6999999999999993,null,null,null,"Metro",93.333333333333329,null,3,3,3,3,2,3,3,null,null,null,null,null,2133]
[2133,"A","Metro","Metro","120 NSW Metro - Homebush","Metro","A Metro",1,null,11012,10.199999999999999,null,null,null,"Metro",93.333333333333329,null,3,3,3,3,2,3,3,null,null,null,null,null,2134]
[2134,"A","Metro","Metro","120 NSW Metro - Homebush","Metro","A Metro",1,null,16033,9.8000000000000007,null,null,null,"Metro",93.333333333333329,null,3,3,3,3,2,3,3,null,null,null,null,null,2135]
[2135,"A","Metro","Metro","120 NSW Metro - Homebush","Metro","A Metro",1,null,25251,11.7,null,null,null,"Metro",93.333333333333329,null,3,3,3,3,2,3,3,null,null,null,null,null,2136]
[2136,"A","Metro","Metro","120 NSW Metro - Homebush","Metro","A Metro",1,null,7364,11.4,null,null,null,"Metro",86.666666666666671,null,3,3,3,3,1,3,3,null,null,null,null,null,2137]
[2137,"A","Metro","Metro","120 NSW Metro - Homebush","Metro","A Metro",1,null,26507,9.6999999999999993,null,null,null,"Metro",93.333333333333329,null,3,3,3,3,2,3,3,null,null,null,null,null,2138]
[2138,"A","Metro","Metro","120 NSW Metro - Homebush","Metro","A Metro",1,null,20023,12,null,null,null,"Metro",93.333333333333329,null,3,3,3,3,2,3,3,null,null,null,null,null,2140]
[2140,"A","Metro","Metro","120 NSW Metro - Homebush","Metro","A Metro",1,null,16167,12.1,null,null,null,"Metro",93.333333333333329,null,3,3,3,3,2,3,3,null,null,null,null,null,2141]
[2141,"A","Metro","Metro","125 NSW Metro - Parramatta","Metro","A Metro",1,null,28675,15.3,null,null,null,"Metro",93.333333333333329,null,3,3,3,3,2,3,3,null,null,null,null,null,2142]
[2142,"A","Metro","Metro","125 NSW Metro - Parramatta","Metro","A Metro",1,null,26292,18.899999999999999,null,null,null,"Metro",93.333333333333329,null,3,3,3,3,2,3,3,null,null,null,null,null,2143]
[2143,"A","Metro","Metro","125 NSW Metro - Parramatta","Metro","A Metro",1,null,8921,16.899999999999999,null,null,null,"Metro",86.666666666666671,null,3,3,3,3,1,3,3,null,null,null,null,null,2144]
[2144,"A","Metro","Metro","125 NSW Metro - Parramatta","Metro","A Metro",1,null,37366,16.8,null,null,null,"Metro",93.333333333333329,null,3,3,3,3,2,3,3,null,null,null,null,null,2145]
[2145,"A","Metro","Metro","125 NSW Metro - Parramatta","Metro","A Metro",1,null,79211,24.1,null,null,null,"Metro",93.333333333333329,null,3,3,3,3,2,3,3,null,null,null,null,null,2146]
[2146,"A","Metro","Metro","125 NSW Metro - Parramatta","Metro","A Metro",1,null,17465,25.5,null,null,null,"Metro",90,null,3,3,3,3,2,2,3,null,null,null,null,null,2147]
[2147,"A","Metro","Metro","116 NSW Metro - Blacktown","Metro","A Metro",1,null,36341,27.7,null,null,null,"Metro",90,null,3,3,3,3,2,2,3,null,null,null,null,null,2148]
[2148,"A","Metro","Metro","116 NSW Metro - Blacktown","Metro","A Metro",1,null,63071,30.4,null,null,null,"Metro",90,null,3,3,3,3,2,2,3,null,null,null,null,null,2150]
[2150,"A","Metro","Metro","125 NSW Metro - Parramatta","Metro","A Metro",1,"High Density",31500,19.399999999999999,null,null,null,"High Density",93.333333333333329,null,3,3,3,3,2,3,3,null,null,null,null,null,2151]
[2151,"A","Metro","Metro","125 NSW Metro - Parramatta","Metro","A Metro",1,null,21306,20.100000000000001,null,null,null,"Metro",93.333333333333329,null,3,3,3,3,2,3,3,null,null,null,null,null,2152]
[2152,"A","Metro","Metro","125 NSW Metro - Parramatta","Metro","A Metro",1,null,11215,21.6,null,null,null,"Metro",93.333333333333329,null,3,3,3,3,2,3,3,null,null,null,null,null,2153]
[2153,"A","Metro","Metro","115 NSW Metro - Hawkesbury","Metro","A Metro",1,null,56562,24.9,null,null,null,"Metro",93.333333333333329,null,3,3,3,3,2,3,3,null,null,null,null,null,2154]
[2154,"A","Metro","Metro","115 NSW Metro - Hawkesbury","Metro","A Metro",1,null,39594,24.7,null,null,null,"Metro",93.333333333333329,null,3,3,3,3,2,3,3,null,null,null,null,null,2155]
[2155,"A","Metro","Metro","115 NSW Metro - Hawkesbury","Metro","A Metro",1,"High Density",55452,31,null,null,null,"High Density",90,null,3,3,3,3,2,2,3,null,null,null,null,null,2156]
[2156,"A","Metro","Metro","115 NSW Metro - Hawkesbury","Metro","A Metro",1,null,12942,29.2,null,null,null,"Metro",90,null,3,3,3,3,2,2,3,null,null,null,null,null,2157]
[2157,"A","Metro","Metro","115 NSW Metro - Hawkesbury","Metro","A Metro",1,null,3741,36.9,null,null,null,"Metro",76.666666666666671,null,3,3,3,3,0,2,3,null,null,null,null,null,2158]
[2158,"A","Metro","Metro","115 NSW Metro - Hawkesbury","Metro","A Metro",1,null,8575,26,null,null,null,"Metro",83.333333333333343,null,3,3,3,3,1,2,3,null,null,null,null,null,2159]
[2159,"A","Metro","Metro","115 NSW Metro - Hawkesbury","Metro","A Metro",1,null,4975,29.4,null,null,null,"Metro",76.666666666666671,null,3,3,3,3,0,2,3,null,null,null,null,null,2160]
[2160,"A","Metro","Metro","125 NSW Metro - Parramatta","Metro","A Metro",1,null,35973,21.1,null,null,null,"Metro",93.333333333333329,null,3,3,3,3,2,3,3,null,null,null,null,null,2161]
[2161,"A","Metro","Metro","125 NSW Metro - Parramatta","Metro","A Metro",1,null,31418,20.9,null,null,null,"Metro",93.333333333333329,null,3,3,3,3,2,3,3,null,null,null,null,null,2162]
[2162,"A","Metro","Metro","125 NSW Metro - Parramatta","Metro","A Metro",1,null,18622,19.100000000000001,null,null,null,"Metro",93.333333333333329,null,3,3,3,3,2,3,3,null,null,null,null,null,2163]
[2163,"A","Metro","Metro","125 NSW Metro - Parramatta","Metro","A Metro",1,null,9590,22.2,null,null,null,"Metro",86.666666666666671,null,3,3,3,3,1,3,3,null,null,null,null,null,2164]
[2164,"A","Metro","Metro","127 NSW Metro - Liverpool","Metro","A Metro",1,null,19624,26,null,null,null,"Metro",90,null,3,3,3,3,2,2,3,null,null,null,null,null,2165]
[2165,"A","Metro","Metro","127 NSW Metro - Liverpool","Metro","A Metro",1,null,42444,24.7,null,null,null,"Metro",93.333333333333329,null,3,3,3,3,2,3,3,null,null,null,null,null,2166]
[2166,"A","Metro","Metro","127 NSW Metro - Liverpool","Metro","A Metro",1,null,52762,25.7,null,null,null,"Metro",90,null,3,3,3,3,2,2,3,null,null,null,null,null,2167]
[2167,"A","Metro","Metro","123 NSW Metro - Campbelltown","Metro","A Metro",1,null,9633,31.1,null,null,null,"Metro",83.333333333333343,null,3,3,3,3,1,2,3,null,null,null,null,null,2168]
[2168,"A","Metro","Metro","127 NSW Metro - Liverpool","Metro","A Metro",1,null,43451,31,null,null,null,"Metro",90,null,3,3,3,3,2,2,3,null,null,null,null,null,2170]
[2170,"A","Metro","Metro","127 NSW Metro - Liverpool","Metro","A Metro",1,null,105451,28.3,null,null,null,"Metro",96.666666666666686,null,3,3,3,3,3,2,3,null,null,null,null,null,2171]
[2171,"A","Metro","Metro","127 NSW Metro - Liverpool","Metro","A Metro",1,null,34866,34.1,null,null,null,"Metro",90,null,3,3,3,3,2,2,3,null,null,null,null,null,2172]
[2172,"A","Metro","Metro","127 NSW Metro - Liverpool","Metro","A Metro",1,null,2781,23.6,null,null,null,"Metro",80,null,3,3,3,3,0,3,3,null,null,null,null,null,2173]
[2173,"A","Metro","Metro","127 NSW Metro - Liverpool","Metro","A Metro",1,null,14433,26.3,null,null,null,"Metro",90,null,3,3,3,3,2,2,3,null,null,null,null,null,2174]
[2174,"A","Metro","Metro","127 NSW Metro - Liverpool","Metro","A Metro",1,null,2267,34.1,null,null,null,"Metro",76.666666666666671,null,3,3,3,3,0,2,3,null,null,null,null,null,2175]
[2175,"A","Metro","Metro","127 NSW Metro - Liverpool","Metro","A Metro",1,null,1837,33.4,null,null,null,"Metro",76.666666666666671,null,3,3,3,3,0,2,3,null,null,null,null,null,2176]
[2176,"A","Metro","Metro","127 NSW Metro - Liverpool","Metro","A Metro",1,null,47809,29.5,null,null,null,"Metro",90,null,3,3,3,3,2,2,3,null,null,null,null,null,2177]
[2177,"A","Metro","Metro","127 NSW Metro - Liverpool","Metro","A Metro",1,null,15979,30.3,null,null,null,"Metro",90,null,3,3,3,3,2,2,3,null,null,null,null,null,2178]
[2178,"A","Metro","Metro","127 NSW Metro - Liverpool","Metro","A Metro",1,null,4230,37.299999999999997,null,null,null,"Metro",76.666666666666671,null,3,3,3,3,0,2,3,null,null,null,null,null,2179]
[2179,"A","Metro","Metro","127 NSW Metro - Liverpool","Metro","A Metro",1,null,6530,38.1,null,null,null,"Metro",83.333333333333343,null,3,3,3,3,1,2,3,null,null,null,null,null,2190]
[2190,"A","Metro","Metro","119 NSW Metro - Bankstown","Metro","A Metro",1,null,25566,15,null,null,null,"Metro",93.333333333333329,null,3,3,3,3,2,3,3,null,null,null,null,null,2191]
[2191,"A","Metro","Metro","119 NSW Metro - Bankstown","Metro","A Metro",1,null,6322,11.9,null,null,null,"Metro",86.666666666666671,null,3,3,3,3,1,3,3,null,null,null,null,null,2192]
[2192,"A","Metro","Metro","119 NSW Metro - Bankstown","Metro","A Metro",1,null,12718,12.4,null,null,null,"Metro",93.333333333333329,null,3,3,3,3,2,3,3,null,null,null,null,null,2193]
[2193,"A","Metro","Metro","120 NSW Metro - Homebush","Metro","A Metro",1,null,15256,9.3000000000000007,null,null,null,"Metro",93.333333333333329,null,3,3,3,3,2,3,3,null,null,null,null,null,2194]
[2194,"A","Metro","Metro","119 NSW Metro - Bankstown","Metro","A Metro",1,null,24541,11.1,null,null,null,"Metro",93.333333333333329,null,3,3,3,3,2,3,3,null,null,null,null,null,2195]
[2195,"A","Metro","Metro","119 NSW Metro - Bankstown","Metro","A Metro",1,null,27154,14,null,null,null,"Metro",93.333333333333329,null,3,3,3,3,2,3,3,null,null,null,null,null,2196]
[2196,"A","Metro","Metro","119 NSW Metro - Bankstown","Metro","A Metro",1,null,31815,15.2,null,null,null,{"$f":"IF(ISBLANK(N194),IF(AND(H194<>\"\",IF(I194=\"High Density\",\"High Density\",IF(AND(P194<=45,P194>0),\"Refer to Distribution Partner\",IF(AND(P194<=55,P194>45),\"Regional\",IF(AND(P194>55,P194<=70),\"Non Metro\",IF(F194=\"Nonmetro\",\"Non Metro\",IF(P194>70,\"Metro\",\"\"))))))=\"Refer to Distribution Partner\"),\"Regional\",IF(I194=\"High Density\",\"High Density\",IF(AND(P194<=45,P194>0),\"Refer to Distribution Partner\",IF(AND(P194<=55,P194>45),\"Regional\",IF(AND(P194>55,P194<=70),\"Non Metro\",IF(F194=\"Nonmetro\",\"Non Metro\",IF(P194>70,\"Metro\",\"\"))))))),N194)","v":"Metro"},{"$f":"(R194/$AB$3*$AA$3+S194/$AB$4*$AA$4+T194/$AB$5*$AA$5+U194/$AB$6*$AA$6+V194/$AB$7*$AA$7+W194/$AB$8*$AA$8+X194/$AB$9*$AA$9)*100","v":93.333333333333329},null,{"$f":"IF(ISNUMBER(SEARCH(\"Metro\",E194)),3,IF(ISNUMBER(SEARCH(\"Rural\",E194)),2,1))","v":3},{"$f":"IF(ISNUMBER(FIND(\"Metro\",F194)),3,IF(ISNUMBER(FIND(\"Nonmetro\",F194)),2,3))","v":3},{"$f":"IF(G194=\"A Metro\",3,IF(G194=\"B Regional\",2,IF(G194=\"C Pop > 7,000\",1,IF(G194=\"D Pop > 2,000\",1,0))))","v":3},{"$f":"IF(H194=1,3,IF(H194=2,2,IF(H194=3,1,0)))","v":3},{"$f":"IF(J194>=100000,3,IF(AND(J194>=10000,J194<100000),2,IF(AND(J194>=5000,J194<10000),1,0)))","v":2},{"$f":"IF(AND(K194>=0.1,K194<25),3,IF(AND(K194>=25,K194<50),2,IF(AND(K194>=50,K194<150),1,0)))","v":3},{"$f":"IF(L194=\"\",3,0)","v":3},null,null,null,null,null,2197]
[2197,"A","Metro","Metro","119 NSW Metro - Bankstown","Metro","A Metro",1,null,9069,19.899999999999999,null,null,null,"Metro",86.666666666666671,null,3,3,3,3,1,3,3,null,null,null,null,null,2198]
[2198,"A","Metro","Metro","119 NSW Metro - Bankstown","Metro","A Metro",1,null,9038,20.8,null,null,null,"Metro",86.666666666666671,null,3,3,3,3,1,3,3,null,null,null,null,null,2199]
[2199,"A","Metro","Metro","119 NSW Metro - Bankstown","Metro","A Metro",1,null,18013,18,null,null,null,"Metro",93.333333333333329,null,3,3,3,3,2,3,3,null,null,null,null,null,2200]
[2200,"A","Metro","Metro","119 NSW Metro - Bankstown","Metro","A Metro",1,null,43687,18.2,null,null,null,"Metro",93.333333333333329,null,3,3,3,3,2,3,3,null,null,null,null,null,2203]
[2203,"A","Metro","Metro","120 NSW Metro - Homebush","Metro","A Metro",1,null,13707,7.4,null,null,null,"Metro",93.333333333333329,null,3,3,3,3,2,3,3,null,null,null,null,null,2204]
[2204,"A","Metro","Metro","117 NSW Metro - CBD & Inner South","Metro","A Metro",1,null,26502,7.1,null,null,null,"Metro",93.333333333333329,null,3,3,3,3,2,3,3,null,null,null,null,null,2205]
[2205,"A","Metro","Metro","119 NSW Metro - Bankstown","Metro","A Metro",1,null,19447,9.9,null,null,null,"Metro",93.333333333333329,null,3,3,3,3,2,3,3,null,null,null,null,null,2206]
[2206,"A","Metro","Metro","119 NSW Metro - Bankstown","Metro","A Metro",1,null,19404,10,null,null,null,"Metro",93.333333333333329,null,3,3,3,3,2,3,3,null,null,null,null,null,2207]
[2207,"A","Metro","Metro","119 NSW Metro - Bankstown","Metro","A Metro",1,null,28534,12.2,null,null,null,"Metro",93.333333333333329,null,3,3,3,3,2,3,3,null,null,null,null,null,2208]
[2208,"A","Metro","Metro","119 NSW Metro - Bankstown","Metro","A Metro",1,null,12446,12.8,null,null,null,"Metro",93.333333333333329,null,3,3,3,3,2,3,3,null,null,null,null,null,2209]
[2209,"A","Metro","Metro","119 NSW Metro - Bankstown","Metro","A Metro",1,null,15769,15.4,null,null,null,"Metro",93.333333333333329,null,3,3,3,3,2,3,3,null,null,null,null,null,2210]
[2210,"A","Metro","Metro","119 NSW Metro - Bankstown","Metro","A Metro",1,null,30586,18,null,null,null,"Metro",93.333333333333329,null,3,3,3,3,2,3,3,null,null,null,null,null,2211]
[2211,"A","Metro","Metro","119 NSW Metro - Bankstown","Metro","A Metro",1,null,16846,19.2,null,null,null,"Metro",93.333333333333329,null,3,3,3,3,2,3,3,null,null,null,null,null,2212]
[2212,"A","Metro","Metro","119 NSW Metro - Bankstown","Metro","A Metro",1,null,15847,20.100000000000001,null,null,null,"Metro",93.333333333333329,null,3,3,3,3,2,3,3,null,null,null,null,null,2213]
[2213,"A","Metro","Metro","119 NSW Metro - Bankstown","Metro","A Metro",1,null,21784,21.9,null,null,null,"Metro",93.333333333333329,null,3,3,3,3,2,3,3,null,null,null,null,null,2214]
[2214,"A","Metro","Metro","119 NSW Metro - Bankstown","Metro","A Metro",1,null,3952,22.3,null,null,null,"Metro",80,null,3,3,3,3,0,3,3,null,null,null,null,null,2216]
[2216,"A","Metro","Metro","119 NSW Metro - Bankstown","Metro","A Metro",1,null,28067,11.4,null,null,null,"Metro",93.333333333333329,null,3,3,3,3,2,3,3,null,null,null,null,null,2217]
[2217,"A","Metro","Metro","119 NSW Metro - Bankstown","Metro","A Metro",1,null,26843,13.7,null,null,null,"Metro",93.333333333333329,null,3,3,3,3,2,3,3,null,null,null,null,null,2218]
[2218,"A","Metro","Metro","119 NSW Metro - Bankstown","Metro","A Metro",1,null,16431,14.1,null,null,null,"Metro",93.333333333333329,null,3,3,3,3,2,3,3,null,null,null,null,null,2219]
[2219,"A","Metro","Metro","119 NSW Metro - Bankstown","Metro","A Metro",1,null,13200,15.6,null,null,null,"Metro",93.333333333333329,null,3,3,3,3,2,3,3,null,null,null,null,null,2220]
[2220,"A","Metro","Metro","119 NSW Metro - Bankstown","Metro","A Metro",1,null,32487,14.6,null,null,null,"Metro",93.333333333333329,null,3,3,3,3,2,3,3,null,null,null,null,null,2221]
[2221,"A","Metro","Metro","119 NSW Metro - Bankstown","Metro","A Metro",1,null,16481,16.2,null,null,null,"Metro",93.333333333333329,null,3,3,3,3,2,3,3,null,null,null,null,null,2222]
[2222,"A","Metro","Metro","119 NSW Metro - Bankstown","Metro","A Metro",1,null,12786,15.6,null,null,null,"Metro",93.333333333333329,null,3,3,3,3,2,3,3,null,null,null,null,null,2223]
[2223,"A","Metro","Metro","119 NSW Metro - Bankstown","Metro","A Metro",1,null,20910,17.2,null,null,null,"Metro",93.333333333333329,null,3,3,3,3,2,3,3,null,null,null,null,null,2224]
[2224,"A","Metro","Metro","128 NSW Metro - Sutherland","Metro","A Metro",1,null,14213,19.100000000000001,null,null,null,"Metro",93.333333333333329,null,3,3,3,3,2,3,3,null,null,null,null,null,2225]
[2225,"A","Metro","Metro","128 NSW Metro - Sutherland","Metro","A Metro",1,null,5407,19.100000000000001,null,null,null,"Metro",86.666666666666671,null,3,3,3,3,1,3,3,null,null,null,null,null,2226]
[2226,"A","Metro","Metro","128 NSW Metro - Sutherland","Metro","A Metro",1,null,12504,21,null,null,null,"Metro",93.333333333333329,null,3,3,3,3,2,3,3,null,null,null,null,null,2227]
[2227,"A","Metro","Metro","128 NSW Metro - Sutherland","Metro","A Metro",1,null,14626,22.4,null,null,null,"Metro",93.333333333333329,null,3,3,3,3,2,3,3,null,null,null,null,null,2228]
[2228,"A","Metro","Metro","128 NSW Metro - Sutherland","Metro","A Metro",1,null,18361,21.1,null,null,null,"Metro",93.333333333333329,null,3,3,3,3,2,3,3,null,null,null,null,null,2229]
[2229,"A","Metro","Metro","128 NSW Metro - Sutherland","Metro","A Metro",1,null,28718,21.8,null,null,null,"Metro",93.333333333333329,null,3,3,3,3,2,3,3,null,null,null,null,null,2230]
[2230,"A","Metro","Metro","128 NSW Metro - Sutherland","Metro","A Metro",1,null,28843,22.1,null,null,null,"Metro",93.333333333333329,null,3,3,3,3,2,3,3,null,null,null,null,null,2231]
[2231,"A","Metro","Metro","128 NSW Metro - Sutherland","Metro","A Metro",1,null,2267,16.5,null,null,null,"Metro",80,null,3,3,3,3,0,3,3,null,null,null,null,null,2232]
[2232,"A","Metro","Metro","128 NSW Metro - Sutherland","Metro","A Metro",1,null,32870,22.7,null,null,null,"Metro",93.333333333333329,null,3,3,3,3,2,3,3,null,null,null,null,null,2233]
[2233,"A","Metro","Metro","128 NSW Metro - Sutherland","Metro","A Metro",1,null,29498,28.8,null,null,null,"Metro",90,null,3,3,3,3,2,2,3,null,null,null,null,null,2234]
[2234,"A","Metro","Metro","128 NSW Metro - Sutherland","Metro","A Metro",1,null,30580,23.6,null,null,null,"Metro",93.333333333333329,null,3,3,3,3,2,3,3,null,null,null,null,null,2250]
[2250,"A","Metro","Regional","102 NSW Metro - Gosford","Nonmetro","A Metro",1,null,67194,52.6,null,null,null,"Non Metro",80,null,3,2,3,3,2,1,3,null,null,null,null,null,2251]
[2251,"A","Metro","Regional","102 NSW Metro - Gosford","Nonmetro","A Metro",1,null,32702,47.9,null,null,null,"Non Metro",83.333333333333343,null,3,2,3,3,2,2,3,null,null,null,null,null,2256]
[2256,"A","Metro","Regional","102 NSW Metro - Gosford","Nonmetro","A Metro",1,null,15598,42.7,null,null,null,"Non Metro",83.333333333333343,null,3,2,3,3,2,2,3,null,null,null,null,null,2257]
[2257,"A","Metro","Regional","102 NSW Metro - Gosford","Nonmetro","A Metro",1,null,29010,40.9,null,null,null,"Non Metro",83.333333333333343,null,3,2,3,3,2,2,3,null,null,null,null,null,2258]
[2258,"A","Metro","Regional","102 NSW Metro - Gosford","Nonmetro","A Metro",1,null,5164,59.4,null,null,null,"Non Metro",73.333333333333343,null,3,2,3,3,1,1,3,null,null,null,null,null,2259]
[2259,"A","Metro","Regional","102 NSW Metro - Gosford","Nonmetro","A Metro",1,null,59513,75.8,null,null,null,"Non Metro",80,null,3,2,3,3,2,1,3,null,null,null,null,null,2260]
[2260,"A","Metro","Regional","102 NSW Metro - Gosford","Nonmetro","A Metro",1,null,23417,52.9,null,null,null,"Non Metro",80,null,3,2,3,3,2,1,3,null,null,null,null,null,2261]
[2261,"A","Metro","Regional","102 NSW Metro - Gosford","Nonmetro","A Metro",1,null,52754,63.5,null,null,null,"Non Metro",80,null,3,2,3,3,2,1,3,null,null,null,null,null,2262]
[2262,"A","Metro","Regional","102 NSW Metro - Gosford","Nonmetro","A Metro",1,null,20830,78,null,null,null,"Non Metro",80,null,3,2,3,3,2,1,3,null,null,null,null,null,2263]
[2263,"A","Metro","Regional","102 NSW Metro - Gosford","Nonmetro","A Metro",1,null,24267,74.099999999999994,null,null,null,"Non Metro",80,null,3,2,3,3,2,1,3,null,null,null,null,null,2264]
[2264,"A","Metro","Regional","111 NSW Rural - Newcastle","Nonmetro","A Metro",1,null,14233,89.7,null,null,null,"Non Metro",78.333333333333329,null,2,2,3,3,2,1,3,null,null,null,null,null,2265]
[2265,"A","Metro","Regional","111 NSW Rural - Newcastle","Nonmetro","A Metro",1,null,5805,91,null,null,null,"Non Metro",71.666666666666671,null,2,2,3,3,1,1,3,null,null,null,null,null,2267]
[2267,"A","Metro","Regional","111 NSW Rural - Newcastle","Nonmetro","A Metro",1,null,2759,95.2,"Mining",null,null,"Non Metro",60,null,2,2,3,3,0,1,0,null,null,null,null,null,2278]
[2278,"A","Metro","Regional","111 NSW Rural - Newcastle","Nonmetro","A Metro",1,null,2570,109.8,"Mining",null,null,"Non Metro",60,null,2,2,3,3,0,1,0,null,null,null,null,null,2280]
[2280,"A","Metro","Regional","111 NSW Rural - Newcastle","Nonmetro","A Metro",1,null,26678,102.9,null,null,null,"Non Metro",78.333333333333329,null,2,2,3,3,2,1,3,null,null,null,null,null,2281]
[2281,"A","Metro","Regional","111 NSW Rural - Newcastle","Nonmetro","A Metro",1,null,14274,95,null,null,null,"Non Metro",78.333333333333329,null,2,2,3,3,2,1,3,null,null,null,null,null,2282]
[2282,"A","Metro","Regional","111 NSW Rural - Newcastle","Nonmetro","A Metro",1,null,14777,107.5,null,null,null,"Non Metro",78.333333333333329,null,2,2,3,3,2,1,3,null,null,null,null,null,2283]
[2283,"A","Metro","Regional","111 NSW Rural - Newcastle","Nonmetro","A Metro",1,null,23300,101.1,"Mining",null,null,"Non Metro",73.333333333333329,null,2,2,3,3,2,1,0,null,null,null,null,null,2284]
[2284,"A","Metro","Regional","111 NSW Rural - Newcastle","Nonmetro","A Metro",1,null,10500,108.8,"Mining",null,null,"Non Metro",73.333333333333329,null,2,2,3,3,2,1,0,null,null,null,null,null,2285]
[2285,"A","Metro","Regional","111 NSW Rural - Newcastle","Nonmetro","A Metro",1,null,30714,111.9,null,null,null,"Non Metro",78.333333333333329,null,2,2,3,3,2,1,3,null,null,null,null,null,2286]
[2286,"A","Metro","Regional","111 NSW Rural - Newcastle","Nonmetro","A Metro",1,null,3909,112.2,null,null,null,"Non Metro",65,null,2,2,3,3,0,1,3,null,null,null,null,null,2287]
[2287,"A","Metro","Regional","111 NSW Rural - Newcastle","Nonmetro","A Metro",1,null,36400,116.2,null,null,null,"Non Metro",78.333333333333329,null,2,2,3,3,2,1,3,null,null,null,null,null,2289]
[2289,"A","Metro","Regional","111 NSW Rural - Newcastle","Nonmetro","A Metro",1,null,19117,113.9,null,null,null,"Non Metro",78.333333333333329,null,2,2,3,3,2,1,3,null,null,null,null,null,2290]
[2290,"A","Metro","Regional","111 NSW Rural - Newcastle","Nonmetro","A Metro",1,null,33426,109.3,null,null,null,"Non Metro",78.333333333333329,null,2,2,3,3,2,1,3,null,null,null,null,null,2291]
[2291,"A","Metro","Regional","111 NSW Rural - Newcastle","Nonmetro","A Metro",1,null,13417,114.8,null,null,null,"Non Metro",78.333333333333329,null,2,2,3,3,2,1,3,null,null,null,null,null,2292]
[2292,"A","Metro","Regional","111 NSW Rural - Newcastle","Nonmetro","A Metro",1,null,2465,116,null,null,null,"Non Metro",65,null,2,2,3,3,0,1,3,null,null,null,null,null,2293]
[2293,"A","Metro","Regional","111 NSW Rural - Newcastle","Nonmetro","A Metro",1,null,2521,117.5,null,null,null,"Non Metro",65,null,2,2,3,3,0,1,3,null,null,null,null,null,2294]
[2294,"A","Metro","Regional","111 NSW Rural - Newcastle","Nonmetro","A Metro",1,null,1929,118.3,null,null,null,"Non Metro",65,null,2,2,3,3,0,1,3,null,null,null,null,null,2295]
[2295,"A","Metro","Regional","111 NSW Rural - Newcastle","Nonmetro","A Metro",1,null,6925,122.1,null,null,null,{"$f":"IF(ISBLANK(N258),IF(AND(H258<>\"\",IF(I258=\"High Density\",\"High Density\",IF(AND(P258<=45,P258>0),\"Refer to Distribution Partner\",IF(AND(P258<=55,P258>45),\"Regional\",IF(AND(P258>55,P258<=70),\"Non Metro\",IF(F258=\"Nonmetro\",\"Non Metro\",IF(P258>70,\"Metro\",\"\"))))))=\"Refer to Distribution Partner\"),\"Regional\",IF(I258=\"High Density\",\"High Density\",IF(AND(P258<=45,P258>0),\"Refer to Distribution Partner\",IF(AND(P258<=55,P258>45),\"Regional\",IF(AND(P258>55,P258<=70),\"Non Metro\",IF(F258=\"Nonmetro\",\"Non Metro\",IF(P258>70,\"Metro\",\"\"))))))),N258)","v":"Non Metro"},{"$f":"(R258/$AB$3*$AA$3+S258/$AB$4*$AA$4+T258/$AB$5*$AA$5+U258/$AB$6*$AA$6+V258/$AB$7*$AA$7+W258/$AB$8*$AA$8+X258/$AB$9*$AA$9)*100","v":71.666666666666671},null,{"$f":"IF(ISNUMBER(SEARCH(\"Metro\",E258)),3,IF(ISNUMBER(SEARCH(\"Rural\",E258)),2,1))","v":2},{"$f":"IF(ISNUMBER(FIND(\"Metro\",F258)),3,IF(ISNUMBER(FIND(\"Nonmetro\",F258)),2,3))","v":2},{"$f":"IF(G258=\"A Metro\",3,IF(G258=\"B Regional\",2,IF(G258=\"C Pop > 7,000\",1,IF(G258=\"D Pop > 2,000\",1,0))))","v":3},{"$f":"IF(H258=1,3,IF(H258=2,2,IF(H258=3,1,0)))","v":3},{"$f":"IF(J258>=100000,3,IF(AND(J258>=10000,J258<100000),2,IF(AND(J258>=5000,J258<10000),1,0)))","v":1},{"$f":"IF(AND(K258>=0.1,K258<25),3,IF(AND(K258>=25,K258<50),2,IF(AND(K258>=50,K258<150),1,0)))","v":1},{"$f":"IF(L258=\"\",3,0)","v":3},null,null,null,null,null,2296]
[2296,"A","Metro","Regional","111 NSW Rural - Newcastle","Nonmetro","A Metro",1,null,1883,117.3,null,null,null,"Non Metro",65,null,2,2,3,3,0,1,3,null,null,null,null,null,2297]
[2297,"A","Metro","Regional","111 NSW Rural - Newcastle","Nonmetro","A Metro",1,null,1680,118.2,null,null,null,"Non Metro",65,null,2,2,3,3,0,1,3,null,null,null,null,null,2298]
[2298,"A","Metro","Regional","111 NSW Rural - Newcastle","Nonmetro","A Metro",1,null,9498,117.4,null,null,null,"Non Metro",71.666666666666671,null,2,2,3,3,1,1,3,null,null,null,null,null,2299]
[2299,"A","Metro","Regional","111 NSW Rural - Newcastle","Nonmetro","A Metro",1,null,11207,116.3,null,null,null,"Non Metro",78.333333333333329,null,2,2,3,3,2,1,3,null,null,null,null,null,2300]
[2300,"A","Metro","Regional","111 NSW Rural - Newcastle","Nonmetro","A Metro",1,null,10578,116.9,null,null,null,"Non Metro",78.333333333333329,null,2,2,3,3,2,1,3,null,null,null,null,null,2302]
[2302,"A","Metro","Regional","111 NSW Rural - Newcastle","Nonmetro","A Metro",1,null,564,116.6,null,null,null,"Non Metro",65,null,2,2,3,3,0,1,3,null,null,null,null,null,2303]
[2303,"A","Metro","Regional","111 NSW Rural - Newcastle","Nonmetro","A Metro",1,null,9143,116.1,null,null,null,"Non Metro",71.666666666666671,null,2,2,3,3,1,1,3,null,null,null,null,null,2304]
[2304,"A","Metro","Regional","111 NSW Rural - Newcastle","Nonmetro","A Metro",1,null,15176,119,null,null,null,"Non Metro",78.333333333333329,null,2,2,3,3,2,1,3,null,null,null,null,null,2305]
[2305,"A","Metro","Regional","111 NSW Rural - Newcastle","Nonmetro","A Metro",1,null,12506,114.8,null,null,null,"Non Metro",78.333333333333329,null,2,2,3,3,2,1,3,null,null,null,null,null,2306]
[2306,"A","Metro","Regional","111 NSW Rural - Newcastle","Nonmetro","A Metro",1,null,3358,106.6,null,null,null,"Non Metro",65,null,2,2,3,3,0,1,3,null,null,null,null,null,2307]
[2307,"A","Metro","Regional","111 NSW Rural - Newcastle","Nonmetro","A Metro",1,null,3905,118.6,null,null,null,"Non Metro",65,null,2,2,3,3,0,1,3,null,null,null,null,null,2308]
[2308,"A","Metro","Regional","111 NSW Rural - Newcastle","Nonmetro","A Metro",1,null,1326,118.6,null,null,null,"Non Metro",65,null,2,2,3,3,0,1,3,null,null,null,null,null,2311]
[2311,"A","Other","Regional","106 NSW Rural - Hunter Valley","Nonmetro","E Pop > 500",null,null,858,166.8,"Mining",null,null,"Refer to Distribution Partner",16.666666666666664,null,2,2,0,0,0,0,0,null,null,null,null,null,2312]
[2312,"A","Other","Regional","108 NSW Rural - Port Macquarie","Nonmetro","E Pop > 500",null,null,1458,223.9,null,null,null,"Refer to Distribution Partner",21.666666666666668,null,2,2,0,0,0,0,3,null,null,null,null,null,2315]
[2315,"A","Metro","Regional","106 NSW Rural - Hunter Valley","Nonmetro","A Metro",1,null,14658,154.6,null,null,null,"Non Metro",75,null,2,2,3,3,2,0,3,null,null,null,null,null,2316]
[2316,"A","Metro","Regional","106 NSW Rural - Hunter Valley","Nonmetro","A Metro",1,null,5849,146.6,null,null,null,"Non Metro",71.666666666666671,null,2,2,3,3,1,1,3,null,null,null,null,null,2317]
[2317,"A","Metro","Regional","106 NSW Rural - Hunter Valley","Nonmetro","A Metro",1,null,6244,151,null,null,null,"Non Metro",68.333333333333329,null,2,2,3,3,1,0,3,null,null,null,null,null,2318]
[2318,"A","Metro","Regional","106 NSW Rural - Hunter Valley","Nonmetro","A Metro",1,null,12147,138.69999999999999,null,null,null,"Non Metro",78.333333333333329,null,2,2,3,3,2,1,3,null,null,null,null,null,2319]
[2319,"A","Metro","Regional","106 NSW Rural - Hunter Valley","Nonmetro","A Metro",1,null,6684,147.19999999999999,null,null,null,"Non Metro",71.666666666666671,null,2,2,3,3,1,1,3,null,null,null,null,null,2320]
[2320,"A","Metro","Regional","106 NSW Rural - Hunter Valley","Nonmetro","A Metro",1,null,34556,131.9,"Mining",null,null,"Non Metro",73.333333333333329,null,2,2,3,3,2,1,0,null,null,null,null,null,2321]
[2321,"A","Metro","Regional","106 NSW Rural - Hunter Valley","Nonmetro","A Metro",1,null,14625,131.1,"Mining",null,null,"Non Metro",73.333333333333329,null,2,2,3,3,2,1,0,null,null,null,null,null,2322]
[2322,"A","Metro","Regional","106 NSW Rural - Hunter Valley","Nonmetro","A Metro",1,null,18450,128,"Mining",null,null,"Non Metro",73.333333333333329,null,2,2,3,3,2,1,0,null,null,null,null,null,2323]
[2323,"A","Metro","Regional","106 NSW Rural - Hunter Valley","Nonmetro","A Metro",1,null,25735,129,"Mining",null,null,"Non Metro",73.333333333333329,null,2,2,3,3,2,1,0,null,null,null,null,null,2324]
[2324,"A","Metro","Regional","106 NSW Rural - Hunter Valley","Nonmetro","A Metro",2,null,23648,148.4,null,null,null,"Non Metro",71.666666666666671,null,2,2,3,2,2,1,3,null,null,null,null,null,2325]
[2325,"A","Metro","Regional","106 NSW Rural - Hunter Valley","Nonmetro","A Metro",2,null,28460,115.1,"Mining",null,null,"Non Metro",66.666666666666657,null,2,2,3,2,2,1,0,null,null,null,null,null,2326]
[2326,"A","Regional","Regional","106 NSW Rural - Hunter Valley","Nonmetro","B Regional",2,null,7332,119.8,"Mining",null,null,"Regional",53.333333333333336,null,2,2,2,2,1,1,0,null,null,null,null,null,2327]
[2327,"A","Metro","Regional","106 NSW Rural - Hunter Valley","Nonmetro","A Metro",1,null,7615,119.5,"Mining",null,null,"Non Metro",66.666666666666657,null,2,2,3,3,1,1,0,null,null,null,null,null,2328]
[2328,"A","Other","Regional","106 NSW Rural - Hunter Valley","Nonmetro","D Pop > 2,000",null,null,2442,173,"Mining",null,null,"Refer to Distribution Partner",23.333333333333332,null,2,2,1,0,0,0,0,null,null,null,null,null,2329]
[2329,"A","Other","Regional","106 NSW Rural - Hunter Valley","Nonmetro","D Pop > 2,000",null,null,2112,210.8,"Mining",null,null,"Refer to Distribution Partner",23.333333333333332,null,2,2,1,0,0,0,0,null,null,null,null,null,2330]
[2330,"A","Regional","Regional","106 NSW Rural - Hunter Valley","Nonmetro","B Regional",2,null,20350,146.19999999999999,"Mining",null,null,"Non Metro",60,null,2,2,2,2,2,1,0,null,null,null,null,null,2333]
[2333,"A","Regional","Regional","106 NSW Rural - Hunter Valley","Nonmetro","B Regional",2,null,13647,179.8,"Mining",null,null,"Non Metro",56.666666666666664,null,2,2,2,2,2,0,0,null,null,null,null,null,2334]
[2334,"A","Regional","Regional","106 NSW Rural - Hunter Valley","Nonmetro","B Regional",2,null,2830,133.9,"Mining",null,null,"Regional",46.666666666666664,null,2,2,2,2,0,1,0,null,null,null,null,null,2335]
[2335,"A","Regional","Regional","106 NSW Rural - Hunter Valley","Nonmetro","B Regional",2,null,6156,135.6,"Mining",null,null,"Regional",53.333333333333336,null,2,2,2,2,1,1,0,null,null,null,null,null,2336]
[2336,"A","Other","Regional","106 NSW Rural - Hunter Valley","Nonmetro","D Pop > 2,000",null,null,2614,191.1,"Mining",null,null,"Refer to Distribution Partner",23.333333333333332,null,2,2,1,0,0,0,0,null,null,null,null,null,2337]
[2337,"A","Other","Regional","106 NSW Rural - Hunter Valley","Nonmetro","C Pop > 7,000",null,null,7891,205.9,"Mining",null,null,"Refer to Distribution Partner",30,null,2,2,1,0,1,0,0,null,null,null,null,null,2338]
[2338,"A","Other","Regional","106 NSW Rural - Hunter Valley","Nonmetro","E Pop > 500",null,null,1430,237.1,"Mining",null,null,"Refer to Distribution Partner",16.666666666666664,null,2,2,0,0,0,0,0,null,null,null,null,null,2339]
[2339,"A","Other","Regional","110 NSW Rural - New England","Nonmetro","E Pop > 500",null,null,679,249.6,"Mining",null,null,"Refer to Distribution Partner",16.666666666666664,null,2,2,0,0,0,0,0,null,null,null,null,null,2340]
[2340,"A","Regional","Regional","110 NSW Rural - New England","Nonmetro","B Regional",1,null,49072,309.39999999999998,null,null,null,"Non Metro",68.333333333333329,null,2,2,2,3,2,0,3,null,null,null,null,null,2341]
[2341,"A","Other","Regional","110 NSW Rural - New England","Nonmetro","E Pop > 500",null,null,1572,284.5,null,null,null,"Refer to Distribution Partner",21.666666666666668,null,2,2,0,0,0,0,3,null,null,null,null,null,2342]
[2342,"A","Other","Regional","110 NSW Rural - New England","Nonmetro","E Pop > 500",null,null,471,284.5,"Mining",null,null,"Refer to Distribution Partner",16.666666666666664,null,2,2,0,0,0,0,0,null,null,null,null,null,2343]
[2343,"A","Other","Regional","110 NSW Rural - New England","Nonmetro","D Pop > 2,000",null,null,4968,268.10000000000002,null,null,null,"Refer to Distribution Partner",28.333333333333332,null,2,2,1,0,0,0,3,null,null,null,null,null,2344]
[2344,"A","Other","Regional","110 NSW Rural - New England","Nonmetro","E Pop > 500",null,null,756,299,null,null,null,"Refer to Distribution Partner",21.666666666666668,null,2,2,0,0,0,0,3,null,null,null,null,null,2345]
[2345,"A","Other","Regional","110 NSW Rural - New England","Nonmetro","E Pop > 500",null,null,721,331.8,null,null,null,"Refer to Distribution Partner",21.666666666666668,null,2,2,0,0,0,0,3,null,null,null,null,null,2346]
[2346,"A","Other","Regional","110 NSW Rural - New England","Nonmetro","D Pop > 2,000",null,null,3149,348.9,"Mining",null,null,"Refer to Distribution Partner",23.333333333333332,null,2,2,1,0,0,0,0,null,null,null,null,null,2347]
[2347,"A","Other","Regional","110 NSW Rural - New England","Nonmetro","E Pop > 500",null,null,1931,390.7,null,null,null,"Refer to Distribution Partner",21.666666666666668,null,2,2,0,0,0,0,3,null,null,null,null,null,2350]
[2350,"A","Regional","Regional","110 NSW Rural - New England","Nonmetro","B Regional",2,null,25339,375.8,null,null,null,"Non Metro",61.666666666666671,null,2,2,2,2,2,0,3,null,null,null,null,null,2352]
[2352,"A","Other","Regional","110 NSW Rural - New England","Nonmetro","D Pop > 2,000",null,null,2716,313.2,null,null,null,"Refer to Distribution Partner",28.333333333333332,null,2,2,1,0,0,0,3,null,null,null,null,null,2353]
[2353,"A","Other","Regional","110 NSW Rural - New England","Nonmetro","E Pop > 500",null,null,1126,317.8,null,null,null,"Refer to Distribution Partner",21.666666666666668,null,2,2,0,0,0,0,3,null,null,null,null,null,2354]
[2354,"A","Other","Regional","110 NSW Rural - New England","Nonmetro","D Pop > 2,000",null,null,3576,321.2,null,null,null,"Refer to Distribution Partner",28.333333333333332,null,2,2,1,0,0,0,3,null,null,null,null,null,2355]
[2355,"A","Other","Regional","110 NSW Rural - New England","Nonmetro","E Pop > 500",null,null,663,335,null,null,null,"Refer to Distribution Partner",21.666666666666668,null,2,2,0,0,0,0,3,null,null,null,null,null,2356]
[2356,"A","Other","Regional","110 NSW Rural - New England","Nonmetro","F Pop <= 500",null,null,162,335,null,null,null,"Refer to Distribution Partner",21.666666666666668,null,2,2,0,0,0,0,3,null,null,null,null,null,2357]
[2357,"A","Other","Regional","105 NSW Rural - Outback","Nonmetro","D Pop > 2,000",null,null,4159,340,null,null,null,"Refer to Distribution Partner",28.333333333333332,null,2,2,1,0,0,0,3,null,null,null,null,null,2358]
[2358,"A","Other","Regional","110 NSW Rural - New England","Nonmetro","D Pop > 2,000",null,null,3767,360.2,null,null,null,"Refer to Distribution Partner",28.333333333333332,null,2,2,1,0,0,0,3,null,null,null,null,null,2359]
[2359,"A","Other","Regional","110 NSW Rural - New England","Nonmetro","E Pop > 500",null,null,736,413.6,null,null,null,"Refer to Distribution Partner",21.666666666666668,null,2,2,0,0,0,0,3,null,null,null,null,null,2360]
[2360,"A","Other","Regional","110 NSW Rural - New England","Nonmetro","C Pop > 7,000",3,null,14529,455.4,null,null,null,"Regional",48.333333333333336,null,2,2,1,1,2,0,3,null,null,null,null,null,2361]
[2361,"A","Other","Regional","110 NSW Rural - New England","Nonmetro","E Pop > 500",null,null,909,508,null,null,null,"Refer to Distribution Partner",21.666666666666668,null,2,2,0,0,0,0,3,null,null,null,null,null,2365]
[2365,"A","Other","Regional","110 NSW Rural - New England","Nonmetro","D Pop > 2,000",null,null,3721,411.5,null,null,null,"Refer to Distribution Partner",28.333333333333332,null,2,2,1,0,0,0,3,null,null,null,null,null,2369]
[2369,"A","Other","Regional","110 NSW Rural - New England","Nonmetro","E Pop > 500",null,null,927,435.9,null,null,null,"Refer to Distribution Partner",21.666666666666668,null,2,2,0,0,0,0,3,null,null,null,null,null,2370]
[2370,"A","Other","Regional","110 NSW Rural - New England","Nonmetro","C Pop > 7,000",null,null,7687,461.9,null,null,null,"Refer to Distribution Partner",35,null,2,2,1,0,1,0,3,null,null,null,null,null,2371]
[2371,"A","Other","Regional","110 NSW Rural - New England","Nonmetro","E Pop > 500",null,null,1155,497.6,null,null,null,"Refer to Distribution Partner",21.666666666666668,null,2,2,0,0,0,0,3,null,null,null,null,null,2372]
[2372,"A","Other","Regional","110 NSW Rural - New England","Nonmetro","D Pop > 2,000",null,null,4742,541.70000000000005,null,null,null,"Refer to Distribution Partner",28.333333333333332,null,2,2,1,0,0,0,3,null,null,null,null,null,2379]
[2379,"A","Other","Regional","110 NSW Rural - New England","Nonmetro","F Pop <= 500",null,null,313,541.70000000000005,"Mining",null,null,"Refer to Distribution Partner",16.666666666666664,null,2,2,0,0,0,0,0,null,null,null,null,null,2380]
[2380,"A","Other","Regional","110 NSW Rural - New England","Nonmetro","C Pop > 7,000",3,null,10392,332.4,"Mining",null,null,"Regional",43.333333333333336,null,2,2,1,1,2,0,0,null,null,null,null,null,2381]
[2381,"A","Other","Regional","110 NSW Rural - New England","Nonmetro","E Pop > 500",null,null,1193,314.5,"Mining",null,null,{"$f":"IF(ISBLANK(N322),IF(AND(H322<>\"\",IF(I322=\"High Density\",\"High Density\",IF(AND(P322<=45,P322>0),\"Refer to Distribution Partner\",IF(AND(P322<=55,P322>45),\"Regional\",IF(AND(P322>55,P322<=70),\"Non Metro\",IF(F322=\"Nonmetro\",\"Non Metro\",IF(P322>70,\"Metro\",\"\"))))))=\"Refer to Distribution Partner\"),\"Regional\",IF(I322=\"High Density\",\"High Density\",IF(AND(P322<=45,P322>0),\"Refer to Distribution Partner\",IF(AND(P322<=55,P322>45),\"Regional\",IF(AND(P322>55,P322<=70),\"Non Metro\",IF(F322=\"Nonmetro\",\"Non Metro\",IF(P322>70,\"Metro\",\"\"))))))),N322)","v":"Refer to Distribution Partner"},{"$f":"(R322/$AB$3*$AA$3+S322/$AB$4*$AA$4+T322/$AB$5*$AA$5+U322/$AB$6*$AA$6+V322/$AB$7*$AA$7+W322/$AB$8*$AA$8+X322/$AB$9*$AA$9)*100","v":16.666666666666664},null,{"$f":"IF(ISNUMBER(SEARCH(\"Metro\",E322)),3,IF(ISNUMBER(SEARCH(\"Rural\",E322)),2,1))","v":2},{"$f":"IF(ISNUMBER(FIND(\"Metro\",F322)),3,IF(ISNUMBER(FIND(\"Nonmetro\",F322)),2,3))","v":2},{"$f":"IF(G322=\"A Metro\",3,IF(G322=\"B Regional\",2,IF(G322=\"C Pop > 7,000\",1,IF(G322=\"D Pop > 2,000\",1,0))))","v":0},{"$f":"IF(H322=1,3,IF(H322=2,2,IF(H322=3,1,0)))","v":0},{"$f":"IF(J322>=100000,3,IF(AND(J322>=10000,J322<100000),2,IF(AND(J322>=5000,J322<10000),1,0)))","v":0},{"$f":"IF(AND(K322>=0.1,K322<25),3,IF(AND(K322>=25,K322<50),2,IF(AND(K322>=50,K322<150),1,0)))","v":0},{"$f":"IF(L322=\"\",3,0)","v":0},null,null,null,null,null,2382]
[2382,"A","Other","Regional","110 NSW Rural - New England","Nonmetro","E Pop > 500",null,null,1319,370,"Mining",null,null,"Refer to Distribution Partner",16.666666666666664,null,2,2,0,0,0,0,0,null,null,null,null,null,2386]
[2386,"A","Other","Regional","105 NSW Rural - Outback","Nonmetro","F Pop <= 500",null,null,360,370,null,null,null,"Refer to Distribution Partner",21.666666666666668,null,2,2,0,0,0,0,3,null,null,null,null,null,2387]
[2387,"A","Other","Regional","105 NSW Rural - Outback","Nonmetro","F Pop <= 500",null,null,201,370,null,null,null,"Refer to Distribution Partner",21.666666666666668,null,2,2,0,0,0,0,3,null,null,null,null,null,2388]
[2388,"A","Other","Regional","110 NSW Rural - New England","Nonmetro","D Pop > 2,000",null,null,2674,439.4,null,null,null,"Refer to Distribution Partner",28.333333333333332,null,2,2,1,0,0,0,3,null,null,null,null,null,2390]
[2390,"A","Other","Regional","110 NSW Rural - New England","Nonmetro","C Pop > 7,000",null,null,8757,415.1,"Mining",null,null,"Refer to Distribution Partner",30,null,2,2,1,0,1,0,0,null,null,null,null,null,2395]
[2395,"A","Other","Regional","105 NSW Rural - Outback","Nonmetro","E Pop > 500",null,null,671,307.5,null,null,null,"Refer to Distribution Partner",21.666666666666668,null,2,2,0,0,0,0,3,null,null,null,null,null,2396]
[2396,"A","Other","Regional","105 NSW Rural - Outback","Nonmetro","E Pop > 500",null,null,857,382.9,null,null,null,"Refer to Distribution Partner",21.666666666666668,null,2,2,0,0,0,0,3,null,null,null,null,null,2397]
[2397,"A","Other","Regional","110 NSW Rural - New England","Nonmetro","F Pop <= 500",null,null,377,382.9,null,null,null,"Refer to Distribution Partner",21.666666666666668,null,2,2,0,0,0,0,3,null,null,null,null,null,2398]
[2398,"A","Other","Regional","110 NSW Rural - New England","Nonmetro","F Pop <= 500",null,null,236,382.9,null,null,null,"Refer to Distribution Partner",21.666666666666668,null,2,2,0,0,0,0,3,null,null,null,null,null,2399]
[2399,"A","Other","Regional","110 NSW Rural - New England","Nonmetro","E Pop > 500",null,null,597,382.9,null,null,null,"Refer to Distribution Partner",21.666666666666668,null,2,2,0,0,0,0,3,null,null,null,null,null,2400]
[2400,"A","Other","Regional","110 NSW Rural - New England","Nonmetro","C Pop > 7,000",3,null,10084,506.5,null,null,null,"Regional",48.333333333333336,null,2,2,1,1,2,0,3,null,null,null,null,null,2401]
[2401,"A","Other","Regional","110 NSW Rural - New England","Nonmetro","F Pop <= 500",null,null,321,486.1,null,null,null,"Refer to Distribution Partner",21.666666666666668,null,2,2,0,0,0,0,3,null,null,null,null,null,2402]
[2402,"A","Other","Regional","110 NSW Rural - New England","Nonmetro","E Pop > 500",null,null,1792,486.1,null,null,null,"Refer to Distribution Partner",21.666666666666668,null,2,2,0,0,0,0,3,null,null,null,null,null,2403]
[2403,"A","Other","Regional","110 NSW Rural - New England","Nonmetro","E Pop > 500",null,null,718,470.4,null,null,null,"Refer to Distribution Partner",21.666666666666668,null,2,2,0,0,0,0,3,null,null,null,null,null,2404]
[2404,"A","Other","Regional","110 NSW Rural - New England","Nonmetro","E Pop > 500",null,null,1838,447.8,null,null,null,"Refer to Distribution Partner",21.666666666666668,null,2,2,0,0,0,0,3,null,null,null,null,null,2405]
[2405,"A","Other","Regional","110 NSW Rural - New England","Nonmetro","E Pop > 500",null,null,514,447.8,null,null,null,"Refer to Distribution Partner",21.666666666666668,null,2,2,0,0,0,0,3,null,null,null,null,null,2406]
[2406,"A","Other","Regional","110 NSW Rural - New England","Nonmetro","E Pop > 500",null,null,823,583,null,null,null,"Refer to Distribution Partner",21.666666666666668,null,2,2,0,0,0,0,3,null,null,null,null,null,2408]
[2408,"A","Other","Regional","110 NSW Rural - New England","Nonmetro","F Pop <= 500",null,null,376,583,null,null,null,"Refer to Distribution Partner",21.666666666666668,null,2,2,0,0,0,0,3,null,null,null,null,null,2409]
[2409,"A","Other","Regional","110 NSW Rural - New England","Nonmetro","E Pop > 500",null,null,1030,591.29999999999995,null,null,null,"Refer to Distribution Partner",21.666666666666668,null,2,2,0,0,0,0,3,null,null,null,null,null,2410]
[2410,"A","Other","Regional","110 NSW Rural - New England","Nonmetro","F Pop <= 500",null,null,278,591.29999999999995,null,null,null,"Refer to Distribution Partner",21.666666666666668,null,2,2,0,0,0,0,3,null,null,null,null,null,2411]
[2411,"A","Other","Regional","110 NSW Rural - New England","Nonmetro","F Pop <= 500",null,null,120,591.29999999999995,null,null,null,"Refer to Distribution Partner",21.666666666666668,null,2,2,0,0,0,0,3,null,null,null,null,null,2415]
[2415,"A","Other","Regional","108 NSW Rural - Port Macquarie","Nonmetro","F Pop <= 500",null,null,390,591.29999999999995,"Mining",null,null,"Refer to Distribution Partner",16.666666666666664,null,2,2,0,0,0,0,0,null,null,null,null,null,2420]
[2420,"A","Other","Regional","106 NSW Rural - Hunter Valley","Nonmetro","D Pop > 2,000",null,null,4023,170.5,null,null,null,"Refer to Distribution Partner",28.333333333333332,null,2,2,1,0,0,0,3,null,null,null,null,null,2421]
[2421,"A","Other","Regional","106 NSW Rural - Hunter Valley","Nonmetro","E Pop > 500",null,null,1828,149,"Mining",null,null,"Refer to Distribution Partner",20,null,2,2,0,0,0,1,0,null,null,null,null,null,2422]
[2422,"A","Other","Regional","108 NSW Rural - Port Macquarie","Nonmetro","D Pop > 2,000",null,null,5338,217.5,"Mining",null,null,"Refer to Distribution Partner",30,null,2,2,1,0,1,0,0,null,null,null,null,null,2423]
[2423,"A","Other","Regional","108 NSW Rural - Port Macquarie","Nonmetro","D Pop > 2,000",null,null,2964,194.9,null,null,null,"Refer to Distribution Partner",28.333333333333332,null,2,2,1,0,0,0,3,null,null,null,null,null,2424]
[2424,"A","Other","Regional","108 NSW Rural - Port Macquarie","Nonmetro","E Pop > 500",null,null,425,243.8,null,null,null,"Refer to Distribution Partner",21.666666666666668,null,2,2,0,0,0,0,3,null,null,null,null,null,2425]
[2425,"A","Other","Regional","108 NSW Rural - Port Macquarie","Nonmetro","E Pop > 500",null,null,1780,174.9,null,null,null,"Refer to Distribution Partner",21.666666666666668,null,2,2,0,0,0,0,3,null,null,null,null,null,2426]
[2426,"A","Other","Regional","108 NSW Rural - Port Macquarie","Nonmetro","E Pop > 500",null,null,720,262.60000000000002,null,null,null,"Refer to Distribution Partner",21.666666666666668,null,2,2,0,0,0,0,3,null,null,null,null,null,2427]
[2427,"A","Regional","Regional","108 NSW Rural - Port Macquarie","Nonmetro","B Regional",3,null,3114,260.2,null,null,null,"Regional",41.666666666666664,null,2,2,2,1,0,0,3,null,null,null,null,null,2428]
[2428,"A","Regional","Regional","108 NSW Rural - Port Macquarie","Nonmetro","B Regional",2,null,24009,222.5,null,null,null,"Non Metro",61.666666666666671,null,2,2,2,2,2,0,3,null,null,null,null,null,2429]
[2429,"A","Regional","Regional","108 NSW Rural - Port Macquarie","Nonmetro","B Regional",2,null,9717,246.6,null,null,null,"Regional",55.000000000000007,null,2,2,2,2,1,0,3,null,null,null,null,null,2430]
[2430,"A","Regional","Regional","108 NSW Rural - Port Macquarie","Nonmetro","B Regional",2,null,34018,245.6,null,null,null,"Non Metro",61.666666666666671,null,2,2,2,2,2,0,3,null,null,null,null,null,2431]
[2431,"A","Regional","Regional","108 NSW Rural - Port Macquarie","Nonmetro","B Regional",3,null,5133,373.2,null,null,null,"Regional",48.333333333333329,null,2,2,2,1,1,0,3,null,null,null,null,null,2439]
[2439,"A","Other","Regional","108 NSW Rural - Port Macquarie","Nonmetro","E Pop > 500",null,null,2941,285,null,null,null,"Refer to Distribution Partner",21.666666666666668,null,2,2,0,0,0,0,3,null,null,null,null,null,2440]
[2440,"A","Regional","Regional","108 NSW Rural - Port Macquarie","Nonmetro","B Regional",3,null,21819,246.9,null,null,null,"Regional",55.000000000000007,null,2,2,2,1,2,0,3,null,null,null,null,null,2441]
[2441,"A","Other","Regional","108 NSW Rural - Port Macquarie","Nonmetro","D Pop > 2,000",null,null,4345,354.1,null,null,null,"Refer to Distribution Partner",28.333333333333332,null,2,2,1,0,0,0,3,null,null,null,null,null,2443]
[2443,"A","Regional","Regional","108 NSW Rural - Port Macquarie","Nonmetro","B Regional",2,null,8894,288.8,null,null,null,"Regional",55.000000000000007,null,2,2,2,2,1,0,3,null,null,null,null,null,2444]
[2444,"A","Metro","Regional","108 NSW Rural - Port Macquarie","Nonmetro","A Metro",1,null,46284,312.8,null,null,null,"Non Metro",75,null,2,2,3,3,2,0,3,null,null,null,null,null,2445]
[2445,"A","Other","Regional","108 NSW Rural - Port Macquarie","Nonmetro","D Pop > 2,000",2,null,6466,297.60000000000002,null,null,null,"Regional",48.333333333333336,null,2,2,1,2,1,0,3,null,null,null,null,null,2446]
[2446,"A","Regional","Regional","108 NSW Rural - Port Macquarie","Nonmetro","B Regional",2,null,13330,302.5,null,null,null,"Non Metro",61.666666666666671,null,2,2,2,2,2,0,3,null,null,null,null,null,2447]
[2447,"A","Regional","Regional","108 NSW Rural - Port Macquarie","Nonmetro","B Regional",3,null,7178,385.3,null,null,null,"Regional",48.333333333333329,null,2,2,2,1,1,0,3,null,null,null,null,null,2448]
[2448,"A","Regional","Regional","108 NSW Rural - Port Macquarie","Nonmetro","B Regional",3,null,9000,397.5,null,null,null,"Regional",48.333333333333329,null,2,2,2,1,1,0,3,null,null,null,null,null,2449]
[2449,"A","Other","Regional","108 NSW Rural - Port Macquarie","Nonmetro","D Pop > 2,000",null,null,2188,390.5,null,null,null,"Refer to Distribution Partner",28.333333333333332,null,2,2,1,0,0,0,3,null,null,null,null,null,2450]
[2450,"A","Regional","Regional","104 NSW Rural - Coffs Harbour","Nonmetro","B Regional",1,null,43894,438.2,null,null,null,"Non Metro",68.333333333333329,null,2,2,2,3,2,0,3,null,null,null,null,null,2452]
[2452,"A","Regional","Regional","104 NSW Rural - Coffs Harbour","Nonmetro","B Regional",1,null,15120,428.7,null,null,null,"Non Metro",68.333333333333329,null,2,2,2,3,2,0,3,null,null,null,null,null,2453]
[2453,"A","Other","Regional","104 NSW Rural - Coffs Harbour","Nonmetro","D Pop > 2,000",null,null,2768,418.9,null,null,null,"Refer to Distribution Partner",28.333333333333332,null,2,2,1,0,0,0,3,null,null,null,null,null,2454]
[2454,"A","Other","Regional","104 NSW Rural - Coffs Harbour","Nonmetro","C Pop > 7,000",3,null,7570,412.6,null,null,null,"Regional",41.666666666666664,null,2,2,1,1,1,0,3,null,null,null,null,null,2455]
[2455,"A","Other","Regional","104 NSW Rural - Coffs Harbour","Nonmetro","D Pop > 2,000",3,null,3000,411.7,null,null,"Regional",{"$f":"IF(ISBLANK(N371),IF(AND(H371<>\"\",IF(I371=\"High Density\",\"High Density\",IF(AND(P371<=45,P371>0),\"Refer to Distribution Partner\",IF(AND(P371<=55,P371>45),\"Regional\",IF(AND(P371>55,P371<=70),\"Non Metro\",IF(F371=\"Nonmetro\",\"Non Metro\",IF(P371>70,\"Metro\",\"\"))))))=\"Refer to Distribution Partner\"),\"Regional\",IF(I371=\"High Density\",\"High Density\",IF(AND(P371<=45,P371>0),\"Refer to Distribution Partner\",IF(AND(P371<=55,P371>45),\"Regional\",IF(AND(P371>55,P371<=70),\"Non Metro\",IF(F371=\"Nonmetro\",\"Non Metro\",IF(P371>70,\"Metro\",\"\"))))))),N371)","v":"Regional"},35,null,2,2,1,1,0,0,3,null,null,null,null,null,2456]
[2456,"A","Regional","Regional","104 NSW Rural - Coffs Harbour","Nonmetro","B Regional",2,null,14749,458.6,null,null,null,"Non Metro",61.666666666666671,null,2,2,2,2,2,0,3,null,null,null,null,null,2460]
[2460,"A","Regional","Regional","104 NSW Rural - Coffs Harbour","Nonmetro","B Regional",2,null,29216,493.2,null,null,null,"Non Metro",61.666666666666671,null,2,2,2,2,2,0,3,null,null,null,null,null,2462]
[2462,"A","Other","Regional","104 NSW Rural - Coffs Harbour","Nonmetro","D Pop > 2,000",null,null,2443,493.2,null,null,null,"Refer to Distribution Partner",28.333333333333332,null,2,2,1,0,0,0,3,null,null,null,null,null,2463]
[2463,"A","Other","Regional","104 NSW Rural - Coffs Harbour","Nonmetro","C Pop > 7,000",3,null,7545,525.5,null,null,null,"Regional",41.666666666666664,null,2,2,1,1,1,0,3,null,null,null,null,null,2464]
[2464,"A","Other","Regional","104 NSW Rural - Coffs Harbour","Nonmetro","D Pop > 2,000",2,null,6738,532.70000000000005,null,null,null,"Regional",48.333333333333336,null,2,2,1,2,1,0,3,null,null,null,null,null,2465]
[2465,"A","Other","Regional","104 NSW Rural - Coffs Harbour","Nonmetro","F Pop <= 500",null,null,291,532.70000000000005,null,null,null,"Refer to Distribution Partner",21.666666666666668,null,2,2,0,0,0,0,3,null,null,null,null,null,2466]
[2466,"A","Other","Regional","104 NSW Rural - Coffs Harbour","Nonmetro","E Pop > 500",3,null,1730,536.70000000000005,null,null,"Regional","Regional",28.333333333333332,null,2,2,0,1,0,0,3,null,null,null,null,null,2469]
[2469,"A","Other","Regional","112 NSW Rural - Richmond Tweed","Nonmetro","D Pop > 2,000",null,null,4012,564.4,null,null,null,"Refer to Distribution Partner",28.333333333333332,null,2,2,1,0,0,0,3,null,null,null,null,null,2470]
[2470,"A","Regional","Regional","112 NSW Rural - Richmond Tweed","Nonmetro","B Regional",3,null,15225,583.79999999999995,null,null,null,"Regional",55.000000000000007,null,2,2,2,1,2,0,3,null,null,null,null,null,2471]
[2471,"A","Other","Regional","112 NSW Rural - Richmond Tweed","Nonmetro","D Pop > 2,000",null,null,2524,573.79999999999995,null,null,null,"Refer to Distribution Partner",28.333333333333332,null,2,2,1,0,0,0,3,null,null,null,null,null,2472]
[2472,"A","Other","Regional","112 NSW Rural - Richmond Tweed","Nonmetro","E Pop > 500",null,null,1857,572.6,null,null,null,"Refer to Distribution Partner",21.666666666666668,null,2,2,0,0,0,0,3,null,null,null,null,null,2473]
[2473,"A","Other","Regional","112 NSW Rural - Richmond Tweed","Nonmetro","D Pop > 2,000",null,null,3088,569.20000000000005,null,null,null,"Refer to Distribution Partner",28.333333333333332,null,2,2,1,0,0,0,3,null,null,null,null,null,2474]
[2474,"A","Other","Regional","112 NSW Rural - Richmond Tweed","Nonmetro","D Pop > 2,000",null,null,6332,610.79999999999995,null,null,null,"Refer to Distribution Partner",35,null,2,2,1,0,1,0,3,null,null,null,null,null,2475]
[2475,"A","Other","Regional","110 NSW Rural - New England","Nonmetro","F Pop <= 500",null,null,383,612.29999999999995,null,null,null,"Refer to Distribution Partner",21.666666666666668,null,2,2,0,0,0,0,3,null,null,null,null,null,2476]
[2476,"A","Other","Regional","112 NSW Rural - Richmond Tweed","Nonmetro","E Pop > 500",null,null,778,621.4,null,null,null,{"$f":"IF(ISBLANK(N386),IF(AND(H386<>\"\",IF(I386=\"High Density\",\"High Density\",IF(AND(P386<=45,P386>0),\"Refer to Distribution Partner\",IF(AND(P386<=55,P386>45),\"Regional\",IF(AND(P386>55,P386<=70),\"Non Metro\",IF(F386=\"Nonmetro\",\"Non Metro\",IF(P386>70,\"Metro\",\"\"))))))=\"Refer to Distribution Partner\"),\"Regional\",IF(I386=\"High Density\",\"High Density\",IF(AND(P386<=45,P386>0),\"Refer to Distribution Partner\",IF(AND(P386<=55,P386>45),\"Regional\",IF(AND(P386>55,P386<=70),\"Non Metro\",IF(F386=\"Nonmetro\",\"Non Metro\",IF(P386>70,\"Metro\",\"\"))))))),N386)","v":"Refer to Distribution Partner"},{"$f":"(R386/$AB$3*$AA$3+S386/$AB$4*$AA$4+T386/$AB$5*$AA$5+U386/$AB$6*$AA$6+V386/$AB$7*$AA$7+W386/$AB$8*$AA$8+X386/$AB$9*$AA$9)*100","v":21.666666666666668},null,{"$f":"IF(ISNUMBER(SEARCH(\"Metro\",E386)),3,IF(ISNUMBER(SEARCH(\"Rural\",E386)),2,1))","v":2},{"$f":"IF(ISNUMBER(FIND(\"Metro\",F386)),3,IF(ISNUMBER(FIND(\"Nonmetro\",F386)),2,3))","v":2},{"$f":"IF(G386=\"A Metro\",3,IF(G386=\"B Regional\",2,IF(G386=\"C Pop > 7,000\",1,IF(G386=\"D Pop > 2,000\",1,0))))","v":0},{"$f":"IF(H386=1,3,IF(H386=2,2,IF(H386=3,1,0)))","v":0},{"$f":"IF(J386>=100000,3,IF(AND(J386>=10000,J386<100000),2,IF(AND(J386>=5000,J386<10000),1,0)))","v":0},{"$f":"IF(AND(K386>=0.1,K386<25),3,IF(AND(K386>=25,K386<50),2,IF(AND(K386>=50,K386<150),1,0)))","v":0},{"$f":"IF(L386=\"\",3,0)","v":3},null,null,null,null,null,2477]
[2477,"A","Metro","Regional","112 NSW Rural - Richmond Tweed","Nonmetro","A Metro",1,null,12203,598.1,null,null,null,"Non Metro",75,null,2,2,3,3,2,0,3,null,null,null,null,null,2478]
[2478,"A","Metro","Regional","112 NSW Rural - Richmond Tweed","Nonmetro","A Metro",1,null,28310,602.4,null,null,null,"Non Metro",75,null,2,2,3,3,2,0,3,null,null,null,null,null,2479]
[2479,"A","Metro","Regional","112 NSW Rural - Richmond Tweed","Nonmetro","A Metro",1,null,4730,616.1,null,null,null,"Non Metro",61.666666666666671,null,2,2,3,3,0,0,3,null,null,null,null,null,2480]
[2480,"A","Regional","Regional","112 NSW Rural - Richmond Tweed","Nonmetro","B Regional",1,null,44599,599.5,null,null,null,"Non Metro",68.333333333333329,null,2,2,2,3,2,0,3,null,null,null,null,null,2481]
[2481,"A","Metro","Regional","112 NSW Rural - Richmond Tweed","Nonmetro","A Metro",1,null,11769,623.20000000000005,null,null,null,"Non Metro",75,null,2,2,3,3,2,0,3,null,null,null,null,null,2482]
[2482,"A","Other","Regional","112 NSW Rural - Richmond Tweed","Nonmetro","D Pop > 2,000",1,null,6280,629.70000000000005,null,null,null,"Regional",55.000000000000007,null,2,2,1,3,1,0,3,null,null,null,null,null,2483]
[2483,"A","Other","Regional","112 NSW Rural - Richmond Tweed","Nonmetro","C Pop > 7,000",1,null,10609,636.20000000000005,null,null,null,"Non Metro",61.666666666666671,null,2,2,1,3,2,0,3,null,null,null,null,null,2484]
[2484,"A","Regional","Regional","112 NSW Rural - Richmond Tweed","Nonmetro","B Regional",1,null,18872,648.9,null,null,null,"Non Metro",68.333333333333329,null,2,2,2,3,2,0,3,null,null,null,null,null,2485]
[2485,"A","Metro","Regional","112 NSW Rural - Richmond Tweed","Nonmetro","A Metro",1,null,14373,670.2,null,null,null,"Non Metro",75,null,2,2,3,3,2,0,3,null,null,null,null,null,2486]
[2486,"A","Metro","Regional","112 NSW Rural - Richmond Tweed","Nonmetro","A Metro",1,null,31594,666.5,null,null,null,"Non Metro",75,null,2,2,3,3,2,0,3,null,null,null,null,null,2487]
[2487,"A","Metro","Regional","112 NSW Rural - Richmond Tweed","Nonmetro","A Metro",1,null,13436,661.4,null,null,null,"Non Metro",75,null,2,2,3,3,2,0,3,null,null,null,null,null,2488]
[2488,"A","Metro","Regional","112 NSW Rural - Richmond Tweed","Nonmetro","A Metro",1,null,3261,655,null,null,null,"Non Metro",61.666666666666671,null,2,2,3,3,0,0,3,null,null,null,null,null,2489]
[2489,"A","Metro","Regional","112 NSW Rural - Richmond Tweed","Nonmetro","A Metro",1,null,7353,649.4,null,null,null,"Non Metro",68.333333333333329,null,2,2,3,3,1,0,3,null,null,null,null,null,2490]
[2490,"A","Other","Regional","112 NSW Rural - Richmond Tweed","Nonmetro","E Pop > 500",2,null,666,658,null,null,"Non Metro","Non Metro",35,null,2,2,0,2,0,0,3,null,null,null,null,null,2500]
[2500,"A","Metro","Regional","107 NSW Rural - Illawarra","Nonmetro","A Metro",1,null,40510,69.099999999999994,null,null,null,"Non Metro",78.333333333333329,null,2,2,3,3,2,1,3,null,null,null,null,null,2502]
[2502,"A","Metro","Regional","107 NSW Rural - Illawarra","Nonmetro","A Metro",1,null,12438,75.099999999999994,null,null,null,"Non Metro",78.333333333333329,null,2,2,3,3,2,1,3,null,null,null,null,null,2505]
[2505,"A","Metro","Regional","Unknown","Nonmetro","A Metro",1,null,5014,74.3,null,null,null,"Non Metro",70,null,1,2,3,3,1,1,3,null,null,null,null,null,2506]
[2506,"A","Metro","Regional","107 NSW Rural - Illawarra","Nonmetro","A Metro",1,null,7605,75.5,null,null,null,"Non Metro",71.666666666666671,null,2,2,3,3,1,1,3,null,null,null,null,null,2508]
[2508,"A","Metro","Regional","107 NSW Rural - Illawarra","Nonmetro","A Metro",1,null,8975,41.9,null,null,null,"Non Metro",75,null,2,2,3,3,1,2,3,null,null,null,null,null,2515]
[2515,"A","Metro","Regional","107 NSW Rural - Illawarra","Nonmetro","A Metro",1,null,11112,55.9,null,null,null,"Non Metro",78.333333333333329,null,2,2,3,3,2,1,3,null,null,null,null,null,2516]
[2516,"A","Metro","Regional","107 NSW Rural - Illawarra","Nonmetro","A Metro",1,null,6105,58.4,null,null,null,"Non Metro",71.666666666666671,null,2,2,3,3,1,1,3,null,null,null,null,null,2517]
[2517,"A","Metro","Regional","107 NSW Rural - Illawarra","Nonmetro","A Metro",1,null,13731,60.1,"Mining",null,null,"Non Metro",73.333333333333329,null,2,2,3,3,2,1,0,null,null,null,null,null,2518]
[2518,"A","Metro","Regional","107 NSW Rural - Illawarra","Nonmetro","A Metro",1,null,19067,63,null,null,null,"Non Metro",78.333333333333329,null,2,2,3,3,2,1,3,null,null,null,null,null,2519]
[2519,"A","Metro","Regional","107 NSW Rural - Illawarra","Nonmetro","A Metro",1,null,16929,65.599999999999994,null,null,null,"Non Metro",78.333333333333329,null,2,2,3,3,2,1,3,null,null,null,null,null,2525]
[2525,"A","Metro","Regional","107 NSW Rural - Illawarra","Nonmetro","A Metro",1,null,11564,71.3,null,null,null,"Non Metro",78.333333333333329,null,2,2,3,3,2,1,3,null,null,null,null,null,2526]
[2526,"A","Metro","Regional","107 NSW Rural - Illawarra","Nonmetro","A Metro",1,null,15630,75.3,null,null,null,"Non Metro",78.333333333333329,null,2,2,3,3,2,1,3,null,null,null,null,null,2527]
[2527,"A","Metro","Regional","107 NSW Rural - Illawarra","Nonmetro","A Metro",1,null,21383,88.4,null,null,null,"Non Metro",78.333333333333329,null,2,2,3,3,2,1,3,null,null,null,null,null,2528]
[2528,"A","Metro","Regional","107 NSW Rural - Illawarra","Nonmetro","A Metro",1,null,23774,82.7,null,null,null,"Non Metro",78.333333333333329,null,2,2,3,3,2,1,3,null,null,null,null,null,2529]
[2529,"A","Metro","Regional","107 NSW Rural - Illawarra","Nonmetro","A Metro",1,null,26025,86,null,null,null,"Non Metro",78.333333333333329,null,2,2,3,3,2,1,3,null,null,null,null,null,2530]
[2530,"A","Metro","Regional","107 NSW Rural - Illawarra","Nonmetro","A Metro",1,null,32019,80,null,null,null,"Non Metro",78.333333333333329,null,2,2,3,3,2,1,3,null,null,null,null,null,2533]
[2533,"A","Metro","Regional","107 NSW Rural - Illawarra","Nonmetro","A Metro",1,null,15627,95.2,null,null,null,"Non Metro",78.333333333333329,null,2,2,3,3,2,1,3,null,null,null,null,null,2534]
[2534,"A","Metro","Regional","107 NSW Rural - Illawarra","Nonmetro","A Metro",1,null,5709,104,null,null,null,"Non Metro",71.666666666666671,null,2,2,3,3,1,1,3,null,null,null,null,null,2535]
[2535,"A","Regional","Regional","114 NSW Rural - Shoalhaven","Nonmetro","B Regional",2,null,7338,115.3,null,null,null,"Non Metro",58.333333333333336,null,2,2,2,2,1,1,3,null,null,null,null,null,2536]
[2536,"A","Regional","Regional","101 NSW Rural - Goulburn & Snowy Mountains","Nonmetro","B Regional",3,null,17716,227.1,null,null,null,"Regional",55.000000000000007,null,2,2,2,1,2,0,3,null,null,null,null,null,2537]
[2537,"A","Regional","Regional","101 NSW Rural - Goulburn & Snowy Mountains","Nonmetro","B Regional",3,null,11812,250.7,null,null,null,"Regional",55.000000000000007,null,2,2,2,1,2,0,3,null,null,null,null,null,2538]
[2538,"A","Regional","Regional","114 NSW Rural - Shoalhaven","Nonmetro","B Regional",2,null,2397,179.2,null,null,null,"Regional",48.333333333333336,null,2,2,2,2,0,0,3,null,null,null,null,null,2539]
[2539,"A","Regional","Regional","114 NSW Rural - Shoalhaven","Nonmetro","B Regional",2,null,17979,178.2,null,null,null,"Non Metro",61.666666666666671,null,2,2,2,2,2,0,3,null,null,null,null,null,2540]
[2540,"A","Regional","Regional","114 NSW Rural - Shoalhaven","Nonmetro","B Regional",2,null,45121,143.1,null,null,null,"Non Metro",65,null,2,2,2,2,2,1,3,null,null,null,null,null,2541]
[2541,"A","Metro","Regional","114 NSW Rural - Shoalhaven","Nonmetro","A Metro",2,null,25641,125.2,null,null,null,"Non Metro",71.666666666666671,null,2,2,3,2,2,1,3,null,null,null,null,null,2545]
[2545,"A","Other","Regional","101 NSW Rural - Goulburn & Snowy Mountains","Nonmetro","E Pop > 500",null,null,1044,270.60000000000002,null,null,null,"Refer to Distribution Partner",21.666666666666668,null,2,2,0,0,0,0,3,null,null,null,null,null,2546]
[2546,"A","Regional","Regional","101 NSW Rural - Goulburn & Snowy Mountains","Nonmetro","B Regional",3,null,9121,286.3,null,null,null,"Regional",48.333333333333329,null,2,2,2,1,1,0,3,null,null,null,null,null,2548]
[2548,"A","Regional","Regional","101 NSW Rural - Goulburn & Snowy Mountains","Nonmetro","B Regional",3,null,7734,355.4,null,null,null,"Regional",48.333333333333329,null,2,2,2,1,1,0,3,null,null,null,null,null,2549]
[2549,"A","Regional","Regional","101 NSW Rural - Goulburn & Snowy Mountains","Nonmetro","B Regional",3,null,3785,362.3,null,null,null,"Regional",41.666666666666664,null,2,2,2,1,0,0,3,null,null,null,null,null,2550]
[2550,"A","Regional","Regional","101 NSW Rural - Goulburn & Snowy Mountains","Nonmetro","B Regional",3,null,15858,338.6,null,null,null,"Regional",55.000000000000007,null,2,2,2,1,2,0,3,null,null,null,null,null,2551]
[2551,"A","Regional","Regional","101 NSW Rural - Goulburn & Snowy Mountains","Nonmetro","B Regional",3,null,3501,375.1,null,null,null,"Regional",41.666666666666664,null,2,2,2,1,0,0,3,null,null,null,null,null,2555]
[2555,"A","Other","Regional","127 NSW Metro - Liverpool","Nonmetro","F Pop <= 500",1,null,225,45.9,null,null,null,"Regional",50,null,3,2,0,3,0,2,3,null,null,null,null,null,2556]
[2556,"A","Metro","Regional","127 NSW Metro - Liverpool","Nonmetro","A Metro",1,null,2507,45.9,null,null,null,"Non Metro",70,null,3,2,3,3,0,2,3,null,null,null,null,null,2557]
[2557,"A","Metro","Regional","127 NSW Metro - Liverpool","Nonmetro","A Metro",1,null,8952,43.2,null,null,null,"Non Metro",76.666666666666671,null,3,2,3,3,1,2,3,null,null,null,null,null,2558]
[2558,"A","Metro","Metro","123 NSW Metro - Campbelltown","Metro","A Metro",1,null,11114,41,null,null,null,"Metro",90,null,3,3,3,3,2,2,3,null,null,null,null,null,2559]
[2559,"A","Metro","Metro","123 NSW Metro - Campbelltown","Metro","A Metro",1,null,3069,42.1,null,null,null,"Metro",76.666666666666671,null,3,3,3,3,0,2,3,null,null,null,null,null,2560]
[2560,"A","Metro","Metro","123 NSW Metro - Campbelltown","Metro","A Metro",1,null,76521,43.7,null,null,null,"Metro",90,null,3,3,3,3,2,2,3,null,null,null,null,null,2563]
[2563,"A","Metro","Metro","123 NSW Metro - Campbelltown","Metro","A Metro",1,null,307,0,null,null,null,"Non Metro",70,null,3,3,3,3,0,0,3,null,null,null,null,null,2564]
[2564,"A","Metro","Metro","123 NSW Metro - Campbelltown","Metro","A Metro",1,null,13924,32.700000000000003,null,null,null,"Metro",90,null,3,3,3,3,2,2,3,null,null,null,null,null,2565]
[2565,"A","Metro","Metro","123 NSW Metro - Campbelltown","Metro","A Metro",1,null,19987,35.799999999999997,null,null,null,"Metro",90,null,3,3,3,3,2,2,3,null,null,null,null,null,2566]
[2566,"A","Metro","Metro","123 NSW Metro - Campbelltown","Metro","A Metro",1,null,26327,38.200000000000003,null,null,null,"Metro",90,null,3,3,3,3,2,2,3,null,null,null,null,null,2567]
[2567,"A","Metro","Metro","123 NSW Metro - Campbelltown","Metro","A Metro",1,null,38500,46.7,null,null,null,"Metro",90,null,3,3,3,3,2,2,3,null,null,null,null,null,2568]
[2568,"A","Metro","Metro","123 NSW Metro - Campbelltown","Metro","A Metro",1,null,1150,0,null,null,null,"Non Metro",70,null,3,3,3,3,0,0,3,null,null,null,null,null,2569]
[2569,"A","Metro","Metro","123 NSW Metro - Campbelltown","Metro","A Metro",1,null,1362,0,null,null,null,"Non Metro",70,null,3,3,3,3,0,0,3,null,null,null,null,null,2570]
[2570,"A","Metro","Metro","123 NSW Metro - Campbelltown","Metro","A Metro",1,null,40104,49.9,null,null,null,"Metro",90,null,3,3,3,3,2,2,3,null,null,null,null,null,2571]
[2571,"A","Metro","Metro","123 NSW Metro - Campbelltown","Metro","A Metro",1,null,11850,65.7,null,null,null,"Metro",86.666666666666671,null,3,3,3,3,2,1,3,null,null,null,null,null,2572]
[2572,"A","Metro","Metro","123 NSW Metro - Campbelltown","Metro","A Metro",1,null,4477,69.400000000000006,null,null,null,"Metro",73.333333333333343,null,3,3,3,3,0,1,3,null,null,null,null,null,2573]
[2573,"A","Metro","Metro","123 NSW Metro - Campbelltown","Metro","A Metro",1,null,5067,69.099999999999994,null,null,null,"Metro",80,null,3,3,3,3,1,1,3,null,null,null,null,null,2574]
[2574,"A","Metro","Metro","123 NSW Metro - Campbelltown","Metro","A Metro",1,null,5741,73.7,null,null,null,"Metro",80,null,3,3,3,3,1,1,3,null,null,null,null,null,2575]
[2575,"A","Metro","Regional","114 NSW Rural - Shoalhaven","Nonmetro","A Metro",1,null,15476,95.2,null,null,null,{"$f":"IF(ISBLANK(N450),IF(AND(H450<>\"\",IF(I450=\"High Density\",\"High Density\",IF(AND(P450<=45,P450>0),\"Refer to Distribution Partner\",IF(AND(P450<=55,P450>45),\"Regional\",IF(AND(P450>55,P450<=70),\"Non Metro\",IF(F450=\"Nonmetro\",\"Non Metro\",IF(P450>70,\"Metro\",\"\"))))))=\"Refer to Distribution Partner\"),\"Regional\",IF(I450=\"High Density\",\"High Density\",IF(AND(P450<=45,P450>0),\"Refer to Distribution Partner\",IF(AND(P450<=55,P450>45),\"Regional\",IF(AND(P450>55,P450<=70),\"Non Metro\",IF(F450=\"Nonmetro\",\"Non Metro\",IF(P450>70,\"Metro\",\"\"))))))),N450)","v":"Non Metro"},{"$f":"(R450/$AB$3*$AA$3+S450/$AB$4*$AA$4+T450/$AB$5*$AA$5+U450/$AB$6*$AA$6+V450/$AB$7*$AA$7+W450/$AB$8*$AA$8+X450/$AB$9*$AA$9)*100","v":78.333333333333329},null,{"$f":"IF(ISNUMBER(SEARCH(\"Metro\",E450)),3,IF(ISNUMBER(SEARCH(\"Rural\",E450)),2,1))","v":2},{"$f":"IF(ISNUMBER(FIND(\"Metro\",F450)),3,IF(ISNUMBER(FIND(\"Nonmetro\",F450)),2,3))","v":2},{"$f":"IF(G450=\"A Metro\",3,IF(G450=\"B Regional\",2,IF(G450=\"C Pop > 7,000\",1,IF(G450=\"D Pop > 2,000\",1,0))))","v":3},{"$f":"IF(H450=1,3,IF(H450=2,2,IF(H450=3,1,0)))","v":3},{"$f":"IF(J450>=100000,3,IF(AND(J450>=10000,J450<100000),2,IF(AND(J450>=5000,J450<10000),1,0)))","v":2},{"$f":"IF(AND(K450>=0.1,K450<25),3,IF(AND(K450>=25,K450<50),2,IF(AND(K450>=50,K450<150),1,0)))","v":1},{"$f":"IF(L450=\"\",3,0)","v":3},null,null,null,null,null,2576]
[2576,"A","Metro","Regional","114 NSW Rural - Shoalhaven","Nonmetro","A Metro",1,null,13431,99.8,null,null,null,"Non Metro",78.333333333333329,null,2,2,3,3,2,1,3,null,null,null,null,null,2577]
[2577,"A","Regional","Regional","114 NSW Rural - Shoalhaven","Nonmetro","B Regional",1,null,15414,108.5,null,null,null,"Non Metro",71.666666666666671,null,2,2,2,3,2,1,3,null,null,null,null,null,2578]
[2578,"A","Other","Regional","114 NSW Rural - Shoalhaven","Nonmetro","D Pop > 2,000",1,null,2689,120.7,null,null,null,"Regional",51.666666666666671,null,2,2,1,3,0,1,3,null,null,null,null,null,2579]
[2579,"A","Other","Regional","101 NSW Rural - Goulburn & Snowy Mountains","Nonmetro","D Pop > 2,000",1,null,4029,134.30000000000001,null,null,null,"Regional",51.666666666666671,null,2,2,1,3,0,1,3,null,null,null,null,null,2580]
[2580,"A","Regional","Regional","101 NSW Rural - Goulburn & Snowy Mountains","Nonmetro","B Regional",2,null,29224,167.7,null,null,null,"Non Metro",61.666666666666671,null,2,2,2,2,2,0,3,null,null,null,null,null,2581]
[2581,"A","Other","Regional","101 NSW Rural - Goulburn & Snowy Mountains","Nonmetro","E Pop > 500",null,null,2095,206,null,null,null,"Refer to Distribution Partner",21.666666666666668,null,2,2,0,0,0,0,3,null,null,null,null,null,2582]
[2582,"A","Regional","Regional","101 NSW Rural - Goulburn & Snowy Mountains","Nonmetro","B Regional",3,null,12442,237,null,null,null,"Regional",55.000000000000007,null,2,2,2,1,2,0,3,null,null,null,null,null,2583]
[2583,"A","Other","Regional","101 NSW Rural - Goulburn & Snowy Mountains","Nonmetro","D Pop > 2,000",3,null,4382,174.4,null,null,"Regional","Regional",35,null,2,2,1,1,0,0,3,null,null,null,null,null,2584]
[2584,"A","Other","Regional","101 NSW Rural - Goulburn & Snowy Mountains","Nonmetro","F Pop <= 500",null,null,543,253.3,null,null,null,"Refer to Distribution Partner",21.666666666666668,null,2,2,0,0,0,0,3,null,null,null,null,null,2585]
[2585,"A","Other","Regional","101 NSW Rural - Goulburn & Snowy Mountains","Nonmetro","F Pop <= 500",null,null,224,0,null,null,null,"Refer to Distribution Partner",21.666666666666668,null,2,2,0,0,0,0,3,null,null,null,null,null,2586]
[2586,"A","Other","Regional","101 NSW Rural - Goulburn & Snowy Mountains","Nonmetro","D Pop > 2,000",null,null,2619,234.7,null,null,null,"Refer to Distribution Partner",28.333333333333332,null,2,2,1,0,0,0,3,null,null,null,null,null,2587]
[2587,"A","Other","Regional","101 NSW Rural - Goulburn & Snowy Mountains","Nonmetro","D Pop > 2,000",null,null,2917,272.8,null,null,null,"Refer to Distribution Partner",28.333333333333332,null,2,2,1,0,0,0,3,null,null,null,null,null,2588]
[2588,"A","Other","Regional","113 NSW Rural - Riverina","Nonmetro","F Pop <= 500",null,null,260,0,null,null,null,"Refer to Distribution Partner",21.666666666666668,null,2,2,0,0,0,0,3,null,null,null,null,null,2590]
[2590,"A","Other","Regional","113 NSW Rural - Riverina","Nonmetro","C Pop > 7,000",null,null,7093,305.39999999999998,null,null,null,"Refer to Distribution Partner",35,null,2,2,1,0,1,0,3,null,null,null,null,null,2594]
[2594,"A","Other","Regional","101 NSW Rural - Goulburn & Snowy Mountains","Nonmetro","C Pop > 7,000",3,null,11672,272.7,null,null,null,"Regional",48.333333333333336,null,2,2,1,1,2,0,3,null,null,null,null,null,2600]
[2600,"A","Metro","Metro","801 ACT Metro - Canberra","Metro","A Metro",1,null,7247,0,null,null,null,"Metro",76.666666666666671,null,3,3,3,3,1,0,3,null,null,null,null,null,2601]
[2601,"A","Metro","Metro","801 ACT Metro - Canberra","Metro","A Metro",1,null,6363,0,null,null,null,"Metro",76.666666666666671,null,3,3,3,3,1,0,3,null,null,null,null,null,2602]
[2602,"A","Metro","Metro","801 ACT Metro - Canberra","Metro","A Metro",1,null,30450,0,null,null,null,"Metro",83.333333333333343,null,3,3,3,3,2,0,3,null,null,null,null,null,2603]
[2603,"A","Metro","Metro","801 ACT Metro - Canberra","Metro","A Metro",1,null,9359,0,null,null,null,"Metro",76.666666666666671,null,3,3,3,3,1,0,3,null,null,null,null,null,2604]
[2604,"A","Metro","Metro","801 ACT Metro - Canberra","Metro","A Metro",1,null,10383,0,null,null,null,"Metro",83.333333333333343,null,3,3,3,3,2,0,3,null,null,null,null,null,2605]
[2605,"A","Metro","Metro","801 ACT Metro - Canberra","Metro","A Metro",1,null,11725,0,null,null,null,"Metro",83.333333333333343,null,3,3,3,3,2,0,3,null,null,null,null,null,2606]
[2606,"A","Metro","Metro","801 ACT Metro - Canberra","Metro","A Metro",1,null,9422,0,null,null,null,"Metro",76.666666666666671,null,3,3,3,3,1,0,3,null,null,null,null,null,2607]
[2607,"A","Metro","Metro","801 ACT Metro - Canberra","Metro","A Metro",1,null,13614,0,null,null,null,"Metro",83.333333333333343,null,3,3,3,3,2,0,3,null,null,null,null,null,2609]
[2609,"A","Metro","Metro","801 ACT Metro - Canberra","Metro","A Metro",1,null,887,0,null,null,null,"Non Metro",70,null,3,3,3,3,0,0,3,null,null,null,null,null,2611]
[2611,"A","Metro","Metro","801 ACT Metro - Canberra","Metro","A Metro",1,null,28018,0,null,null,null,"Metro",83.333333333333343,null,3,3,3,3,2,0,3,null,null,null,null,null,2612]
[2612,"A","Metro","Metro","801 ACT Metro - Canberra","Metro","A Metro",1,null,16184,0,null,null,null,"Metro",83.333333333333343,null,3,3,3,3,2,0,3,null,null,null,null,null,2614]
[2614,"A","Metro","Metro","801 ACT Metro - Canberra","Metro","A Metro",1,null,19390,0,null,null,null,"Metro",83.333333333333343,null,3,3,3,3,2,0,3,null,null,null,null,null,2615]
[2615,"A","Metro","Metro","801 ACT Metro - Canberra","Metro","A Metro",1,null,44177,0,null,null,null,"Metro",83.333333333333343,null,3,3,3,3,2,0,3,null,null,null,null,null,2617]
[2617,"A","Metro","Metro","801 ACT Metro - Canberra","Metro","A Metro",1,null,32503,0,null,null,null,"Metro",83.333333333333343,null,3,3,3,3,2,0,3,null,null,null,null,null,2618]
[2618,"A","Metro","Metro","101 NSW Rural - Goulburn & Snowy Mountains","Metro","A Metro",1,null,1445,202.7,null,null,null,"Non Metro",68.333333333333329,null,2,3,3,3,0,0,3,null,null,null,null,null,2619]
[2619,"A","Metro","Metro","101 NSW Rural - Goulburn & Snowy Mountains","Metro","A Metro",1,null,9508,249.1,null,null,null,"Metro",75,null,2,3,3,3,1,0,3,null,null,null,null,null,2620]
[2620,"A","Metro","Metro","101 NSW Rural - Goulburn & Snowy Mountains","Metro","A Metro",1,null,39289,244.5,null,null,null,"Metro",81.666666666666671,null,2,3,3,3,2,0,3,null,null,null,null,null,2621]
[2621,"A","Metro","Metro","101 NSW Rural - Goulburn & Snowy Mountains","Metro","A Metro",1,null,6056,224.7,null,null,null,"Metro",75,null,2,3,3,3,1,0,3,null,null,null,null,null,2622]
[2622,"A","Other","Metro","101 NSW Rural - Goulburn & Snowy Mountains","Metro","D Pop > 2,000",null,null,3922,218.1,null,null,null,"Refer to Distribution Partner",35,null,2,3,1,0,0,0,3,null,null,null,null,null,2623]
[2623,"A","Other","Metro","101 NSW Rural - Goulburn & Snowy Mountains","Metro","E Pop > 500",null,null,610,250.2,null,null,null,"Refer to Distribution Partner",28.333333333333332,null,2,3,0,0,0,0,3,null,null,null,null,null,2625]
[2625,"A","Other","Metro","101 NSW Rural - Goulburn & Snowy Mountains","Metro","F Pop <= 500",null,null,389,369.7,null,null,null,"Refer to Distribution Partner",28.333333333333332,null,2,3,0,0,0,0,3,null,null,null,null,null,2626]
[2626,"A","Other","Metro","101 NSW Rural - Goulburn & Snowy Mountains","Metro","F Pop <= 500",null,null,500,369.7,null,null,null,"Refer to Distribution Partner",28.333333333333332,null,2,3,0,0,0,0,3,null,null,null,null,null,2627]
[2627,"A","Other","Metro","101 NSW Rural - Goulburn & Snowy Mountains","Metro","D Pop > 2,000",null,null,4622,369.7,null,null,null,"Refer to Distribution Partner",35,null,2,3,1,0,0,0,3,null,null,null,null,null,2628]
[2628,"A","Other","Metro","101 NSW Rural - Goulburn & Snowy Mountains","Metro","E Pop > 500",3,null,1912,355.3,null,null,"Regional","Regional",35,null,2,3,0,1,0,0,3,null,null,null,null,null,2629]
[2629,"A","Other","Metro","101 NSW Rural - Goulburn & Snowy Mountains","Metro","E Pop > 500",null,null,529,327.5,null,null,null,"Refer to Distribution Partner",28.333333333333332,null,2,3,0,0,0,0,3,null,null,null,null,null,2630]
[2630,"A","Other","Metro","101 NSW Rural - Goulburn & Snowy Mountains","Metro","C Pop > 7,000",3,null,8691,322.8,null,null,null,"Regional",48.333333333333329,null,2,3,1,1,1,0,3,null,null,null,null,null,2631]
[2631,"A","Other","Metro","101 NSW Rural - Goulburn & Snowy Mountains","Metro","E Pop > 500",null,null,570,345.2,null,null,null,"Refer to Distribution Partner",28.333333333333332,null,2,3,0,0,0,0,3,null,null,null,null,null,2632]
[2632,"A","Other","Metro","101 NSW Rural - Goulburn & Snowy Mountains","Metro","E Pop > 500",null,null,1834,383.4,null,null,null,"Refer to Distribution Partner",28.333333333333332,null,2,3,0,0,0,0,3,null,null,null,null,null,2633]
[2633,"A","Other","Metro","101 NSW Rural - Goulburn & Snowy Mountains","Metro","F Pop <= 500",null,null,379,383.4,null,null,null,"Refer to Distribution Partner",28.333333333333332,null,2,3,0,0,0,0,3,null,null,null,null,null,2640]
[2640,"A","Regional","Regional","109 NSW Rural - Albury & Murray","Nonmetro","B Regional",1,null,36343,460.7,null,null,null,"Non Metro",68.333333333333329,null,2,2,2,3,2,0,3,null,null,null,null,null,2641]
[2641,"A","Regional","Regional","109 NSW Rural - Albury & Murray","Nonmetro","B Regional",1,null,15070,458,null,null,null,"Non Metro",68.333333333333329,null,2,2,2,3,2,0,3,null,null,null,null,null,2642]
[2642,"A","Other","Regional","109 NSW Rural - Albury & Murray","Nonmetro","D Pop > 2,000",3,null,4793,433.1,null,null,"Regional","Regional",35,null,2,2,1,1,0,0,3,null,null,null,null,null,2643]
[2643,"A","Other","Regional","109 NSW Rural - Albury & Murray","Nonmetro","D Pop > 2,000",3,null,2777,478.6,null,null,"Regional","Regional",35,null,2,2,1,1,0,0,3,null,null,null,null,null,2644]
[2644,"A","Other","Regional","109 NSW Rural - Albury & Murray","Nonmetro","D Pop > 2,000",null,null,2403,412.1,null,null,null,"Refer to Distribution Partner",28.333333333333332,null,2,2,1,0,0,0,3,null,null,null,null,null,2645]
[2645,"A","Other","Regional","109 NSW Rural - Albury & Murray","Nonmetro","F Pop <= 500",null,null,402,412.1,null,null,null,"Refer to Distribution Partner",21.666666666666668,null,2,2,0,0,0,0,3,null,null,null,null,null,2646]
[2646,"A","Other","Regional","109 NSW Rural - Albury & Murray","Nonmetro","D Pop > 2,000",null,null,6758,499.8,null,null,null,"Refer to Distribution Partner",35,null,2,2,1,0,1,0,3,null,null,null,null,null,2647]
[2647,"A","Other","Regional","109 NSW Rural - Albury & Murray","Nonmetro","E Pop > 500",3,null,2161,529.6,null,null,"Regional","Regional",28.333333333333332,null,2,2,0,1,0,0,3,null,null,null,null,null,2648]
[2648,"A","Other","Regional","109 NSW Rural - Albury & Murray","Nonmetro","D Pop > 2,000",null,null,2369,854.8,null,null,null,"Refer to Distribution Partner",28.333333333333332,null,2,2,1,0,0,0,3,null,null,null,null,null,2649]
[2649,"A","Other","Regional","113 NSW Rural - Riverina","Nonmetro","F Pop <= 500",null,null,26,854.8,null,null,null,"Refer to Distribution Partner",21.666666666666668,null,2,2,0,0,0,0,3,null,null,null,null,null,2650]
[2650,"A","Regional","Regional","113 NSW Rural - Riverina","Nonmetro","B Regional",1,null,56974,379.9,null,null,null,"Non Metro",68.333333333333329,null,2,2,2,3,2,0,3,null,null,null,null,null,2651]
[2651,"A","Regional","Regional","113 NSW Rural - Riverina","Nonmetro","B Regional",1,null,2274,371.8,null,null,null,"Regional",55.000000000000007,null,2,2,2,3,0,0,3,null,null,null,null,null,2652]
[2652,"A","Other","Regional","113 NSW Rural - Riverina","Nonmetro","D Pop > 2,000",null,null,4583,386.9,null,null,null,"Refer to Distribution Partner",28.333333333333332,null,2,2,1,0,0,0,3,null,null,null,null,null,2653]
[2653,"A","Other","Regional","113 NSW Rural - Riverina","Nonmetro","D Pop > 2,000",null,null,2537,360.9,null,null,null,"Refer to Distribution Partner",28.333333333333332,null,2,2,1,0,0,0,3,null,null,null,null,null,2655]
[2655,"A","Other","Regional","113 NSW Rural - Riverina","Nonmetro","E Pop > 500",null,null,1336,406.3,null,null,null,"Refer to Distribution Partner",21.666666666666668,null,2,2,0,0,0,0,3,null,null,null,null,null,2656]
[2656,"A","Other","Regional","113 NSW Rural - Riverina","Nonmetro","E Pop > 500",null,null,1272,437.2,null,null,null,"Refer to Distribution Partner",21.666666666666668,null,2,2,0,0,0,0,3,null,null,null,null,null,2658]
[2658,"A","Other","Regional","109 NSW Rural - Albury & Murray","Nonmetro","E Pop > 500",null,null,1433,423.5,null,null,null,"Refer to Distribution Partner",21.666666666666668,null,2,2,0,0,0,0,3,null,null,null,null,null,2659]
[2659,"A","Other","Regional","109 NSW Rural - Albury & Murray","Nonmetro","E Pop > 500",null,null,893,445.9,null,null,null,"Refer to Distribution Partner",21.666666666666668,null,2,2,0,0,0,0,3,null,null,null,null,null,2660]
[2660,"A","Other","Regional","109 NSW Rural - Albury & Murray","Nonmetro","E Pop > 500",null,null,1610,430,null,null,null,"Refer to Distribution Partner",21.666666666666668,null,2,2,0,0,0,0,3,null,null,null,null,null,2661]
[2661,"A","Other","Regional","113 NSW Rural - Riverina","Nonmetro","F Pop <= 500",null,null,633,0,null,null,null,{"$f":"IF(ISBLANK(N514),IF(AND(H514<>\"\",IF(I514=\"High Density\",\"High Density\",IF(AND(P514<=45,P514>0),\"Refer to Distribution Partner\",IF(AND(P514<=55,P514>45),\"Regional\",IF(AND(P514>55,P514<=70),\"Non Metro\",IF(F514=\"Nonmetro\",\"Non Metro\",IF(P514>70,\"Metro\",\"\"))))))=\"Refer to Distribution Partner\"),\"Regional\",IF(I514=\"High Density\",\"High Density\",IF(AND(P514<=45,P514>0),\"Refer to Distribution Partner\",IF(AND(P514<=55,P514>45),\"Regional\",IF(AND(P514>55,P514<=70),\"Non Metro\",IF(F514=\"Nonmetro\",\"Non Metro\",IF(P514>70,\"Metro\",\"\"))))))),N514)","v":"Refer to Distribution Partner"},{"$f":"(R514/$AB$3*$AA$3+S514/$AB$4*$AA$4+T514/$AB$5*$AA$5+U514/$AB$6*$AA$6+V514/$AB$7*$AA$7+W514/$AB$8*$AA$8+X514/$AB$9*$AA$9)*100","v":21.666666666666668},null,{"$f":"IF(ISNUMBER(SEARCH(\"Metro\",E514)),3,IF(ISNUMBER(SEARCH(\"Rural\",E514)),2,1))","v":2},{"$f":"IF(ISNUMBER(FIND(\"Metro\",F514)),3,IF(ISNUMBER(FIND(\"Nonmetro\",F514)),2,3))","v":2},{"$f":"IF(G514=\"A Metro\",3,IF(G514=\"B Regional\",2,IF(G514=\"C Pop > 7,000\",1,IF(G514=\"D Pop > 2,000\",1,0))))","v":0},{"$f":"IF(H514=1,3,IF(H514=2,2,IF(H514=3,1,0)))","v":0},{"$f":"IF(J514>=100000,3,IF(AND(J514>=10000,J514<100000),2,IF(AND(J514>=5000,J514<10000),1,0)))","v":0},{"$f":"IF(AND(K514>=0.1,K514<25),3,IF(AND(K514>=25,K514<50),2,IF(AND(K514>=50,K514<150),1,0)))","v":0},{"$f":"IF(L514=\"\",3,0)","v":3},null,null,null,null,null,2663]
[2663,"A","Other","Regional","113 NSW Rural - Riverina","Nonmetro","D Pop > 2,000",null,null,5186,350.9,null,null,null,"Refer to Distribution Partner",35,null,2,2,1,0,1,0,3,null,null,null,null,null,2665]
[2665,"A","Other","Regional","113 NSW Rural - Riverina","Nonmetro","D Pop > 2,000",null,null,2226,397,null,null,null,"Refer to Distribution Partner",28.333333333333332,null,2,2,1,0,0,0,3,null,null,null,null,null,2666]
[2666,"A","Other","Regional","113 NSW Rural - Riverina","Nonmetro","D Pop > 2,000",null,null,5673,344.1,null,null,null,"Refer to Distribution Partner",35,null,2,2,1,0,1,0,3,null,null,null,null,null,2668]
[2668,"A","Other","Regional","103 NSW Rural - Central Tablelands","Nonmetro","F Pop <= 500",null,null,459,0,null,null,null,"Refer to Distribution Partner",21.666666666666668,null,2,2,0,0,0,0,3,null,null,null,null,null,2669]
[2669,"A","Other","Regional","103 NSW Rural - Central Tablelands","Nonmetro","E Pop > 500",null,null,1654,406.6,null,null,null,"Refer to Distribution Partner",21.666666666666668,null,2,2,0,0,0,0,3,null,null,null,null,null,2671]
[2671,"A","Other","Regional","103 NSW Rural - Central Tablelands","Nonmetro","D Pop > 2,000",null,null,4112,368.9,"Mining",null,null,"Refer to Distribution Partner",23.333333333333332,null,2,2,1,0,0,0,0,null,null,null,null,null,2672]
[2672,"A","Other","Regional","103 NSW Rural - Central Tablelands","Nonmetro","E Pop > 500",null,null,1576,451.8,null,null,null,"Refer to Distribution Partner",21.666666666666668,null,2,2,0,0,0,0,3,null,null,null,null,null,2675]
[2675,"A","Other","Regional","113 NSW Rural - Riverina","Nonmetro","E Pop > 500",null,null,1562,526.9,null,null,null,"Refer to Distribution Partner",21.666666666666668,null,2,2,0,0,0,0,3,null,null,null,null,null,2678]
[2678,"A","Regional","Regional","113 NSW Rural - Riverina","Nonmetro","B Regional",null,null,340,526.9,null,null,null,"Refer to Distribution Partner",35,null,2,2,2,0,0,0,3,null,null,null,null,null,2680]
[2680,"A","Regional","Regional","113 NSW Rural - Riverina","Nonmetro","B Regional",2,null,23940,477,null,null,null,"Non Metro",61.666666666666671,null,2,2,2,2,2,0,3,null,null,null,null,null,2681]
[2681,"A","Other","Regional","113 NSW Rural - Riverina","Nonmetro","E Pop > 500",null,null,1732,464,null,null,null,"Refer to Distribution Partner",21.666666666666668,null,2,2,0,0,0,0,3,null,null,null,null,null,2700]
[2700,"A","Other","Regional","113 NSW Rural - Riverina","Nonmetro","D Pop > 2,000",null,null,4922,438.6,null,null,null,"Refer to Distribution Partner",28.333333333333332,null,2,2,1,0,0,0,3,null,null,null,null,null,2701]
[2701,"A","Other","Regional","113 NSW Rural - Riverina","Nonmetro","D Pop > 2,000",null,null,2388,382.5,null,null,null,"Refer to Distribution Partner",28.333333333333332,null,2,2,1,0,0,0,3,null,null,null,null,null,2702]
[2702,"A","Other","Regional","113 NSW Rural - Riverina","Nonmetro","E Pop > 500",null,null,779,396.2,null,null,null,"Refer to Distribution Partner",21.666666666666668,null,2,2,0,0,0,0,3,null,null,null,null,null,2703]
[2703,"A","Other","Regional","113 NSW Rural - Riverina","Nonmetro","E Pop > 500",null,null,984,448.5,null,null,null,"Refer to Distribution Partner",21.666666666666668,null,2,2,0,0,0,0,3,null,null,null,null,null,2705]
[2705,"A","Other","Regional","113 NSW Rural - Riverina","Nonmetro","C Pop > 7,000",null,null,10153,449.5,null,null,null,"Refer to Distribution Partner",41.666666666666671,null,2,2,1,0,2,0,3,null,null,null,null,null,2706]
[2706,"A","Other","Regional","113 NSW Rural - Riverina","Nonmetro","E Pop > 500",null,null,1162,485.6,null,null,null,"Refer to Distribution Partner",21.666666666666668,null,2,2,0,0,0,0,3,null,null,null,null,null,2707]
[2707,"A","Other","Regional","113 NSW Rural - Riverina","Nonmetro","E Pop > 500",null,null,1348,500.3,null,null,null,"Refer to Distribution Partner",21.666666666666668,null,2,2,0,0,0,0,3,null,null,null,null,null,2710]
[2710,"A","Other","Regional","109 NSW Rural - Albury & Murray","Nonmetro","C Pop > 7,000",3,null,10123,602.1,null,null,null,"Regional",48.333333333333336,null,2,2,1,1,2,0,3,null,null,null,null,null,2711]
[2711,"A","Other","Regional","109 NSW Rural - Albury & Murray","Nonmetro","D Pop > 2,000",null,null,3360,587.4,null,null,null,"Refer to Distribution Partner",28.333333333333332,null,2,2,1,0,0,0,3,null,null,null,null,null,2712]
[2712,"A","Other","Regional","109 NSW Rural - Albury & Murray","Nonmetro","E Pop > 500",null,null,1356,531.29999999999995,null,null,null,"Refer to Distribution Partner",21.666666666666668,null,2,2,0,0,0,0,3,null,null,null,null,null,2713]
[2713,"A","Other","Regional","109 NSW Rural - Albury & Murray","Nonmetro","D Pop > 2,000",null,null,2797,551.20000000000005,null,null,null,"Refer to Distribution Partner",28.333333333333332,null,2,2,1,0,0,0,3,null,null,null,null,null,2714]
[2714,"A","Other","Regional","109 NSW Rural - Albury & Murray","Nonmetro","D Pop > 2,000",null,null,2769,557.6,null,null,null,"Refer to Distribution Partner",28.333333333333332,null,2,2,1,0,0,0,3,null,null,null,null,null,2715]
[2715,"A","Other","Regional","109 NSW Rural - Albury & Murray","Nonmetro","E Pop > 500",null,null,1477,709.9,null,null,null,"Refer to Distribution Partner",21.666666666666668,null,2,2,0,0,0,0,3,null,null,null,null,null,2716]
[2716,"A","Other","Regional","109 NSW Rural - Albury & Murray","Nonmetro","E Pop > 500",null,null,1102,528.1,null,null,null,"Refer to Distribution Partner",21.666666666666668,null,2,2,0,0,0,0,3,null,null,null,null,null,2717]
[2717,"A","Other","Regional","109 NSW Rural - Albury & Murray","Nonmetro","E Pop > 500",null,null,1330,844.5,null,null,null,"Refer to Distribution Partner",21.666666666666668,null,2,2,0,0,0,0,3,null,null,null,null,null,2720]
[2720,"A","Other","Regional","113 NSW Rural - Riverina","Nonmetro","C Pop > 7,000",3,null,8012,317.39999999999998,null,null,null,"Regional",41.666666666666664,null,2,2,1,1,1,0,3,null,null,null,null,null,2721]
[2721,"A","Other","Regional","103 NSW Rural - Central Tablelands","Nonmetro","F Pop <= 500",null,null,240,0,null,null,null,"Refer to Distribution Partner",21.666666666666668,null,2,2,0,0,0,0,3,null,null,null,null,null,2722]
[2722,"A","Other","Regional","113 NSW Rural - Riverina","Nonmetro","D Pop > 2,000",null,null,3207,313.89999999999998,null,null,null,"Refer to Distribution Partner",28.333333333333332,null,2,2,1,0,0,0,3,null,null,null,null,null,2725]
[2725,"A","Other","Regional","113 NSW Rural - Riverina","Nonmetro","F Pop <= 500",null,null,374,0,null,null,null,"Refer to Distribution Partner",21.666666666666668,null,2,2,0,0,0,0,3,null,null,null,null,null,2726]
[2726,"A","Other","Regional","101 NSW Rural - Goulburn & Snowy Mountains","Nonmetro","F Pop <= 500",null,null,222,0,null,null,null,"Refer to Distribution Partner",21.666666666666668,null,2,2,0,0,0,0,3,null,null,null,null,null,2727]
[2727,"A","Other","Regional","113 NSW Rural - Riverina","Nonmetro","E Pop > 500",null,null,350,0,null,null,null,"Refer to Distribution Partner",21.666666666666668,null,2,2,0,0,0,0,3,null,null,null,null,null,2729]
[2729,"A","Other","Regional","113 NSW Rural - Riverina","Nonmetro","E Pop > 500",null,null,1696,329.2,null,null,null,"Refer to Distribution Partner",21.666666666666668,null,2,2,0,0,0,0,3,null,null,null,null,null,2730]
[2730,"A","Other","Regional","113 NSW Rural - Riverina","Nonmetro","E Pop > 500",null,null,1391,335.1,null,null,null,"Refer to Distribution Partner",21.666666666666668,null,2,2,0,0,0,0,3,null,null,null,null,null,2731]
[2731,"A","Regional","Regional","109 NSW Rural - Albury & Murray","Nonmetro","B Regional",2,null,6410,638.70000000000005,null,null,null,"Regional",55.000000000000007,null,2,2,2,2,1,0,3,null,null,null,null,null,2732]
[2732,"A","Other","Regional","109 NSW Rural - Albury & Murray","Nonmetro","E Pop > 500",null,null,1776,674.7,null,null,null,"Refer to Distribution Partner",21.666666666666668,null,2,2,0,0,0,0,3,null,null,null,null,null,2733]
[2733,"A","Other","Regional","109 NSW Rural - Albury & Murray","Nonmetro","E Pop > 500",null,null,545,671,null,null,null,"Refer to Distribution Partner",21.666666666666668,null,2,2,0,0,0,0,3,null,null,null,null,null,2734]
[2734,"A","Other","Regional","109 NSW Rural - Albury & Murray","Nonmetro","E Pop > 500",null,null,456,0,null,null,null,"Refer to Distribution Partner",21.666666666666668,null,2,2,0,0,0,0,3,null,null,null,null,null,2735]
[2735,"A","Other","Regional","109 NSW Rural - Albury & Murray","Nonmetro","E Pop > 500",null,null,448,727.2,null,null,null,"Refer to Distribution Partner",21.666666666666668,null,2,2,0,0,0,0,3,null,null,null,null,null,2736]
[2736,"A","Other","Regional","109 NSW Rural - Albury & Murray","Nonmetro","F Pop <= 500",null,null,377,0,null,null,null,"Refer to Distribution Partner",21.666666666666668,null,2,2,0,0,0,0,3,null,null,null,null,null,2737]
[2737,"A","Other","Regional","109 NSW Rural - Albury & Murray","Nonmetro","E Pop > 500",null,null,839,782,null,null,null,"Refer to Distribution Partner",21.666666666666668,null,2,2,0,0,0,0,3,null,null,null,null,null,2738]
[2738,"A","Other","Regional","109 NSW Rural - Albury & Murray","Nonmetro","E Pop > 500",2,null,1667,828.6,null,null,"Regional","Regional",35,null,2,2,0,2,0,0,3,null,null,null,null,null,2739]
[2739,"A","Other","Regional","109 NSW Rural - Albury & Murray","Nonmetro","E Pop > 500",2,null,1401,831.8,null,null,"Regional","Regional",35,null,2,2,0,2,0,0,3,null,null,null,null,null,2745]
[2745,"A","Metro","Metro","124 NSW Metro - Blue Mountains","Metro","A Metro",1,null,29504,49.8,null,null,null,"Metro",90,null,3,3,3,3,2,2,3,null,null,null,null,null,2747]
[2747,"A","Metro","Metro","124 NSW Metro - Blue Mountains","Metro","A Metro",1,null,42421,45.7,null,null,null,"Metro",90,null,3,3,3,3,2,2,3,null,null,null,null,null,2748]
[2748,"A","Metro","Metro","124 NSW Metro - Blue Mountains","Metro","A Metro",1,null,1877,44.2,null,null,null,"Metro",76.666666666666671,null,3,3,3,3,0,2,3,null,null,null,null,null,2749]
[2749,"A","Metro","Metro","124 NSW Metro - Blue Mountains","Metro","A Metro",1,null,16930,49,null,null,null,"Metro",90,null,3,3,3,3,2,2,3,null,null,null,null,null,2750]
[2750,"A","Metro","Metro","124 NSW Metro - Blue Mountains","Metro","A Metro",1,null,44806,49.8,null,null,null,"Metro",90,null,3,3,3,3,2,2,3,null,null,null,null,null,2752]
[2752,"A","Metro","Metro","124 NSW Metro - Blue Mountains","Metro","A Metro",1,null,4918,55.6,null,null,null,"Metro",73.333333333333343,null,3,3,3,3,0,1,3,null,null,null,null,null,2753]
[2753,"A","Metro","Metro","124 NSW Metro - Blue Mountains","Metro","A Metro",1,null,17134,55.1,null,null,null,"Metro",86.666666666666671,null,3,3,3,3,2,1,3,null,null,null,null,null,2754]
[2754,"A","Metro","Metro","124 NSW Metro - Blue Mountains","Metro","A Metro",1,null,5693,56.6,null,null,null,"Metro",80,null,3,3,3,3,1,1,3,null,null,null,null,null,2756]
[2756,"A","Metro","Metro","115 NSW Metro - Hawkesbury","Metro","A Metro",1,null,33932,47.7,null,null,null,"Metro",90,null,3,3,3,3,2,2,3,null,null,null,null,null,2757]
[2757,"A","Metro","Metro","115 NSW Metro - Hawkesbury","Metro","A Metro",1,null,852,58.9,null,null,null,"Metro",73.333333333333343,null,3,3,3,3,0,1,3,null,null,null,null,null,2758]
[2758,"A","Metro","Metro","115 NSW Metro - Hawkesbury","Metro","A Metro",1,null,8715,62.2,null,null,null,"Metro",80,null,3,3,3,3,1,1,3,null,null,null,null,null,2759]
[2759,"A","Metro","Metro","124 NSW Metro - Blue Mountains","Metro","A Metro",1,null,26332,39.799999999999997,null,null,null,"Metro",90,null,3,3,3,3,2,2,3,null,null,null,null,null,2760]
[2760,"A","Metro","Metro","124 NSW Metro - Blue Mountains","Metro","A Metro",1,null,33834,40.9,null,null,null,"Metro",90,null,3,3,3,3,2,2,3,null,null,null,null,null,2761]
[2761,"A","Metro","Metro","116 NSW Metro - Blacktown","Metro","A Metro",1,null,30952,36.5,null,null,null,"Metro",90,null,3,3,3,3,2,2,3,null,null,null,null,null,2762]
[2762,"A","Metro","Metro","116 NSW Metro - Blacktown","Metro","A Metro",1,null,4983,35.700000000000003,null,null,null,"Metro",76.666666666666671,null,3,3,3,3,0,2,3,null,null,null,null,null,2763]
[2763,"A","Metro","Metro","116 NSW Metro - Blacktown","Metro","A Metro",1,null,30880,32.9,null,null,null,"Metro",90,null,3,3,3,3,2,2,3,null,null,null,null,null,2765]
[2765,"A","Metro","Metro","116 NSW Metro - Blacktown","Metro","A Metro",1,null,16106,39.299999999999997,null,null,null,"Metro",90,null,3,3,3,3,2,2,3,null,null,null,null,null,2766]
[2766,"A","Metro","Metro","116 NSW Metro - Blacktown","Metro","A Metro",1,null,15534,36,null,null,null,"Metro",90,null,3,3,3,3,2,2,3,null,null,null,null,null,2767]
[2767,"A","Metro","Metro","116 NSW Metro - Blacktown","Metro","A Metro",1,null,22530,33.1,null,null,null,"Metro",90,null,3,3,3,3,2,2,3,null,null,null,null,null,2768]
[2768,"A","Metro","Metro","116 NSW Metro - Blacktown","Metro","A Metro",1,null,28762,30.3,null,null,null,"Metro",90,null,3,3,3,3,2,2,3,null,null,null,null,null,2769]
[2769,"A","Metro","Metro","116 NSW Metro - Blacktown","Metro","A Metro",1,null,11731,33.5,null,null,null,{"$f":"IF(ISBLANK(N578),IF(AND(H578<>\"\",IF(I578=\"High Density\",\"High Density\",IF(AND(P578<=45,P578>0),\"Refer to Distribution Partner\",IF(AND(P578<=55,P578>45),\"Regional\",IF(AND(P578>55,P578<=70),\"Non Metro\",IF(F578=\"Nonmetro\",\"Non Metro\",IF(P578>70,\"Metro\",\"\"))))))=\"Refer to Distribution Partner\"),\"Regional\",IF(I578=\"High Density\",\"High Density\",IF(AND(P578<=45,P578>0),\"Refer to Distribution Partner\",IF(AND(P578<=55,P578>45),\"Regional\",IF(AND(P578>55,P578<=70),\"Non Metro\",IF(F578=\"Nonmetro\",\"Non Metro\",IF(P578>70,\"Metro\",\"\"))))))),N578)","v":"Metro"},{"$f":"(R578/$AB$3*$AA$3+S578/$AB$4*$AA$4+T578/$AB$5*$AA$5+U578/$AB$6*$AA$6+V578/$AB$7*$AA$7+W578/$AB$8*$AA$8+X578/$AB$9*$AA$9)*100","v":90},null,{"$f":"IF(ISNUMBER(SEARCH(\"Metro\",E578)),3,IF(ISNUMBER(SEARCH(\"Rural\",E578)),2,1))","v":3},{"$f":"IF(ISNUMBER(FIND(\"Metro\",F578)),3,IF(ISNUMBER(FIND(\"Nonmetro\",F578)),2,3))","v":3},{"$f":"IF(G578=\"A Metro\",3,IF(G578=\"B Regional\",2,IF(G578=\"C Pop > 7,000\",1,IF(G578=\"D Pop > 2,000\",1,0))))","v":3},{"$f":"IF(H578=1,3,IF(H578=2,2,IF(H578=3,1,0)))","v":3},{"$f":"IF(J578>=100000,3,IF(AND(J578>=10000,J578<100000),2,IF(AND(J578>=5000,J578<10000),1,0)))","v":2},{"$f":"IF(AND(K578>=0.1,K578<25),3,IF(AND(K578>=25,K578<50),2,IF(AND(K578>=50,K578<150),1,0)))","v":2},{"$f":"IF(L578=\"\",3,0)","v":3},null,null,null,null,null,2770]
[2770,"A","Metro","Metro","116 NSW Metro - Blacktown","Metro","A Metro",1,null,61296,39,null,null,null,"Metro",90,null,3,3,3,3,2,2,3,null,null,null,null,null,2773]
[2773,"A","Metro","Metro","124 NSW Metro - Blue Mountains","Metro","A Metro",1,null,6010,54.8,null,null,null,"Metro",80,null,3,3,3,3,1,1,3,null,null,null,null,null,2774]
[2774,"A","Metro","Metro","124 NSW Metro - Blue Mountains","Metro","A Metro",1,null,12932,56.6,null,null,null,"Metro",86.666666666666671,null,3,3,3,3,2,1,3,null,null,null,null,null,2775]
[2775,"A","Metro","Metro","Unknown","Metro","A Metro",null,null,1498,56.6,null,null,null,"Regional",50,null,1,3,3,0,0,1,3,null,null,null,null,null,2776]
[2776,"A","Metro","Metro","124 NSW Metro - Blue Mountains","Metro","A Metro",1,null,4025,64.7,null,null,null,"Metro",73.333333333333343,null,3,3,3,3,0,1,3,null,null,null,null,null,2777]
[2777,"A","Metro","Metro","124 NSW Metro - Blue Mountains","Metro","A Metro",1,null,17601,61.6,null,null,null,"Metro",86.666666666666671,null,3,3,3,3,2,1,3,null,null,null,null,null,2778]
[2778,"A","Metro","Metro","124 NSW Metro - Blue Mountains","Metro","A Metro",1,null,2432,68.7,null,null,null,"Metro",73.333333333333343,null,3,3,3,3,0,1,3,null,null,null,null,null,2779]
[2779,"A","Metro","Metro","124 NSW Metro - Blue Mountains","Metro","A Metro",1,null,4974,71.400000000000006,null,null,null,"Metro",73.333333333333343,null,3,3,3,3,0,1,3,null,null,null,null,null,2780]
[2780,"A","Metro","Metro","124 NSW Metro - Blue Mountains","Metro","A Metro",1,null,13224,84.1,null,null,null,"Metro",86.666666666666671,null,3,3,3,3,2,1,3,null,null,null,null,null,2782]
[2782,"A","Metro","Metro","124 NSW Metro - Blue Mountains","Metro","A Metro",1,null,6076,79.2,null,null,null,"Metro",80,null,3,3,3,3,1,1,3,null,null,null,null,null,2783]
[2783,"A","Metro","Metro","124 NSW Metro - Blue Mountains","Metro","A Metro",1,null,2614,73.599999999999994,null,null,null,"Metro",73.333333333333343,null,3,3,3,3,0,1,3,null,null,null,null,null,2784]
[2784,"A","Metro","Metro","124 NSW Metro - Blue Mountains","Metro","A Metro",1,null,1230,74.900000000000006,null,null,null,"Metro",73.333333333333343,null,3,3,3,3,0,1,3,null,null,null,null,null,2785]
[2785,"A","Metro","Metro","124 NSW Metro - Blue Mountains","Metro","A Metro",1,null,4543,88.7,null,null,null,"Metro",73.333333333333343,null,3,3,3,3,0,1,3,null,null,null,null,null,2786]
[2786,"A","Other","Metro","124 NSW Metro - Blue Mountains","Metro","E Pop > 500",null,null,1288,92.3,null,null,null,"Refer to Distribution Partner",33.333333333333329,null,3,3,0,0,0,1,3,null,null,null,null,null,2787]
[2787,"A","Other","Regional","103 NSW Rural - Central Tablelands","Nonmetro","D Pop > 2,000",null,null,4448,124.7,null,null,null,"Refer to Distribution Partner",31.666666666666664,null,2,2,1,0,0,1,3,null,null,null,null,null,2790]
[2790,"A","Regional","Regional","103 NSW Rural - Central Tablelands","Nonmetro","B Regional",3,null,15767,107.1,"Mining",null,null,"Regional",53.333333333333336,null,2,2,2,1,2,1,0,null,null,null,null,null,2791]
[2791,"A","Other","Regional","103 NSW Rural - Central Tablelands","Nonmetro","E Pop > 500",null,null,343,0,"Mining",null,null,"Refer to Distribution Partner",16.666666666666664,null,2,2,0,0,0,0,0,null,null,null,null,null,2792]
[2792,"A","Other","Regional","103 NSW Rural - Central Tablelands","Nonmetro","E Pop > 500",null,null,384,199.8,"Mining",null,null,"Refer to Distribution Partner",16.666666666666664,null,2,2,0,0,0,0,0,null,null,null,null,null,2793]
[2793,"A","Other","Regional","103 NSW Rural - Central Tablelands","Nonmetro","E Pop > 500",null,null,976,216.9,null,null,null,"Refer to Distribution Partner",21.666666666666668,null,2,2,0,0,0,0,3,null,null,null,null,null,2794]
[2794,"A","Other","Regional","103 NSW Rural - Central Tablelands","Nonmetro","C Pop > 7,000",3,null,10428,233.4,null,null,null,"Regional",48.333333333333336,null,2,2,1,1,2,0,3,null,null,null,null,null,2795]
[2795,"A","Regional","Regional","103 NSW Rural - Central Tablelands","Nonmetro","B Regional",1,null,42550,158.9,null,null,null,"Non Metro",68.333333333333329,null,2,2,2,3,2,0,3,null,null,null,null,null,2797]
[2797,"A","Other","Regional","103 NSW Rural - Central Tablelands","Nonmetro","F Pop <= 500",null,null,426,0,"Mining",null,null,"Refer to Distribution Partner",16.666666666666664,null,2,2,0,0,0,0,0,null,null,null,null,null,2798]
[2798,"A","Other","Regional","103 NSW Rural - Central Tablelands","Nonmetro","D Pop > 2,000",null,null,2101,195,"Mining",null,null,"Refer to Distribution Partner",23.333333333333332,null,2,2,1,0,0,0,0,null,null,null,null,null,2799]
[2799,"A","Other","Regional","103 NSW Rural - Central Tablelands","Nonmetro","D Pop > 2,000",null,null,4121,184.9,"Mining",null,null,"Refer to Distribution Partner",23.333333333333332,null,2,2,1,0,0,0,0,null,null,null,null,null,2800]
[2800,"A","Regional","Regional","103 NSW Rural - Central Tablelands","Nonmetro","B Regional",2,null,44993,206.5,"Mining",null,null,"Non Metro",56.666666666666664,null,2,2,2,2,2,0,0,null,null,null,null,null,2803]
[2803,"A","Other","Regional","101 NSW Rural - Goulburn & Snowy Mountains","Nonmetro","F Pop <= 500",null,null,281,0,null,null,null,"Refer to Distribution Partner",21.666666666666668,null,2,2,0,0,0,0,3,null,null,null,null,null,2804]
[2804,"A","Other","Regional","103 NSW Rural - Central Tablelands","Nonmetro","D Pop > 2,000",null,null,2668,237.5,null,null,null,"Refer to Distribution Partner",28.333333333333332,null,2,2,1,0,0,0,3,null,null,null,null,null,2805]
[2805,"A","Other","Regional","103 NSW Rural - Central Tablelands","Nonmetro","F Pop <= 500",null,null,399,0,null,null,null,"Refer to Distribution Partner",21.666666666666668,null,2,2,0,0,0,0,3,null,null,null,null,null,2806]
[2806,"A","Other","Regional","103 NSW Rural - Central Tablelands","Nonmetro","E Pop > 500",null,null,779,267.39999999999998,null,null,null,"Refer to Distribution Partner",21.666666666666668,null,2,2,0,0,0,0,3,null,null,null,null,null,2807]
[2807,"A","Other","Regional","101 NSW Rural - Goulburn & Snowy Mountains","Nonmetro","F Pop <= 500",null,null,427,245.4,null,null,null,"Refer to Distribution Partner",21.666666666666668,null,2,2,0,0,0,0,3,null,null,null,null,null,2808]
[2808,"A","Other","Regional","103 NSW Rural - Central Tablelands","Nonmetro","F Pop <= 500",null,null,182,245.4,null,null,null,"Refer to Distribution Partner",21.666666666666668,null,2,2,0,0,0,0,3,null,null,null,null,null,2809]
[2809,"A","Other","Regional","103 NSW Rural - Central Tablelands","Nonmetro","F Pop <= 500",null,null,240,245.4,null,null,null,"Refer to Distribution Partner",21.666666666666668,null,2,2,0,0,0,0,3,null,null,null,null,null,2810]
[2810,"A","Other","Regional","103 NSW Rural - Central Tablelands","Nonmetro","D Pop > 2,000",null,null,3150,282.89999999999998,null,null,null,"Refer to Distribution Partner",28.333333333333332,null,2,2,1,0,0,0,3,null,null,null,null,null,2818]
[2818,"A","Other","Regional","Unknown","Nonmetro","E Pop > 500",null,null,871,275.3,null,null,null,"Refer to Distribution Partner",20,null,1,2,0,0,0,0,3,null,null,null,null,null,2820]
[2820,"A","Other","Regional","105 NSW Rural - Outback","Nonmetro","C Pop > 7,000",null,null,7316,253.8,null,null,null,"Refer to Distribution Partner",35,null,2,2,1,0,1,0,3,null,null,null,null,null,2821]
[2821,"A","Other","Regional","105 NSW Rural - Outback","Nonmetro","D Pop > 2,000",null,null,4810,330.4,null,null,null,"Refer to Distribution Partner",28.333333333333332,null,2,2,1,0,0,0,3,null,null,null,null,null,2823]
[2823,"A","Other","Regional","105 NSW Rural - Outback","Nonmetro","E Pop > 500",null,null,1425,364.9,null,null,null,"Refer to Distribution Partner",21.666666666666668,null,2,2,0,0,0,0,3,null,null,null,null,null,2824]
[2824,"A","Other","Regional","105 NSW Rural - Outback","Nonmetro","D Pop > 2,000",null,null,2183,396.8,null,null,null,"Refer to Distribution Partner",28.333333333333332,null,2,2,1,0,0,0,3,null,null,null,null,null,2825]
[2825,"A","Other","Regional","105 NSW Rural - Outback","Nonmetro","D Pop > 2,000",null,null,2383,454.9,"Mining",null,null,"Refer to Distribution Partner",23.333333333333332,null,2,2,1,0,0,0,0,null,null,null,null,null,2826]
[2826,"A","Other","Regional","Unknown","Nonmetro","F Pop <= 500",null,null,201,454.9,null,null,null,"Refer to Distribution Partner",20,null,1,2,0,0,0,0,3,null,null,null,null,null,2827]
[2827,"A","Other","Regional","105 NSW Rural - Outback","Nonmetro","D Pop > 2,000",null,null,3691,339.5,null,null,null,"Refer to Distribution Partner",28.333333333333332,null,2,2,1,0,0,0,3,null,null,null,null,null,2828]
[2828,"A","Other","Regional","105 NSW Rural - Outback","Nonmetro","E Pop > 500",null,null,831,378.2,null,null,null,"Refer to Distribution Partner",21.666666666666668,null,2,2,0,0,0,0,3,null,null,null,null,null,2829]
[2829,"A","Other","Regional","105 NSW Rural - Outback","Nonmetro","D Pop > 2,000",null,null,3102,417.9,null,null,null,"Refer to Distribution Partner",28.333333333333332,null,2,2,1,0,0,0,3,null,null,null,null,null,2830]
[2830,"A","Regional","Regional","105 NSW Rural - Outback","Nonmetro","B Regional",1,null,40291,301.3,null,null,null,"Non Metro",68.333333333333329,null,2,2,2,3,2,0,3,null,null,null,null,null,2831]
[2831,"A","Other","Regional","105 NSW Rural - Outback","Nonmetro","D Pop > 2,000",null,null,1919,416.8,null,null,null,"Refer to Distribution Partner",28.333333333333332,null,2,2,1,0,0,0,3,null,null,null,null,null,2832]
[2832,"A","Other","Regional","105 NSW Rural - Outback","Nonmetro","D Pop > 2,000",null,null,2568,520.29999999999995,null,null,null,"Refer to Distribution Partner",28.333333333333332,null,2,2,1,0,0,0,3,null,null,null,null,null,2833]
[2833,"A","Other","Regional","105 NSW Rural - Outback","Nonmetro","E Pop > 500",null,null,650,520.29999999999995,null,null,null,"Refer to Distribution Partner",21.666666666666668,null,2,2,0,0,0,0,3,null,null,null,null,null,2834]
[2834,"A","Other","Regional","105 NSW Rural - Outback","Nonmetro","D Pop > 2,000",null,null,2340,579.70000000000005,null,null,null,"Refer to Distribution Partner",28.333333333333332,null,2,2,1,0,0,0,3,null,null,null,null,null,2835]
[2835,"A","Other","Regional","105 NSW Rural - Outback","Nonmetro","D Pop > 2,000",null,null,4173,568.6,"Mining",null,null,"Refer to Distribution Partner",23.333333333333332,null,2,2,1,0,0,0,0,null,null,null,null,null,2836]
[2836,"A","Other","Regional","105 NSW Rural - Outback","Nonmetro","E Pop > 500",null,null,891,781.7,null,null,null,"Refer to Distribution Partner",21.666666666666668,null,2,2,0,0,0,0,3,null,null,null,null,null,2838]
[2838,"A","Other","Regional","Unknown","Nonmetro","F Pop <= 500",null,null,247,781.7,null,null,null,"Refer to Distribution Partner",20,null,1,2,0,0,0,0,3,null,null,null,null,null,2839]
[2839,"A","Other","Regional","105 NSW Rural - Outback","Nonmetro","E Pop > 500",null,null,1338,596.9,null,null,null,"Refer to Distribution Partner",21.666666666666668,null,2,2,0,0,0,0,3,null,null,null,null,null,2840]
[2840,"A","Other","Regional","105 NSW Rural - Outback","Nonmetro","D Pop > 2,000",null,null,2695,653.5,null,null,null,"Refer to Distribution Partner",28.333333333333332,null,2,2,1,0,0,0,3,null,null,null,null,null,2842]
[2842,"A","Other","Regional","105 NSW Rural - Outback","Nonmetro","F Pop <= 500",null,null,630,300.8,null,null,null,"Refer to Distribution Partner",21.666666666666668,null,2,2,0,0,0,0,3,null,null,null,null,null,2843]
[2843,"A","Other","Regional","105 NSW Rural - Outback","Nonmetro","E Pop > 500",null,null,1290,266.60000000000002,null,null,null,"Refer to Distribution Partner",21.666666666666668,null,2,2,0,0,0,0,3,null,null,null,null,null,2844]
[2844,"A","Other","Regional","103 NSW Rural - Central Tablelands","Nonmetro","E Pop > 500",null,null,1437,264.7,null,null,null,"Refer to Distribution Partner",21.666666666666668,null,2,2,0,0,0,0,3,null,null,null,null,null,2845]
[2845,"A","Other","Regional","103 NSW Rural - Central Tablelands","Nonmetro","E Pop > 500",null,null,1980,117.4,"Mining",null,null,"Refer to Distribution Partner",20,null,2,2,0,0,0,1,0,null,null,null,null,null,2846]
[2846,"A","Other","Regional","103 NSW Rural - Central Tablelands","Nonmetro","F Pop <= 500",null,null,275,135.19999999999999,null,null,null,"Refer to Distribution Partner",25,null,2,2,0,0,0,1,3,null,null,null,null,null,2847]
[2847,"A","Other","Regional","103 NSW Rural - Central Tablelands","Nonmetro","D Pop > 2,000",null,null,2424,126.9,"Mining",null,null,"Refer to Distribution Partner",26.666666666666668,null,2,2,1,0,0,1,0,null,null,null,null,null,2848]
[2848,"A","Other","Regional","103 NSW Rural - Central Tablelands","Nonmetro","E Pop > 500",null,null,1645,160.1,"Mining",null,null,"Refer to Distribution Partner",16.666666666666664,null,2,2,0,0,0,0,0,null,null,null,null,null,2849]
[2849,"A","Other","Regional","103 NSW Rural - Central Tablelands","Nonmetro","E Pop > 500",null,null,1546,158.6,"Mining",null,null,"Refer to Distribution Partner",16.666666666666664,null,2,2,0,0,0,0,0,null,null,null,null,null,2850]
[2850,"A","Regional","Regional","103 NSW Rural - Central Tablelands","Nonmetro","B Regional",3,null,17644,206.6,"Mining",null,null,"Regional",50,null,2,2,2,1,2,0,0,null,null,null,null,null,2852]
[2852,"A","Other","Regional","103 NSW Rural - Central Tablelands","Nonmetro","D Pop > 2,000",null,null,3543,230.5,"Mining",null,null,"Refer to Distribution Partner",23.333333333333332,null,2,2,1,0,0,0,0,null,null,null,null,null,2864]
[2864,"A","Other","Regional","103 NSW Rural - Central Tablelands","Nonmetro","E Pop > 500",null,null,804,236.8,null,null,null,{"$f":"IF(ISBLANK(N642),IF(AND(H642<>\"\",IF(I642=\"High Density\",\"High Density\",IF(AND(P642<=45,P642>0),\"Refer to Distribution Partner\",IF(AND(P642<=55,P642>45),\"Regional\",IF(AND(P642>55,P642<=70),\"Non Metro\",IF(F642=\"Nonmetro\",\"Non Metro\",IF(P642>70,\"Metro\",\"\"))))))=\"Refer to Distribution Partner\"),\"Regional\",IF(I642=\"High Density\",\"High Density\",IF(AND(P642<=45,P642>0),\"Refer to Distribution Partner\",IF(AND(P642<=55,P642>45),\"Regional\",IF(AND(P642>55,P642<=70),\"Non Metro\",IF(F642=\"Nonmetro\",\"Non Metro\",IF(P642>70,\"Metro\",\"\"))))))),N642)","v":"Refer to Distribution Partner"},{"$f":"(R642/$AB$3*$AA$3+S642/$AB$4*$AA$4+T642/$AB$5*$AA$5+U642/$AB$6*$AA$6+V642/$AB$7*$AA$7+W642/$AB$8*$AA$8+X642/$AB$9*$AA$9)*100","v":21.666666666666668},null,{"$f":"IF(ISNUMBER(SEARCH(\"Metro\",E642)),3,IF(ISNUMBER(SEARCH(\"Rural\",E642)),2,1))","v":2},{"$f":"IF(ISNUMBER(FIND(\"Metro\",F642)),3,IF(ISNUMBER(FIND(\"Nonmetro\",F642)),2,3))","v":2},{"$f":"IF(G642=\"A Metro\",3,IF(G642=\"B Regional\",2,IF(G642=\"C Pop > 7,000\",1,IF(G642=\"D Pop > 2,000\",1,0))))","v":0},{"$f":"IF(H642=1,3,IF(H642=2,2,IF(H642=3,1,0)))","v":0},{"$f":"IF(J642>=100000,3,IF(AND(J642>=10000,J642<100000),2,IF(AND(J642>=5000,J642<10000),1,0)))","v":0},{"$f":"IF(AND(K642>=0.1,K642<25),3,IF(AND(K642>=25,K642<50),2,IF(AND(K642>=50,K642<150),1,0)))","v":0},{"$f":"IF(L642=\"\",3,0)","v":3},null,null,null,null,null,2865]
[2865,"A","Other","Regional","103 NSW Rural - Central Tablelands","Nonmetro","E Pop > 500",null,null,865,247.1,null,null,null,"Refer to Distribution Partner",21.666666666666668,null,2,2,0,0,0,0,3,null,null,null,null,null,2866]
[2866,"A","Other","Regional","103 NSW Rural - Central Tablelands","Nonmetro","D Pop > 2,000",null,null,3093,232.9,null,null,null,"Refer to Distribution Partner",28.333333333333332,null,2,2,1,0,0,0,3,null,null,null,null,null,2867]
[2867,"A","Other","Regional","103 NSW Rural - Central Tablelands","Nonmetro","E Pop > 500",null,null,602,251.4,null,null,null,"Refer to Distribution Partner",21.666666666666668,null,2,2,0,0,0,0,3,null,null,null,null,null,2868]
[2868,"A","Other","Regional","105 NSW Rural - Outback","Nonmetro","E Pop > 500",null,null,652,268.3,null,null,null,"Refer to Distribution Partner",21.666666666666668,null,2,2,0,0,0,0,3,null,null,null,null,null,2869]
[2869,"A","Other","Regional","103 NSW Rural - Central Tablelands","Nonmetro","E Pop > 500",null,null,1449,309.7,"Mining",null,null,"Refer to Distribution Partner",16.666666666666664,null,2,2,0,0,0,0,0,null,null,null,null,null,2870]
[2870,"A","Regional","Regional","103 NSW Rural - Central Tablelands","Nonmetro","B Regional",3,null,12042,292.60000000000002,"Mining",null,null,"Regional",50,null,2,2,2,1,2,0,0,null,null,null,null,null,2871]
[2871,"A","Other","Regional","103 NSW Rural - Central Tablelands","Nonmetro","C Pop > 7,000",null,null,9349,301.7,null,null,null,"Refer to Distribution Partner",35,null,2,2,1,0,1,0,3,null,null,null,null,null,2873]
[2873,"A","Other","Regional","103 NSW Rural - Central Tablelands","Nonmetro","E Pop > 500",null,null,561,401.1,null,null,null,"Refer to Distribution Partner",21.666666666666668,null,2,2,0,0,0,0,3,null,null,null,null,null,2874]
[2874,"A","Other","Regional","103 NSW Rural - Central Tablelands","Nonmetro","F Pop <= 500",null,null,424,401.1,null,null,null,"Refer to Distribution Partner",21.666666666666668,null,2,2,0,0,0,0,3,null,null,null,null,null,2875]
[2875,"A","Other","Regional","103 NSW Rural - Central Tablelands","Nonmetro","E Pop > 500",null,null,973,342.6,null,null,null,"Refer to Distribution Partner",21.666666666666668,null,2,2,0,0,0,0,3,null,null,null,null,null,2876]
[2876,"A","Other","Regional","103 NSW Rural - Central Tablelands","Nonmetro","F Pop <= 500",null,null,421,342.6,null,null,null,"Refer to Distribution Partner",21.666666666666668,null,2,2,0,0,0,0,3,null,null,null,null,null,2877]
[2877,"A","Other","Regional","103 NSW Rural - Central Tablelands","Nonmetro","D Pop > 2,000",null,null,3883,391.1,null,null,null,"Refer to Distribution Partner",28.333333333333332,null,2,2,1,0,0,0,3,null,null,null,null,null,2878]
[2878,"A","Other","Regional","105 NSW Rural - Outback","Nonmetro","F Pop <= 500",null,null,372,650.6,null,null,null,"Refer to Distribution Partner",21.666666666666668,null,2,2,0,0,0,0,3,null,null,null,null,null,2879]
[2879,"A","Other","Regional","105 NSW Rural - Outback","Nonmetro","E Pop > 500",null,null,638,838.5,null,null,null,"Refer to Distribution Partner",21.666666666666668,null,2,2,0,0,0,0,3,null,null,null,null,null,2880]
[2880,"A","Other","Regional","105 NSW Rural - Outback","Nonmetro","C Pop > 7,000",3,null,18276,934.4,"Mining",null,null,"Regional",43.333333333333336,null,2,2,1,1,2,0,0,null,null,null,null,null,2898]
[2898,"A","Other","Regional","108 NSW Rural - Port Macquarie","Nonmetro","F Pop <= 500",null,null,382,934.4,null,null,null,"Refer to Distribution Partner",21.666666666666668,null,2,2,0,0,0,0,3,null,null,null,null,null,2899]
[2899,"A","Other","Regional","Unknown","Nonmetro","F Pop <= 500",null,null,1748,934.4,null,null,null,"Refer to Distribution Partner",20,null,1,2,0,0,0,0,3,null,null,null,null,null,2900]
[2900,"A","Metro","Metro","801 ACT Metro - Canberra","Metro","A Metro",1,null,1930,16.3,null,null,null,"Metro",80,null,3,3,3,3,0,3,3,null,null,null,null,null,2902]
[2902,"A","Metro","Metro","801 ACT Metro - Canberra","Metro","A Metro",1,null,14900,14.3,null,null,null,"Metro",93.333333333333329,null,3,3,3,3,2,3,3,null,null,null,null,null,2903]
[2903,"A","Metro","Metro","801 ACT Metro - Canberra","Metro","A Metro",1,null,9207,14.4,null,null,null,"Metro",86.666666666666671,null,3,3,3,3,1,3,3,null,null,null,null,null,2904]
[2904,"A","Metro","Metro","801 ACT Metro - Canberra","Metro","A Metro",1,null,12863,15.4,null,null,null,"Metro",93.333333333333329,null,3,3,3,3,2,3,3,null,null,null,null,null,2905]
[2905,"A","Metro","Metro","801 ACT Metro - Canberra","Metro","A Metro",1,null,28625,17.600000000000001,null,null,null,"Metro",93.333333333333329,null,3,3,3,3,2,3,3,null,null,null,null,null,2906]
[2906,"A","Metro","Metro","801 ACT Metro - Canberra","Metro","A Metro",1,null,17633,20.9,null,null,null,"Metro",93.333333333333329,null,3,3,3,3,2,3,3,null,null,null,null,null,2911]
[2911,"A","Metro","Metro","801 ACT Metro - Canberra","Metro","A Metro",1,null,4466,8.6,null,null,null,"Metro",80,null,3,3,3,3,0,3,3,null,null,null,null,null,2912]
[2912,"A","Metro","Metro","801 ACT Metro - Canberra","Metro","A Metro",1,null,6142,12.3,null,null,null,"Metro",86.666666666666671,null,3,3,3,3,1,3,3,null,null,null,null,null,2913]
[2913,"A","Metro","Metro","801 ACT Metro - Canberra","Metro","A Metro",1,null,35053,11.4,null,null,null,"Metro",93.333333333333329,null,3,3,3,3,2,3,3,null,null,null,null,null,2914]
[2914,"A","Metro","Metro","801 ACT Metro - Canberra","Metro","A Metro",1,null,25204,12,null,null,null,"Metro",93.333333333333329,null,3,3,3,3,2,3,3,null,null,null,null,null,3000]
[3000,"A","Metro","Inner City","206 VIC Metro - CBD & Inner Suburbs","Inner city","A Metro",1,"High Density",37975,0.7,null,null,null,"High Density",93.333333333333329,null,3,3,3,3,2,3,3,null,null,null,null,null,3002]
[3002,"A","Metro","Inner City","206 VIC Metro - CBD & Inner Suburbs","Inner city","A Metro",1,"High Density",4964,2.1,null,null,null,"High Density",80,null,3,3,3,3,0,3,3,null,null,null,null,null,3003]
[3003,"A","Metro","Inner City","206 VIC Metro - CBD & Inner Suburbs","Inner city","A Metro",1,"High Density",5515,1.5,null,null,null,"High Density",86.666666666666671,null,3,3,3,3,1,3,3,null,null,null,null,null,3004]
[3004,"A","Metro","Inner City","206 VIC Metro - CBD & Inner Suburbs","Inner city","A Metro",1,"High Density",9307,3.7,null,null,null,"High Density",86.666666666666671,null,3,3,3,3,1,3,3,null,null,null,null,null,3005]
[3005,"A","Metro","Inner City","206 VIC Metro - CBD & Inner Suburbs","Inner city","A Metro",1,"High Density",525,0,null,null,null,"High Density",70,null,3,3,3,3,0,0,3,null,null,null,null,null,3006]
[3006,"A","Metro","Inner City","206 VIC Metro - CBD & Inner Suburbs","Inner city","A Metro",1,"High Density",18808,1.4,null,null,null,"High Density",93.333333333333329,null,3,3,3,3,2,3,3,null,null,null,null,null,3008]
[3008,"A","Metro","Inner City","206 VIC Metro - CBD & Inner Suburbs","Inner city","A Metro",1,"High Density",10437,1.8,null,null,null,"High Density",93.333333333333329,null,3,3,3,3,2,3,3,null,null,null,null,null,3010]
[3010,"A","Metro","Inner City","206 VIC Metro - CBD & Inner Suburbs","Inner city","A Metro",1,"High Density",1593,0,null,null,null,"High Density",70,null,3,3,3,3,0,0,3,null,null,null,null,null,3011]
[3011,"A","Metro","Metro","213 VIC Metro - Melton / Werrribee","Metro","A Metro",1,"High Density",21462,6.5,null,null,null,"High Density",93.333333333333329,null,3,3,3,3,2,3,3,null,null,null,null,null,3012]
[3012,"A","Metro","Metro","213 VIC Metro - Melton / Werrribee","Metro","A Metro",1,null,26298,8.6,null,null,null,"Metro",93.333333333333329,null,3,3,3,3,2,3,3,null,null,null,null,null,3013]
[3013,"A","Metro","Metro","213 VIC Metro - Melton / Werrribee","Metro","A Metro",1,null,14965,7.1,null,null,null,"Metro",93.333333333333329,null,3,3,3,3,2,3,3,null,null,null,null,null,3015]
[3015,"A","Metro","Metro","213 VIC Metro - Melton / Werrribee","Metro","A Metro",1,null,17472,8.4,null,null,null,"Metro",93.333333333333329,null,3,3,3,3,2,3,3,null,null,null,null,null,3016]
[3016,"A","Metro","Metro","213 VIC Metro - Melton / Werrribee","Metro","A Metro",1,null,15560,8.1999999999999993,null,null,null,"Metro",93.333333333333329,null,3,3,3,3,2,3,3,null,null,null,null,null,3018]
[3018,"A","Metro","Metro","213 VIC Metro - Melton / Werrribee","Metro","A Metro",1,null,12689,13.8,null,null,null,"Metro",93.333333333333329,null,3,3,3,3,2,3,3,null,null,null,null,null,3019]
[3019,"A","Metro","Metro","213 VIC Metro - Melton / Werrribee","Metro","A Metro",1,null,9195,10.199999999999999,null,null,null,"Metro",86.666666666666671,null,3,3,3,3,1,3,3,null,null,null,null,null,3020]
[3020,"A","Metro","Metro","213 VIC Metro - Melton / Werrribee","Metro","A Metro",1,null,44783,12.9,null,null,null,"Metro",93.333333333333329,null,3,3,3,3,2,3,3,null,null,null,null,null,3021]
[3021,"A","Metro","Metro","213 VIC Metro - Melton / Werrribee","Metro","A Metro",1,null,54191,16.8,null,null,null,"Metro",93.333333333333329,null,3,3,3,3,2,3,3,null,null,null,null,null,3022]
[3022,"A","Metro","Metro","213 VIC Metro - Melton / Werrribee","Metro","A Metro",1,null,3103,14.9,null,null,null,"Metro",80,null,3,3,3,3,0,3,3,null,null,null,null,null,3023]
[3023,"A","Metro","Metro","213 VIC Metro - Melton / Werrribee","Metro","A Metro",1,null,63972,19.899999999999999,null,null,null,"Metro",93.333333333333329,null,3,3,3,3,2,3,3,null,null,null,null,null,3024]
[3024,"A","Metro","Metro","213 VIC Metro - Melton / Werrribee","Metro","A Metro",1,null,23849,32,null,null,null,"Metro",90,null,3,3,3,3,2,2,3,null,null,null,null,null,3025]
[3025,"A","Metro","Metro","213 VIC Metro - Melton / Werrribee","Metro","A Metro",1,null,12152,10.199999999999999,null,null,null,"Metro",93.333333333333329,null,3,3,3,3,2,3,3,null,null,null,null,null,3026]
[3026,"A","Metro","Metro","213 VIC Metro - Melton / Werrribee","Metro","A Metro",1,null,73,0,null,null,null,"Non Metro",70,null,3,3,3,3,0,0,3,null,null,null,null,null,3027]
[3027,"A","Metro","Metro","213 VIC Metro - Melton / Werrribee","Metro","A Metro",1,null,6646,19.899999999999999,null,null,null,"Metro",86.666666666666671,null,3,3,3,3,1,3,3,null,null,null,null,null,3028]
[3028,"A","Metro","Metro","213 VIC Metro - Melton / Werrribee","Metro","A Metro",1,null,29201,17.899999999999999,null,null,null,"Metro",93.333333333333329,null,3,3,3,3,2,3,3,null,null,null,null,null,3029]
[3029,"A","Metro","Metro","213 VIC Metro - Melton / Werrribee","Metro","A Metro",1,null,93950,24.6,null,null,null,"Metro",93.333333333333329,null,3,3,3,3,2,3,3,null,null,null,null,null,3030]
[3030,"A","Metro","Metro","213 VIC Metro - Melton / Werrribee","Metro","A Metro",1,null,100313,25.5,null,null,null,"Metro",96.666666666666686,null,3,3,3,3,3,2,3,null,null,null,null,null,3031]
[3031,"A","Metro","Metro","206 VIC Metro - CBD & Inner Suburbs","Metro","A Metro",1,null,18531,4.2,null,null,null,"Metro",93.333333333333329,null,3,3,3,3,2,3,3,null,null,null,null,null,3032]
[3032,"A","Metro","Metro","206 VIC Metro - CBD & Inner Suburbs","Metro","A Metro",1,null,29450,6.5,null,null,null,"Metro",93.333333333333329,null,3,3,3,3,2,3,3,null,null,null,null,null,3033]
[3033,"A","Metro","Metro","210 VIC Metro - Sunbury","Metro","A Metro",1,null,14514,11.6,null,null,null,"Metro",93.333333333333329,null,3,3,3,3,2,3,3,null,null,null,null,null,3034]
[3034,"A","Metro","Metro","210 VIC Metro - Sunbury","Metro","A Metro",1,null,11633,10.6,null,null,null,"Metro",93.333333333333329,null,3,3,3,3,2,3,3,null,null,null,null,null,3036]
[3036,"A","Metro","Metro","210 VIC Metro - Sunbury","Metro","A Metro",1,null,5925,16.5,null,null,null,"Metro",86.666666666666671,null,3,3,3,3,1,3,3,null,null,null,null,null,3037]
[3037,"A","Metro","Metro","213 VIC Metro - Melton / Werrribee","Metro","A Metro",1,null,51155,22,null,null,null,"Metro",93.333333333333329,null,3,3,3,3,2,3,3,null,null,null,null,null,3038]
[3038,"A","Metro","Metro","213 VIC Metro - Melton / Werrribee","Metro","A Metro",1,null,27262,18.7,null,null,null,"Metro",93.333333333333329,null,3,3,3,3,2,3,3,null,null,null,null,null,3039]
[3039,"A","Metro","Metro","206 VIC Metro - CBD & Inner Suburbs","Metro","A Metro",1,null,14250,6.6,null,null,null,"Metro",93.333333333333329,null,3,3,3,3,2,3,3,null,null,null,null,null,3040]
[3040,"A","Metro","Metro","206 VIC Metro - CBD & Inner Suburbs","Metro","A Metro",1,null,25936,8.6999999999999993,null,null,null,"Metro",93.333333333333329,null,3,3,3,3,2,3,3,null,null,null,null,null,3041]
[3041,"A","Metro","Metro","210 VIC Metro - Sunbury","Metro","A Metro",1,null,12412,10,null,null,null,"Metro",93.333333333333329,null,3,3,3,3,2,3,3,null,null,null,null,null,3042]
[3042,"A","Metro","Metro","210 VIC Metro - Sunbury","Metro","A Metro",1,null,15766,12,null,null,null,{"$f":"IF(ISBLANK(N706),IF(AND(H706<>\"\",IF(I706=\"High Density\",\"High Density\",IF(AND(P706<=45,P706>0),\"Refer to Distribution Partner\",IF(AND(P706<=55,P706>45),\"Regional\",IF(AND(P706>55,P706<=70),\"Non Metro\",IF(F706=\"Nonmetro\",\"Non Metro\",IF(P706>70,\"Metro\",\"\"))))))=\"Refer to Distribution Partner\"),\"Regional\",IF(I706=\"High Density\",\"High Density\",IF(AND(P706<=45,P706>0),\"Refer to Distribution Partner\",IF(AND(P706<=55,P706>45),\"Regional\",IF(AND(P706>55,P706<=70),\"Non Metro\",IF(F706=\"Nonmetro\",\"Non Metro\",IF(P706>70,\"Metro\",\"\"))))))),N706)","v":"Metro"},{"$f":"(R706/$AB$3*$AA$3+S706/$AB$4*$AA$4+T706/$AB$5*$AA$5+U706/$AB$6*$AA$6+V706/$AB$7*$AA$7+W706/$AB$8*$AA$8+X706/$AB$9*$AA$9)*100","v":93.333333333333329},null,{"$f":"IF(ISNUMBER(SEARCH(\"Metro\",E706)),3,IF(ISNUMBER(SEARCH(\"Rural\",E706)),2,1))","v":3},{"$f":"IF(ISNUMBER(FIND(\"Metro\",F706)),3,IF(ISNUMBER(FIND(\"Nonmetro\",F706)),2,3))","v":3},{"$f":"IF(G706=\"A Metro\",3,IF(G706=\"B Regional\",2,IF(G706=\"C Pop > 7,000\",1,IF(G706=\"D Pop > 2,000\",1,0))))","v":3},{"$f":"IF(H706=1,3,IF(H706=2,2,IF(H706=3,1,0)))","v":3},{"$f":"IF(J706>=100000,3,IF(AND(J706>=10000,J706<100000),2,IF(AND(J706>=5000,J706<10000),1,0)))","v":2},{"$f":"IF(AND(K706>=0.1,K706<25),3,IF(AND(K706>=25,K706<50),2,IF(AND(K706>=50,K706<150),1,0)))","v":3},{"$f":"IF(L706=\"\",3,0)","v":3},null,null,null,null,null,3043]
[3043,"A","Metro","Metro","210 VIC Metro - Sunbury","Metro","A Metro",1,null,17716,14.7,null,null,null,"Metro",93.333333333333329,null,3,3,3,3,2,3,3,null,null,null,null,null,3044]
[3044,"A","Metro","Metro","210 VIC Metro - Sunbury","Metro","A Metro",1,null,27116,10.1,null,null,null,"Metro",93.333333333333329,null,3,3,3,3,2,3,3,null,null,null,null,null,3045]
[3045,"A","Metro","Metro","210 VIC Metro - Sunbury","Metro","A Metro",1,null,104,0,null,null,null,"Non Metro",70,null,3,3,3,3,0,0,3,null,null,null,null,null,3046]
[3046,"A","Metro","Metro","210 VIC Metro - Sunbury","Metro","A Metro",1,null,34063,12.3,null,null,null,"Metro",93.333333333333329,null,3,3,3,3,2,3,3,null,null,null,null,null,3047]
[3047,"A","Metro","Metro","210 VIC Metro - Sunbury","Metro","A Metro",1,null,20903,15.3,null,null,null,"Metro",93.333333333333329,null,3,3,3,3,2,3,3,null,null,null,null,null,3048]
[3048,"A","Metro","Metro","210 VIC Metro - Sunbury","Metro","A Metro",1,null,18029,18.5,null,null,null,"Metro",93.333333333333329,null,3,3,3,3,2,3,3,null,null,null,null,null,3049]
[3049,"A","Metro","Metro","210 VIC Metro - Sunbury","Metro","A Metro",1,null,9262,16.7,null,null,null,"Metro",86.666666666666671,null,3,3,3,3,1,3,3,null,null,null,null,null,3050]
[3050,"A","Metro","Metro","206 VIC Metro - CBD & Inner Suburbs","Metro","A Metro",1,null,117,2.2000000000000002,null,null,null,"Metro",80,null,3,3,3,3,0,3,3,null,null,null,null,null,3051]
[3051,"A","Metro","Metro","206 VIC Metro - CBD & Inner Suburbs","Metro","A Metro",1,null,14940,2.2000000000000002,null,null,null,"Metro",93.333333333333329,null,3,3,3,3,2,3,3,null,null,null,null,null,3052]
[3052,"A","Metro","Metro","206 VIC Metro - CBD & Inner Suburbs","Metro","A Metro",1,null,5694,4,null,null,null,"Metro",86.666666666666671,null,3,3,3,3,1,3,3,null,null,null,null,null,3053]
[3053,"A","Metro","Metro","206 VIC Metro - CBD & Inner Suburbs","Metro","A Metro",1,null,18535,1.9,null,null,null,"Metro",93.333333333333329,null,3,3,3,3,2,3,3,null,null,null,null,null,3054]
[3054,"A","Metro","Metro","206 VIC Metro - CBD & Inner Suburbs","Metro","A Metro",1,null,8428,3.2,null,null,null,"Metro",86.666666666666671,null,3,3,3,3,1,3,3,null,null,null,null,null,3055]
[3055,"A","Metro","Metro","206 VIC Metro - CBD & Inner Suburbs","Metro","A Metro",1,null,14159,6.3,null,null,null,"Metro",93.333333333333329,null,3,3,3,3,2,3,3,null,null,null,null,null,3056]
[3056,"A","Metro","Metro","206 VIC Metro - CBD & Inner Suburbs","Metro","A Metro",1,null,24473,5.3,null,null,null,"Metro",93.333333333333329,null,3,3,3,3,2,3,3,null,null,null,null,null,3057]
[3057,"A","Metro","Metro","206 VIC Metro - CBD & Inner Suburbs","Metro","A Metro",1,null,11504,5.0999999999999996,null,null,null,"Metro",93.333333333333329,null,3,3,3,3,2,3,3,null,null,null,null,null,3058]
[3058,"A","Metro","Metro","206 VIC Metro - CBD & Inner Suburbs","Metro","A Metro",1,null,33778,8.3000000000000007,null,null,null,"Metro",93.333333333333329,null,3,3,3,3,2,3,3,null,null,null,null,null,3059]
[3059,"A","Metro","Metro","210 VIC Metro - Sunbury","Metro","A Metro",1,null,15466,21.2,null,null,null,"Metro",93.333333333333329,null,3,3,3,3,2,3,3,null,null,null,null,null,3060]
[3060,"A","Metro","Metro","210 VIC Metro - Sunbury","Metro","A Metro",1,null,14043,12.2,null,null,null,"Metro",93.333333333333329,null,3,3,3,3,2,3,3,null,null,null,null,null,3061]
[3061,"A","Metro","Metro","210 VIC Metro - Sunbury","Metro","A Metro",1,null,5056,15.4,null,null,null,"Metro",86.666666666666671,null,3,3,3,3,1,3,3,null,null,null,null,null,3062]
[3062,"A","Metro","Metro","210 VIC Metro - Sunbury","Metro","A Metro",1,null,0,15.4,null,null,null,"Metro",80,null,3,3,3,3,0,3,3,null,"Geographic Region",null,null,null,3063]
[3063,"A","Metro","Metro","210 VIC Metro - Sunbury","Metro","A Metro",1,null,573,15.4,null,null,null,"Metro",80,null,3,3,3,3,0,3,3,null,null,null,null,null,3064]
[3064,"A","Metro","Metro","210 VIC Metro - Sunbury","Metro","A Metro",1,null,75457,26.3,null,null,null,"Metro",90,null,3,3,3,3,2,2,3,null,null,null,null,null,3065]
[3065,"A","Metro","Metro","206 VIC Metro - CBD & Inner Suburbs","Metro","A Metro",1,null,10445,2.1,null,null,null,"Metro",93.333333333333329,null,3,3,3,3,2,3,3,null,null,null,null,null,3066]
[3066,"A","Metro","Metro","206 VIC Metro - CBD & Inner Suburbs","Metro","A Metro",1,null,8513,2.7,null,null,null,"Metro",86.666666666666671,null,3,3,3,3,1,3,3,null,null,null,null,null,3067]
[3067,"A","Metro","Metro","206 VIC Metro - CBD & Inner Suburbs","Metro","A Metro",1,null,8197,3.7,null,null,null,"Metro",86.666666666666671,null,3,3,3,3,1,3,3,null,null,null,null,null,3068]
[3068,"A","Metro","Metro","206 VIC Metro - CBD & Inner Suburbs","Metro","A Metro",1,null,18662,3.8,null,null,null,"Metro",93.333333333333329,null,3,3,3,3,2,3,3,null,null,null,null,null,3070]
[3070,"A","Metro","Metro","206 VIC Metro - CBD & Inner Suburbs","Metro","A Metro",1,null,24561,5.8,null,null,null,"Metro",93.333333333333329,null,3,3,3,3,2,3,3,null,null,null,null,null,3071]
[3071,"A","Metro","Metro","206 VIC Metro - CBD & Inner Suburbs","Metro","A Metro",1,null,18568,7.3,null,null,null,"Metro",93.333333333333329,null,3,3,3,3,2,3,3,null,null,null,null,null,3072]
[3072,"A","Metro","Metro","209 VIC Metro - Greensborough","Metro","A Metro",1,null,32851,8.9,null,null,null,"Metro",93.333333333333329,null,3,3,3,3,2,3,3,null,null,null,null,null,3073]
[3073,"A","Metro","Metro","209 VIC Metro - Greensborough","Metro","A Metro",1,null,50474,12.1,null,null,null,"Metro",93.333333333333329,null,3,3,3,3,2,3,3,null,null,null,null,null,3074]
[3074,"A","Metro","Metro","209 VIC Metro - Greensborough","Metro","A Metro",1,null,20523,15.6,null,null,null,"Metro",93.333333333333329,null,3,3,3,3,2,3,3,null,null,null,null,null,3075]
[3075,"A","Metro","Metro","209 VIC Metro - Greensborough","Metro","A Metro",1,null,22594,17,null,null,null,"Metro",93.333333333333329,null,3,3,3,3,2,3,3,null,null,null,null,null,3076]
[3076,"A","Metro","Metro","209 VIC Metro - Greensborough","Metro","A Metro",1,null,32395,20.6,null,null,null,"Metro",93.333333333333329,null,3,3,3,3,2,3,3,null,null,null,null,null,3078]
[3078,"A","Metro","Metro","206 VIC Metro - CBD & Inner Suburbs","Metro","A Metro",1,null,11638,6.8,null,null,null,"Metro",93.333333333333329,null,3,3,3,3,2,3,3,null,null,null,null,null,3079]
[3079,"A","Metro","Metro","209 VIC Metro - Greensborough","Metro","A Metro",1,null,15988,9.1999999999999993,null,null,null,"Metro",93.333333333333329,null,3,3,3,3,2,3,3,null,null,null,null,null,3081]
[3081,"A","Metro","Metro","209 VIC Metro - Greensborough","Metro","A Metro",1,null,13424,11,null,null,null,"Metro",93.333333333333329,null,3,3,3,3,2,3,3,null,null,null,null,null,3082]
[3082,"A","Metro","Metro","209 VIC Metro - Greensborough","Metro","A Metro",1,null,29710,19.600000000000001,null,null,null,"Metro",93.333333333333329,null,3,3,3,3,2,3,3,null,null,null,null,null,3083]
[3083,"A","Metro","Metro","209 VIC Metro - Greensborough","Metro","A Metro",1,null,31526,15.6,null,null,null,"Metro",93.333333333333329,null,3,3,3,3,2,3,3,null,null,null,null,null,3084]
[3084,"A","Metro","Metro","209 VIC Metro - Greensborough","Metro","A Metro",1,null,25517,12.4,null,null,null,"Metro",93.333333333333329,null,3,3,3,3,2,3,3,null,null,null,null,null,3085]
[3085,"A","Metro","Metro","209 VIC Metro - Greensborough","Metro","A Metro",1,null,13886,14.4,null,null,null,"Metro",93.333333333333329,null,3,3,3,3,2,3,3,null,null,null,null,null,3086]
[3086,"A","Metro","Metro","209 VIC Metro - Greensborough","Metro","A Metro",1,null,910,0,null,null,null,"Non Metro",70,null,3,3,3,3,0,0,3,null,null,null,null,null,3087]
[3087,"A","Metro","Metro","209 VIC Metro - Greensborough","Metro","A Metro",1,null,9031,16.100000000000001,null,null,null,"Metro",86.666666666666671,null,3,3,3,3,1,3,3,null,null,null,null,null,3088]
[3088,"A","Metro","Metro","209 VIC Metro - Greensborough","Metro","A Metro",1,null,26892,18.3,null,null,null,"Metro",93.333333333333329,null,3,3,3,3,2,3,3,null,null,null,null,null,3089]
[3089,"A","Metro","Metro","209 VIC Metro - Greensborough","Metro","A Metro",1,null,11733,23.1,null,null,null,"Metro",93.333333333333329,null,3,3,3,3,2,3,3,null,null,null,null,null,3090]
[3090,"A","Metro","Metro","209 VIC Metro - Greensborough","Metro","A Metro",1,null,2364,21.2,null,null,null,"Metro",80,null,3,3,3,3,0,3,3,null,null,null,null,null,3091]
[3091,"A","Metro","Metro","209 VIC Metro - Greensborough","Metro","A Metro",1,null,1588,24.6,null,null,null,"Metro",80,null,3,3,3,3,0,3,3,null,null,null,null,null,3093]
[3093,"A","Metro","Metro","209 VIC Metro - Greensborough","Metro","A Metro",1,null,3891,16.600000000000001,null,null,null,"Metro",80,null,3,3,3,3,0,3,3,null,null,null,null,null,3094]
[3094,"A","Metro","Metro","209 VIC Metro - Greensborough","Metro","A Metro",1,null,8960,17.8,null,null,null,"Metro",86.666666666666671,null,3,3,3,3,1,3,3,null,null,null,null,null,3095]
[3095,"A","Metro","Metro","209 VIC Metro - Greensborough","Metro","A Metro",1,null,27771,20.7,null,null,null,"Metro",93.333333333333329,null,3,3,3,3,2,3,3,null,null,null,null,null,3096]
[3096,"A","Metro","Metro","209 VIC Metro - Greensborough","Metro","A Metro",1,null,1961,25.6,null,null,null,"Metro",76.666666666666671,null,3,3,3,3,0,2,3,null,null,null,null,null,3097]
[3097,"A","Metro","Metro","209 VIC Metro - Greensborough","Metro","A Metro",1,null,1443,28.7,null,null,null,"Metro",76.666666666666671,null,3,3,3,3,0,2,3,null,null,null,null,null,3099]
[3099,"A","Metro","Metro","209 VIC Metro - Greensborough","Metro","A Metro",1,null,4878,29.6,null,null,null,"Metro",76.666666666666671,null,3,3,3,3,0,2,3,null,null,null,null,null,3101]
[3101,"A","Metro","Metro","207 VIC Metro - Camberwell","Metro","A Metro",1,null,24605,6.7,null,null,null,"Metro",93.333333333333329,null,3,3,3,3,2,3,3,null,null,null,null,null,3102]
[3102,"A","Metro","Metro","207 VIC Metro - Camberwell","Metro","A Metro",1,null,6635,8.4,null,null,null,"Metro",86.666666666666671,null,3,3,3,3,1,3,3,null,null,null,null,null,3103]
[3103,"A","Metro","Metro","207 VIC Metro - Camberwell","Metro","A Metro",1,null,15343,10.3,null,null,null,"Metro",93.333333333333329,null,3,3,3,3,2,3,3,null,null,null,null,null,3104]
[3104,"A","Metro","Metro","207 VIC Metro - Camberwell","Metro","A Metro",1,null,20406,11,null,null,null,"Metro",93.333333333333329,null,3,3,3,3,2,3,3,null,null,null,null,null,3105]
[3105,"A","Metro","Metro","207 VIC Metro - Camberwell","Metro","A Metro",1,null,10873,12.5,null,null,null,"Metro",93.333333333333329,null,3,3,3,3,2,3,3,null,null,null,null,null,3106]
[3106,"A","Metro","Metro","207 VIC Metro - Camberwell","Metro","A Metro",1,null,16618,17.600000000000001,null,null,null,"Metro",93.333333333333329,null,3,3,3,3,2,3,3,null,null,null,null,null,3107]
[3107,"A","Metro","Metro","207 VIC Metro - Camberwell","Metro","A Metro",1,null,13552,14.3,null,null,null,"Metro",93.333333333333329,null,3,3,3,3,2,3,3,null,null,null,null,null,3108]
[3108,"A","Metro","Metro","207 VIC Metro - Camberwell","Metro","A Metro",1,null,20826,14.6,null,null,null,"Metro",93.333333333333329,null,3,3,3,3,2,3,3,null,null,null,null,null,3109]
[3109,"A","Metro","Metro","207 VIC Metro - Camberwell","Metro","A Metro",1,null,28360,18,null,null,null,"Metro",93.333333333333329,null,3,3,3,3,2,3,3,null,null,null,null,null,3111]
[3111,"A","Metro","Metro","211 VIC Metro - Lilydale","Metro","A Metro",1,null,12347,19.7,null,null,null,"Metro",93.333333333333329,null,3,3,3,3,2,3,3,null,null,null,null,null,3113]
[3113,"A","Metro","Metro","211 VIC Metro - Lilydale","Metro","A Metro",1,null,8457,23.1,null,null,null,"Metro",86.666666666666671,null,3,3,3,3,1,3,3,null,null,null,null,null,3114]
[3114,"A","Metro","Metro","211 VIC Metro - Lilydale","Metro","A Metro",1,null,3822,22.6,null,null,null,{"$f":"IF(ISBLANK(N770),IF(AND(H770<>\"\",IF(I770=\"High Density\",\"High Density\",IF(AND(P770<=45,P770>0),\"Refer to Distribution Partner\",IF(AND(P770<=55,P770>45),\"Regional\",IF(AND(P770>55,P770<=70),\"Non Metro\",IF(F770=\"Nonmetro\",\"Non Metro\",IF(P770>70,\"Metro\",\"\"))))))=\"Refer to Distribution Partner\"),\"Regional\",IF(I770=\"High Density\",\"High Density\",IF(AND(P770<=45,P770>0),\"Refer to Distribution Partner\",IF(AND(P770<=55,P770>45),\"Regional\",IF(AND(P770>55,P770<=70),\"Non Metro\",IF(F770=\"Nonmetro\",\"Non Metro\",IF(P770>70,\"Metro\",\"\"))))))),N770)","v":"Metro"},{"$f":"(R770/$AB$3*$AA$3+S770/$AB$4*$AA$4+T770/$AB$5*$AA$5+U770/$AB$6*$AA$6+V770/$AB$7*$AA$7+W770/$AB$8*$AA$8+X770/$AB$9*$AA$9)*100","v":80},null,{"$f":"IF(ISNUMBER(SEARCH(\"Metro\",E770)),3,IF(ISNUMBER(SEARCH(\"Rural\",E770)),2,1))","v":3},{"$f":"IF(ISNUMBER(FIND(\"Metro\",F770)),3,IF(ISNUMBER(FIND(\"Nonmetro\",F770)),2,3))","v":3},{"$f":"IF(G770=\"A Metro\",3,IF(G770=\"B Regional\",2,IF(G770=\"C Pop > 7,000\",1,IF(G770=\"D Pop > 2,000\",1,0))))","v":3},{"$f":"IF(H770=1,3,IF(H770=2,2,IF(H770=3,1,0)))","v":3},{"$f":"IF(J770>=100000,3,IF(AND(J770>=10000,J770<100000),2,IF(AND(J770>=5000,J770<10000),1,0)))","v":0},{"$f":"IF(AND(K770>=0.1,K770<25),3,IF(AND(K770>=25,K770<50),2,IF(AND(K770>=50,K770<150),1,0)))","v":3},{"$f":"IF(L770=\"\",3,0)","v":3},null,null,null,null,null,3115]
[3115,"A","Metro","Metro","211 VIC Metro - Lilydale","Metro","A Metro",1,null,3796,28.7,null,null,null,"Metro",76.666666666666671,null,3,3,3,3,0,2,3,null,null,null,null,null,3116]
[3116,"A","Metro","Metro","211 VIC Metro - Lilydale","Metro","A Metro",1,null,9872,31.9,null,null,null,"Metro",83.333333333333343,null,3,3,3,3,1,2,3,null,null,null,null,null,3121]
[3121,"A","Metro","Metro","206 VIC Metro - CBD & Inner Suburbs","Metro","A Metro",1,null,31499,3.5,null,null,null,"Metro",93.333333333333329,null,3,3,3,3,2,3,3,null,null,null,null,null,3122]
[3122,"A","Metro","Metro","207 VIC Metro - Camberwell","Metro","A Metro",1,"High Density",23511,6.3,null,null,null,"High Density",93.333333333333329,null,3,3,3,3,2,3,3,null,null,null,null,null,3123]
[3123,"A","Metro","Metro","207 VIC Metro - Camberwell","Metro","A Metro",1,null,14321,7.9,null,null,null,"Metro",93.333333333333329,null,3,3,3,3,2,3,3,null,null,null,null,null,3124]
[3124,"A","Metro","Metro","207 VIC Metro - Camberwell","Metro","A Metro",1,null,22094,10.199999999999999,null,null,null,"Metro",93.333333333333329,null,3,3,3,3,2,3,3,null,null,null,null,null,3125]
[3125,"A","Metro","Metro","207 VIC Metro - Camberwell","Metro","A Metro",1,null,15019,14.1,null,null,null,"Metro",93.333333333333329,null,3,3,3,3,2,3,3,null,null,null,null,null,3126]
[3126,"A","Metro","Metro","207 VIC Metro - Camberwell","Metro","A Metro",1,null,8056,10,null,null,null,"Metro",86.666666666666671,null,3,3,3,3,1,3,3,null,null,null,null,null,3127]
[3127,"A","Metro","Metro","207 VIC Metro - Camberwell","Metro","A Metro",1,null,18445,12.1,null,null,null,"Metro",93.333333333333329,null,3,3,3,3,2,3,3,null,null,null,null,null,3128]
[3128,"A","Metro","Metro","207 VIC Metro - Camberwell","Metro","A Metro",1,"High Density",19828,14.3,null,null,null,"High Density",93.333333333333329,null,3,3,3,3,2,3,3,null,null,null,null,null,3129]
[3129,"A","Metro","Metro","207 VIC Metro - Camberwell","Metro","A Metro",1,null,17376,14.2,null,null,null,"Metro",93.333333333333329,null,3,3,3,3,2,3,3,null,null,null,null,null,3130]
[3130,"A","Metro","Metro","207 VIC Metro - Camberwell","Metro","A Metro",1,null,32174,16.600000000000001,null,null,null,"Metro",93.333333333333329,null,3,3,3,3,2,3,3,null,null,null,null,null,3131]
[3131,"A","Metro","Metro","211 VIC Metro - Lilydale","Metro","A Metro",1,null,22504,18.600000000000001,null,null,null,"Metro",93.333333333333329,null,3,3,3,3,2,3,3,null,null,null,null,null,3132]
[3132,"A","Metro","Metro","211 VIC Metro - Lilydale","Metro","A Metro",1,null,16148,20.7,null,null,null,"Metro",93.333333333333329,null,3,3,3,3,2,3,3,null,null,null,null,null,3133]
[3133,"A","Metro","Metro","211 VIC Metro - Lilydale","Metro","A Metro",1,null,22125,20.7,null,null,null,"Metro",93.333333333333329,null,3,3,3,3,2,3,3,null,null,null,null,null,3134]
[3134,"A","Metro","Metro","211 VIC Metro - Lilydale","Metro","A Metro",1,null,32781,24.2,null,null,null,"Metro",93.333333333333329,null,3,3,3,3,2,3,3,null,null,null,null,null,3135]
[3135,"A","Metro","Metro","211 VIC Metro - Lilydale","Metro","A Metro",1,null,19956,25.1,null,null,null,"Metro",90,null,3,3,3,3,2,2,3,null,null,null,null,null,3136]
[3136,"A","Metro","Metro","211 VIC Metro - Lilydale","Metro","A Metro",1,null,44369,28.4,null,null,null,"Metro",90,null,3,3,3,3,2,2,3,null,null,null,null,null,3137]
[3137,"A","Metro","Metro","211 VIC Metro - Lilydale","Metro","A Metro",1,null,13871,31,null,null,null,"Metro",90,null,3,3,3,3,2,2,3,null,null,null,null,null,3138]
[3138,"A","Metro","Metro","211 VIC Metro - Lilydale","Metro","A Metro",1,null,21967,31.8,null,null,null,"Metro",90,null,3,3,3,3,2,2,3,null,null,null,null,null,3139]
[3139,"A","Metro","Metro","211 VIC Metro - Lilydale","Metro","A Metro",1,null,13718,47.9,null,null,null,"Metro",90,null,3,3,3,3,2,2,3,null,null,null,null,null,3140]
[3140,"A","Metro","Metro","211 VIC Metro - Lilydale","Metro","A Metro",1,null,16531,35,null,null,null,"Metro",90,null,3,3,3,3,2,2,3,null,null,null,null,null,3141]
[3141,"A","Metro","Metro","206 VIC Metro - CBD & Inner Suburbs","Metro","A Metro",1,"High Density",25147,3.9,null,null,null,"High Density",93.333333333333329,null,3,3,3,3,2,3,3,null,null,null,null,null,3142]
[3142,"A","Metro","Metro","206 VIC Metro - CBD & Inner Suburbs","Metro","A Metro",1,null,12909,5.6,null,null,null,"Metro",93.333333333333329,null,3,3,3,3,2,3,3,null,null,null,null,null,3143]
[3143,"A","Metro","Metro","206 VIC Metro - CBD & Inner Suburbs","Metro","A Metro",1,null,9054,7,null,null,null,"Metro",86.666666666666671,null,3,3,3,3,1,3,3,null,null,null,null,null,3144]
[3144,"A","Metro","Metro","208 VIC Metro - Sandringham","Metro","A Metro",1,null,10886,7.9,null,null,null,"Metro",93.333333333333329,null,3,3,3,3,2,3,3,null,null,null,null,null,3145]
[3145,"A","Metro","Metro","208 VIC Metro - Sandringham","Metro","A Metro",1,"High Density",23295,11.1,null,null,null,"High Density",93.333333333333329,null,3,3,3,3,2,3,3,null,null,null,null,null,3146]
[3146,"A","Metro","Metro","207 VIC Metro - Camberwell","Metro","A Metro",1,null,25255,10.1,null,null,null,"Metro",93.333333333333329,null,3,3,3,3,2,3,3,null,null,null,null,null,3147]
[3147,"A","Metro","Metro","207 VIC Metro - Camberwell","Metro","A Metro",1,null,14637,12.9,null,null,null,"Metro",93.333333333333329,null,3,3,3,3,2,3,3,null,null,null,null,null,3148]
[3148,"A","Metro","Metro","212 VIC Metro - Dandenong","Metro","A Metro",1,null,8641,14.3,null,null,null,"Metro",86.666666666666671,null,3,3,3,3,1,3,3,null,null,null,null,null,3149]
[3149,"A","Metro","Metro","212 VIC Metro - Dandenong","Metro","A Metro",1,null,33611,16.3,null,null,null,"Metro",93.333333333333329,null,3,3,3,3,2,3,3,null,null,null,null,null,3150]
[3150,"A","Metro","Metro","212 VIC Metro - Dandenong","Metro","A Metro",1,null,60079,20.2,null,null,null,"Metro",93.333333333333329,null,3,3,3,3,2,3,3,null,null,null,null,null,3151]
[3151,"A","Metro","Metro","207 VIC Metro - Camberwell","Metro","A Metro",1,null,10273,16.899999999999999,null,null,null,"Metro",93.333333333333329,null,3,3,3,3,2,3,3,null,null,null,null,null,3152]
[3152,"A","Metro","Metro","211 VIC Metro - Lilydale","Metro","A Metro",1,null,33092,24.3,null,null,null,"Metro",93.333333333333329,null,3,3,3,3,2,3,3,null,null,null,null,null,3153]
[3153,"A","Metro","Metro","211 VIC Metro - Lilydale","Metro","A Metro",1,null,20554,27.4,null,null,null,"Metro",90,null,3,3,3,3,2,2,3,null,null,null,null,null,3154]
[3154,"A","Metro","Metro","211 VIC Metro - Lilydale","Metro","A Metro",1,null,4419,31.3,null,null,null,"Metro",76.666666666666671,null,3,3,3,3,0,2,3,null,null,null,null,null,3155]
[3155,"A","Metro","Metro","211 VIC Metro - Lilydale","Metro","A Metro",1,null,22195,28.7,null,null,null,"Metro",90,null,3,3,3,3,2,2,3,null,null,null,null,null,3156]
[3156,"A","Metro","Metro","211 VIC Metro - Lilydale","Metro","A Metro",1,null,37464,29.4,null,null,null,"Metro",90,null,3,3,3,3,2,2,3,null,null,null,null,null,3158]
[3158,"A","Metro","Metro","211 VIC Metro - Lilydale","Metro","A Metro",1,null,6652,33.799999999999997,null,null,null,"Metro",83.333333333333343,null,3,3,3,3,1,2,3,null,null,null,null,null,3159]
[3159,"A","Metro","Metro","211 VIC Metro - Lilydale","Metro","A Metro",1,null,2648,38.5,null,null,null,"Metro",76.666666666666671,null,3,3,3,3,0,2,3,null,null,null,null,null,3160]
[3160,"A","Metro","Metro","211 VIC Metro - Lilydale","Metro","A Metro",1,null,9014,35.9,null,null,null,"Metro",83.333333333333343,null,3,3,3,3,1,2,3,null,null,null,null,null,3161]
[3161,"A","Metro","Metro","208 VIC Metro - Sandringham","Metro","A Metro",1,null,15269,8.1999999999999993,null,null,null,"Metro",93.333333333333329,null,3,3,3,3,2,3,3,null,null,null,null,null,3162]
[3162,"A","Metro","Metro","208 VIC Metro - Sandringham","Metro","A Metro",1,null,17448,10.3,null,null,null,"Metro",93.333333333333329,null,3,3,3,3,2,3,3,null,null,null,null,null,3163]
[3163,"A","Metro","Metro","208 VIC Metro - Sandringham","Metro","A Metro",1,null,32353,12.5,null,null,null,"Metro",93.333333333333329,null,3,3,3,3,2,3,3,null,null,null,null,null,3165]
[3165,"A","Metro","Metro","208 VIC Metro - Sandringham","Metro","A Metro",1,null,27635,15.2,null,null,null,"Metro",93.333333333333329,null,3,3,3,3,2,3,3,null,null,null,null,null,3166]
[3166,"A","Metro","Metro","212 VIC Metro - Dandenong","Metro","A Metro",1,null,23757,15.5,null,null,null,"Metro",93.333333333333329,null,3,3,3,3,2,3,3,null,null,null,null,null,3167]
[3167,"A","Metro","Metro","212 VIC Metro - Dandenong","Metro","A Metro",1,null,9261,16.600000000000001,null,null,null,"Metro",86.666666666666671,null,3,3,3,3,1,3,3,null,null,null,null,null,3168]
[3168,"A","Metro","Metro","212 VIC Metro - Dandenong","Metro","A Metro",1,null,20197,18.600000000000001,null,null,null,"Metro",93.333333333333329,null,3,3,3,3,2,3,3,null,null,null,null,null,3169]
[3169,"A","Metro","Metro","212 VIC Metro - Dandenong","Metro","A Metro",1,null,20122,19.7,null,null,null,"Metro",93.333333333333329,null,3,3,3,3,2,3,3,null,null,null,null,null,3170]
[3170,"A","Metro","Metro","212 VIC Metro - Dandenong","Metro","A Metro",1,null,19368,22.9,null,null,null,"Metro",93.333333333333329,null,3,3,3,3,2,3,3,null,null,null,null,null,3171]
[3171,"A","Metro","Metro","212 VIC Metro - Dandenong","Metro","A Metro",1,null,21714,22.6,null,null,null,"Metro",93.333333333333329,null,3,3,3,3,2,3,3,null,null,null,null,null,3172]
[3172,"A","Metro","Metro","212 VIC Metro - Dandenong","Metro","A Metro",1,null,23089,23.9,null,null,null,"Metro",93.333333333333329,null,3,3,3,3,2,3,3,null,null,null,null,null,3173]
[3173,"A","Metro","Metro","212 VIC Metro - Dandenong","Metro","A Metro",1,null,25785,27.2,null,null,null,"Metro",90,null,3,3,3,3,2,2,3,null,null,null,null,null,3174]
[3174,"A","Metro","Metro","212 VIC Metro - Dandenong","Metro","A Metro",1,null,38461,25.5,null,null,null,"Metro",90,null,3,3,3,3,2,2,3,null,null,null,null,null,3175]
[3175,"A","Metro","Metro","212 VIC Metro - Dandenong","Metro","A Metro",1,null,53297,28.6,null,null,null,"Metro",90,null,3,3,3,3,2,2,3,null,null,null,null,null,3177]
[3177,"A","Metro","Metro","212 VIC Metro - Dandenong","Metro","A Metro",1,null,11306,31.6,null,null,null,"Metro",90,null,3,3,3,3,2,2,3,null,null,null,null,null,3178]
[3178,"A","Metro","Metro","211 VIC Metro - Lilydale","Metro","A Metro",1,null,33672,28,null,null,null,"Metro",90,null,3,3,3,3,2,2,3,null,null,null,null,null,3179]
[3179,"A","Metro","Metro","211 VIC Metro - Lilydale","Metro","A Metro",1,null,6022,24.9,null,null,null,"Metro",86.666666666666671,null,3,3,3,3,1,3,3,null,null,null,null,null,3180]
[3180,"A","Metro","Metro","211 VIC Metro - Lilydale","Metro","A Metro",1,null,7462,26.6,null,null,null,"Metro",83.333333333333343,null,3,3,3,3,1,2,3,null,null,null,null,null,3181]
[3181,"A","Metro","Metro","206 VIC Metro - CBD & Inner Suburbs","Metro","A Metro",1,null,20260,5.4,null,null,null,"Metro",93.333333333333329,null,3,3,3,3,2,3,3,null,null,null,null,null,3182]
[3182,"A","Metro","Metro","206 VIC Metro - CBD & Inner Suburbs","Metro","A Metro",1,null,23391,5.7,null,null,null,"Metro",93.333333333333329,null,3,3,3,3,2,3,3,null,null,null,null,null,3183]
[3183,"A","Metro","Metro","206 VIC Metro - CBD & Inner Suburbs","Metro","A Metro",1,null,18497,6.8,null,null,null,"Metro",93.333333333333329,null,3,3,3,3,2,3,3,null,null,null,null,null,3184]
[3184,"A","Metro","Metro","206 VIC Metro - CBD & Inner Suburbs","Metro","A Metro",1,null,15543,7.7,null,null,null,"Metro",93.333333333333329,null,3,3,3,3,2,3,3,null,null,null,null,null,3185]
[3185,"A","Metro","Metro","208 VIC Metro - Sandringham","Metro","A Metro",1,null,12929,8.8000000000000007,null,null,null,{"$f":"IF(ISBLANK(N834),IF(AND(H834<>\"\",IF(I834=\"High Density\",\"High Density\",IF(AND(P834<=45,P834>0),\"Refer to Distribution Partner\",IF(AND(P834<=55,P834>45),\"Regional\",IF(AND(P834>55,P834<=70),\"Non Metro\",IF(F834=\"Nonmetro\",\"Non Metro\",IF(P834>70,\"Metro\",\"\"))))))=\"Refer to Distribution Partner\"),\"Regional\",IF(I834=\"High Density\",\"High Density\",IF(AND(P834<=45,P834>0),\"Refer to Distribution Partner\",IF(AND(P834<=55,P834>45),\"Regional\",IF(AND(P834>55,P834<=70),\"Non Metro\",IF(F834=\"Nonmetro\",\"Non Metro\",IF(P834>70,\"Metro\",\"\"))))))),N834)","v":"Metro"},{"$f":"(R834/$AB$3*$AA$3+S834/$AB$4*$AA$4+T834/$AB$5*$AA$5+U834/$AB$6*$AA$6+V834/$AB$7*$AA$7+W834/$AB$8*$AA$8+X834/$AB$9*$AA$9)*100","v":93.333333333333329},null,{"$f":"IF(ISNUMBER(SEARCH(\"Metro\",E834)),3,IF(ISNUMBER(SEARCH(\"Rural\",E834)),2,1))","v":3},{"$f":"IF(ISNUMBER(FIND(\"Metro\",F834)),3,IF(ISNUMBER(FIND(\"Nonmetro\",F834)),2,3))","v":3},{"$f":"IF(G834=\"A Metro\",3,IF(G834=\"B Regional\",2,IF(G834=\"C Pop > 7,000\",1,IF(G834=\"D Pop > 2,000\",1,0))))","v":3},{"$f":"IF(H834=1,3,IF(H834=2,2,IF(H834=3,1,0)))","v":3},{"$f":"IF(J834>=100000,3,IF(AND(J834>=10000,J834<100000),2,IF(AND(J834>=5000,J834<10000),1,0)))","v":2},{"$f":"IF(AND(K834>=0.1,K834<25),3,IF(AND(K834>=25,K834<50),2,IF(AND(K834>=50,K834<150),1,0)))","v":3},{"$f":"IF(L834=\"\",3,0)","v":3},null,null,null,null,null,3186]
[3186,"A","Metro","Metro","208 VIC Metro - Sandringham","Metro","A Metro",1,null,23253,11.1,null,null,null,"Metro",93.333333333333329,null,3,3,3,3,2,3,3,null,null,null,null,null,3187]
[3187,"A","Metro","Metro","208 VIC Metro - Sandringham","Metro","A Metro",1,null,15998,12.4,null,null,null,"Metro",93.333333333333329,null,3,3,3,3,2,3,3,null,null,null,null,null,3188]
[3188,"A","Metro","Metro","208 VIC Metro - Sandringham","Metro","A Metro",1,null,18083,14.7,null,null,null,"Metro",93.333333333333329,null,3,3,3,3,2,3,3,null,null,null,null,null,3189]
[3189,"A","Metro","Metro","208 VIC Metro - Sandringham","Metro","A Metro",1,null,5895,16,null,null,null,"Metro",86.666666666666671,null,3,3,3,3,1,3,3,null,null,null,null,null,3190]
[3190,"A","Metro","Metro","208 VIC Metro - Sandringham","Metro","A Metro",1,null,10454,16.899999999999999,null,null,null,"Metro",93.333333333333329,null,3,3,3,3,2,3,3,null,null,null,null,null,3191]
[3191,"A","Metro","Metro","208 VIC Metro - Sandringham","Metro","A Metro",1,null,10241,16.399999999999999,null,null,null,"Metro",93.333333333333329,null,3,3,3,3,2,3,3,null,null,null,null,null,3192]
[3192,"A","Metro","Metro","208 VIC Metro - Sandringham","Metro","A Metro",1,null,22291,18.899999999999999,null,null,null,"Metro",93.333333333333329,null,3,3,3,3,2,3,3,null,null,null,null,null,3193]
[3193,"A","Metro","Metro","208 VIC Metro - Sandringham","Metro","A Metro",1,null,19508,19.5,null,null,null,"Metro",93.333333333333329,null,3,3,3,3,2,3,3,null,null,null,null,null,3194]
[3194,"A","Metro","Metro","208 VIC Metro - Sandringham","Metro","A Metro",1,null,12965,20.9,null,null,null,"Metro",93.333333333333329,null,3,3,3,3,2,3,3,null,null,null,null,null,3195]
[3195,"A","Metro","Metro","208 VIC Metro - Sandringham","Metro","A Metro",1,null,35869,24.6,null,null,null,"Metro",93.333333333333329,null,3,3,3,3,2,3,3,null,null,null,null,null,3196]
[3196,"A","Metro","Metro","208 VIC Metro - Sandringham","Metro","A Metro",1,null,25327,29.7,null,null,null,"Metro",90,null,3,3,3,3,2,2,3,null,null,null,null,null,3197]
[3197,"A","Metro","Metro","208 VIC Metro - Sandringham","Metro","A Metro",1,null,11548,32.6,null,null,null,"Metro",90,null,3,3,3,3,2,2,3,null,null,null,null,null,3198]
[3198,"A","Metro","Metro","214 VIC Metro - Mornington Peninsula","Metro","A Metro",1,null,16463,36.299999999999997,null,null,null,"Metro",90,null,3,3,3,3,2,2,3,null,null,null,null,null,3199]
[3199,"A","Metro","Metro","214 VIC Metro - Mornington Peninsula","Metro","A Metro",1,null,54298,41.4,null,null,null,"Metro",90,null,3,3,3,3,2,2,3,null,null,null,null,null,3200]
[3200,"A","Metro","Metro","214 VIC Metro - Mornington Peninsula","Metro","A Metro",1,null,5762,38.1,null,null,null,"Metro",83.333333333333343,null,3,3,3,3,1,2,3,null,null,null,null,null,3201]
[3201,"A","Metro","Metro","214 VIC Metro - Mornington Peninsula","Metro","A Metro",1,null,20711,37.5,null,null,null,"Metro",90,null,3,3,3,3,2,2,3,null,null,null,null,null,3202]
[3202,"A","Metro","Metro","208 VIC Metro - Sandringham","Metro","A Metro",1,null,2907,19,null,null,null,"Metro",80,null,3,3,3,3,0,3,3,null,null,null,null,null,3204]
[3204,"A","Metro","Metro","208 VIC Metro - Sandringham","Metro","A Metro",1,null,30635,13,null,null,null,"Metro",93.333333333333329,null,3,3,3,3,2,3,3,null,null,null,null,null,3205]
[3205,"A","Metro","Metro","206 VIC Metro - CBD & Inner Suburbs","Metro","A Metro",1,null,10920,2.7,null,null,null,"Metro",93.333333333333329,null,3,3,3,3,2,3,3,null,null,null,null,null,3206]
[3206,"A","Metro","Metro","206 VIC Metro - CBD & Inner Suburbs","Metro","A Metro",1,null,10359,4,null,null,null,"Metro",93.333333333333329,null,3,3,3,3,2,3,3,null,null,null,null,null,3207]
[3207,"A","Metro","Metro","206 VIC Metro - CBD & Inner Suburbs","Metro","A Metro",1,null,16175,3.7,null,null,null,"Metro",93.333333333333329,null,3,3,3,3,2,3,3,null,null,null,null,null,3211]
[3211,"A","Metro","Metro","213 VIC Metro - Melton / Werrribee","Metro","A Metro",1,null,1322,0,null,null,null,"Non Metro",70,null,3,3,3,3,0,0,3,null,null,null,null,null,3212]
[3212,"A","Metro","Metro","203 VIC Rural - Geelong & Surf Coast","Metro","A Metro",1,null,16652,55.2,null,null,null,"Metro",85,null,2,3,3,3,2,1,3,null,null,null,null,null,3213]
[3213,"A","Metro","Metro","203 VIC Rural - Geelong & Surf Coast","Metro","A Metro",1,null,4033,64.099999999999994,null,null,null,"Metro",71.666666666666671,null,2,3,3,3,0,1,3,null,null,null,null,null,3214]
[3214,"A","Metro","Metro","203 VIC Rural - Geelong & Surf Coast","Metro","A Metro",1,null,23964,61.1,null,null,null,"Metro",85,null,2,3,3,3,2,1,3,null,null,null,null,null,3215]
[3215,"A","Metro","Metro","203 VIC Rural - Geelong & Surf Coast","Metro","A Metro",1,null,20616,64.599999999999994,null,null,null,"Metro",85,null,2,3,3,3,2,1,3,null,null,null,null,null,3216]
[3216,"A","Metro","Metro","203 VIC Rural - Geelong & Surf Coast","Metro","A Metro",1,null,56284,69.5,null,null,null,"Metro",85,null,2,3,3,3,2,1,3,null,null,null,null,null,3217]
[3217,"A","Metro","Regional","203 VIC Rural - Geelong & Surf Coast","Nonmetro","A Metro",2,null,6607,71.3,null,null,null,"Non Metro",65,null,2,2,3,2,1,1,3,null,null,null,null,null,3218]
[3218,"A","Metro","Regional","203 VIC Rural - Geelong & Surf Coast","Nonmetro","A Metro",1,null,13437,65.8,null,null,null,"Non Metro",78.333333333333329,null,2,2,3,3,2,1,3,null,null,null,null,null,3219]
[3219,"A","Metro","Regional","203 VIC Rural - Geelong & Surf Coast","Nonmetro","A Metro",1,null,19715,64.400000000000006,null,null,null,"Non Metro",78.333333333333329,null,2,2,3,3,2,1,3,null,null,null,null,null,3220]
[3220,"A","Metro","Regional","203 VIC Rural - Geelong & Surf Coast","Nonmetro","A Metro",1,null,16353,66.099999999999994,null,null,null,"Non Metro",78.333333333333329,null,2,2,3,3,2,1,3,null,null,null,null,null,3221]
[3221,"A","Regional","Regional","203 VIC Rural - Geelong & Surf Coast","Nonmetro","B Regional",1,null,749,0,null,null,null,"Regional",55.000000000000007,null,2,2,2,3,0,0,3,null,null,null,null,null,3222]
[3222,"A","Metro","Regional","203 VIC Rural - Geelong & Surf Coast","Nonmetro","A Metro",1,null,14960,52.7,null,null,null,"Non Metro",78.333333333333329,null,2,2,3,3,2,1,3,null,null,null,null,null,3223]
[3223,"A","Metro","Regional","203 VIC Rural - Geelong & Surf Coast","Nonmetro","A Metro",1,null,7397,44.8,null,null,null,"Non Metro",75,null,2,2,3,3,1,2,3,null,null,null,null,null,3224]
[3224,"A","Metro","Regional","203 VIC Rural - Geelong & Surf Coast","Nonmetro","A Metro",1,null,14187,60.4,null,null,null,"Non Metro",78.333333333333329,null,2,2,3,3,2,1,3,null,null,null,null,null,3225]
[3225,"A","Metro","Regional","203 VIC Rural - Geelong & Surf Coast","Nonmetro","A Metro",1,null,4058,59.1,null,null,null,"Non Metro",65,null,2,2,3,3,0,1,3,null,null,null,null,null,3226]
[3226,"A","Metro","Regional","203 VIC Rural - Geelong & Surf Coast","Nonmetro","A Metro",1,null,14165,63.2,null,null,null,"Non Metro",78.333333333333329,null,2,2,3,3,2,1,3,null,null,null,null,null,3227]
[3227,"A","Metro","Regional","203 VIC Rural - Geelong & Surf Coast","Nonmetro","A Metro",1,null,4819,66.599999999999994,null,null,null,"Non Metro",65,null,2,2,3,3,0,1,3,null,null,null,null,null,3228]
[3228,"A","Regional","Regional","203 VIC Rural - Geelong & Surf Coast","Nonmetro","B Regional",1,null,17939,79.7,null,null,null,"Non Metro",71.666666666666671,null,2,2,2,3,2,1,3,null,null,null,null,null,3230]
[3230,"A","Regional","Regional","203 VIC Rural - Geelong & Surf Coast","Nonmetro","B Regional",2,null,2545,95.6,null,null,null,"Regional",51.666666666666671,null,2,2,2,2,0,1,3,null,null,null,null,null,3231]
[3231,"A","Other","Regional","203 VIC Rural - Geelong & Surf Coast","Nonmetro","E Pop > 500",3,null,1256,105.1,null,null,"Regional","Regional",31.666666666666664,null,2,2,0,1,0,1,3,null,null,null,null,null,3232]
[3232,"A","Metro","Regional","203 VIC Rural - Geelong & Surf Coast","Nonmetro","A Metro",1,null,1114,118.3,null,null,null,"Non Metro",65,null,2,2,3,3,0,1,3,null,null,null,null,null,3233]
[3233,"A","Metro","Regional","217 VIC Rural - Western District","Nonmetro","A Metro",1,null,2030,154.19999999999999,null,null,null,"Non Metro",61.666666666666671,null,2,2,3,3,0,0,3,null,null,null,null,null,3234]
[3234,"A","Other","Regional","203 VIC Rural - Geelong & Surf Coast","Nonmetro","F Pop <= 500",1,null,181,134.5,null,null,null,"Regional",45,null,2,2,0,3,0,1,3,null,null,null,null,null,3235]
[3235,"A","Other","Regional","203 VIC Rural - Geelong & Surf Coast","Nonmetro","F Pop <= 500",null,null,381,0,null,null,null,"Refer to Distribution Partner",21.666666666666668,null,2,2,0,0,0,0,3,null,null,null,null,null,3236]
[3236,"A","Other","Regional","217 VIC Rural - Western District","Nonmetro","F Pop <= 500",null,null,230,0,null,null,null,"Refer to Distribution Partner",21.666666666666668,null,2,2,0,0,0,0,3,null,null,null,null,null,3237]
[3237,"A","Other","Regional","217 VIC Rural - Western District","Nonmetro","F Pop <= 500",null,null,214,0,null,null,null,"Refer to Distribution Partner",21.666666666666668,null,2,2,0,0,0,0,3,null,null,null,null,null,3238]
[3238,"A","Other","Regional","217 VIC Rural - Western District","Nonmetro","F Pop <= 500",null,null,218,0,null,null,null,"Refer to Distribution Partner",21.666666666666668,null,2,2,0,0,0,0,3,null,null,null,null,null,3239]
[3239,"A","Other","Regional","217 VIC Rural - Western District","Nonmetro","F Pop <= 500",null,null,424,0,null,null,null,"Refer to Distribution Partner",21.666666666666668,null,2,2,0,0,0,0,3,null,null,null,null,null,3240]
[3240,"A","Other","Regional","203 VIC Rural - Geelong & Surf Coast","Nonmetro","D Pop > 2,000",null,null,2021,88.1,null,null,null,"Refer to Distribution Partner",31.666666666666664,null,2,2,1,0,0,1,3,null,null,null,null,null,3241]
[3241,"A","Other","Regional","203 VIC Rural - Geelong & Surf Coast","Nonmetro","D Pop > 2,000",null,null,2566,98.8,null,null,null,"Refer to Distribution Partner",31.666666666666664,null,2,2,1,0,0,1,3,null,null,null,null,null,3242]
[3242,"A","Other","Regional","217 VIC Rural - Western District","Nonmetro","E Pop > 500",null,null,828,118.2,null,null,null,"Refer to Distribution Partner",25,null,2,2,0,0,0,1,3,null,null,null,null,null,3243]
[3243,"A","Other","Regional","217 VIC Rural - Western District","Nonmetro","E Pop > 500",null,null,358,0,null,null,null,"Refer to Distribution Partner",21.666666666666668,null,2,2,0,0,0,0,3,null,null,null,null,null,3249]
[3249,"A","Other","Regional","217 VIC Rural - Western District","Nonmetro","D Pop > 2,000",3,null,3199,139,null,null,"Regional","Regional",38.333333333333329,null,2,2,1,1,0,1,3,null,null,null,null,null,3250]
[3250,"A","Other","Regional","217 VIC Rural - Western District","Nonmetro","C Pop > 7,000",3,null,12250,134.4,null,null,null,"Regional",51.666666666666671,null,2,2,1,1,2,1,3,null,null,null,null,null,3251]
[3251,"A","Other","Regional","217 VIC Rural - Western District","Nonmetro","E Pop > 500",null,null,522,0,null,null,null,"Refer to Distribution Partner",21.666666666666668,null,2,2,0,0,0,0,3,null,null,null,null,null,3254]
[3254,"A","Other","Regional","217 VIC Rural - Western District","Nonmetro","F Pop <= 500",null,null,310,0,null,null,null,"Refer to Distribution Partner",21.666666666666668,null,2,2,0,0,0,0,3,null,null,null,null,null,3260]
[3260,"A","Other","Regional","217 VIC Rural - Western District","Nonmetro","D Pop > 2,000",null,null,4766,165.7,null,null,null,"Refer to Distribution Partner",28.333333333333332,null,2,2,1,0,0,0,3,null,null,null,null,null,3264]
[3264,"A","Other","Regional","217 VIC Rural - Western District","Nonmetro","D Pop > 2,000",null,null,2288,185.5,null,null,null,"Refer to Distribution Partner",28.333333333333332,null,2,2,1,0,0,0,3,null,null,null,null,null,3265]
[3265,"A","Other","Regional","217 VIC Rural - Western District","Nonmetro","D Pop > 2,000",null,null,2621,196.2,null,null,null,"Refer to Distribution Partner",28.333333333333332,null,2,2,1,0,0,0,3,null,null,null,null,null,3266]
[3266,"A","Other","Regional","217 VIC Rural - Western District","Nonmetro","D Pop > 2,000",null,null,3067,174.1,null,null,null,"Refer to Distribution Partner",28.333333333333332,null,2,2,1,0,0,0,3,null,null,null,null,null,3267]
[3267,"A","Other","Regional","217 VIC Rural - Western District","Nonmetro","F Pop <= 500",null,null,248,0,null,null,null,"Refer to Distribution Partner",21.666666666666668,null,2,2,0,0,0,0,3,null,null,null,null,null,3268]
[3268,"A","Other","Regional","217 VIC Rural - Western District","Nonmetro","D Pop > 2,000",null,null,2607,191.5,null,null,null,"Refer to Distribution Partner",28.333333333333332,null,2,2,1,0,0,0,3,null,null,null,null,null,3269]
[3269,"A","Other","Regional","217 VIC Rural - Western District","Nonmetro","E Pop > 500",null,null,730,191.3,null,null,null,{"$f":"IF(ISBLANK(N898),IF(AND(H898<>\"\",IF(I898=\"High Density\",\"High Density\",IF(AND(P898<=45,P898>0),\"Refer to Distribution Partner\",IF(AND(P898<=55,P898>45),\"Regional\",IF(AND(P898>55,P898<=70),\"Non Metro\",IF(F898=\"Nonmetro\",\"Non Metro\",IF(P898>70,\"Metro\",\"\"))))))=\"Refer to Distribution Partner\"),\"Regional\",IF(I898=\"High Density\",\"High Density\",IF(AND(P898<=45,P898>0),\"Refer to Distribution Partner\",IF(AND(P898<=55,P898>45),\"Regional\",IF(AND(P898>55,P898<=70),\"Non Metro\",IF(F898=\"Nonmetro\",\"Non Metro\",IF(P898>70,\"Metro\",\"\"))))))),N898)","v":"Refer to Distribution Partner"},{"$f":"(R898/$AB$3*$AA$3+S898/$AB$4*$AA$4+T898/$AB$5*$AA$5+U898/$AB$6*$AA$6+V898/$AB$7*$AA$7+W898/$AB$8*$AA$8+X898/$AB$9*$AA$9)*100","v":21.666666666666668},null,{"$f":"IF(ISNUMBER(SEARCH(\"Metro\",E898)),3,IF(ISNUMBER(SEARCH(\"Rural\",E898)),2,1))","v":2},{"$f":"IF(ISNUMBER(FIND(\"Metro\",F898)),3,IF(ISNUMBER(FIND(\"Nonmetro\",F898)),2,3))","v":2},{"$f":"IF(G898=\"A Metro\",3,IF(G898=\"B Regional\",2,IF(G898=\"C Pop > 7,000\",1,IF(G898=\"D Pop > 2,000\",1,0))))","v":0},{"$f":"IF(H898=1,3,IF(H898=2,2,IF(H898=3,1,0)))","v":0},{"$f":"IF(J898>=100000,3,IF(AND(J898>=10000,J898<100000),2,IF(AND(J898>=5000,J898<10000),1,0)))","v":0},{"$f":"IF(AND(K898>=0.1,K898<25),3,IF(AND(K898>=25,K898<50),2,IF(AND(K898>=50,K898<150),1,0)))","v":0},{"$f":"IF(L898=\"\",3,0)","v":3},null,null,null,null,null,3270]
[3270,"A","Other","Regional","217 VIC Rural - Western District","Nonmetro","F Pop <= 500",null,null,247,0,null,null,null,"Refer to Distribution Partner",21.666666666666668,null,2,2,0,0,0,0,3,null,null,null,null,null,3271]
[3271,"A","Other","Regional","217 VIC Rural - Western District","Nonmetro","F Pop <= 500",null,null,196,0,null,null,null,"Refer to Distribution Partner",21.666666666666668,null,2,2,0,0,0,0,3,null,null,null,null,null,3272]
[3272,"A","Other","Regional","217 VIC Rural - Western District","Nonmetro","E Pop > 500",null,null,1539,191.5,null,null,null,"Refer to Distribution Partner",21.666666666666668,null,2,2,0,0,0,0,3,null,null,null,null,null,3273]
[3273,"A","Other","Regional","217 VIC Rural - Western District","Nonmetro","F Pop <= 500",null,null,143,0,null,null,null,"Refer to Distribution Partner",21.666666666666668,null,2,2,0,0,0,0,3,null,null,null,null,null,3274]
[3274,"A","Other","Regional","217 VIC Rural - Western District","Nonmetro","F Pop <= 500",null,null,246,0,null,null,null,"Refer to Distribution Partner",21.666666666666668,null,2,2,0,0,0,0,3,null,null,null,null,null,3275]
[3275,"A","Other","Regional","217 VIC Rural - Western District","Nonmetro","F Pop <= 500",null,null,425,0,null,null,null,"Refer to Distribution Partner",21.666666666666668,null,2,2,0,0,0,0,3,null,null,null,null,null,3276]
[3276,"A","Other","Regional","217 VIC Rural - Western District","Nonmetro","E Pop > 500",null,null,482,0,null,null,null,"Refer to Distribution Partner",21.666666666666668,null,2,2,0,0,0,0,3,null,null,null,null,null,3277]
[3277,"A","Other","Regional","217 VIC Rural - Western District","Nonmetro","E Pop > 500",null,null,1926,213.2,null,null,null,"Refer to Distribution Partner",21.666666666666668,null,2,2,0,0,0,0,3,null,null,null,null,null,3278]
[3278,"A","Other","Regional","217 VIC Rural - Western District","Nonmetro","F Pop <= 500",null,null,313,0,null,null,null,"Refer to Distribution Partner",21.666666666666668,null,2,2,0,0,0,0,3,null,null,null,null,null,3279]
[3279,"A","Other","Regional","217 VIC Rural - Western District","Nonmetro","F Pop <= 500",null,null,290,0,null,null,null,"Refer to Distribution Partner",21.666666666666668,null,2,2,0,0,0,0,3,null,null,null,null,null,3280]
[3280,"A","Regional","Regional","217 VIC Rural - Western District","Nonmetro","B Regional",2,null,31569,225.6,null,null,null,"Non Metro",61.666666666666671,null,2,2,2,2,2,0,3,null,null,null,null,null,3281]
[3281,"A","Other","Regional","217 VIC Rural - Western District","Nonmetro","E Pop > 500",null,null,1699,224,null,null,null,"Refer to Distribution Partner",21.666666666666668,null,2,2,0,0,0,0,3,null,null,null,null,null,3282]
[3282,"A","Other","Regional","217 VIC Rural - Western District","Nonmetro","D Pop > 2,000",null,null,2362,223.7,null,null,null,"Refer to Distribution Partner",28.333333333333332,null,2,2,1,0,0,0,3,null,null,null,null,null,3283]
[3283,"A","Other","Regional","217 VIC Rural - Western District","Nonmetro","D Pop > 2,000",null,null,1361,236.2,null,null,null,"Refer to Distribution Partner",28.333333333333332,null,2,2,1,0,0,0,3,null,null,null,null,null,3284]
[3284,"A","Regional","Regional","217 VIC Rural - Western District","Nonmetro","B Regional",null,null,3439,247.4,null,null,null,"Refer to Distribution Partner",35,null,2,2,2,0,0,0,3,null,null,null,null,null,3285]
[3285,"A","Other","Regional","217 VIC Rural - Western District","Nonmetro","D Pop > 2,000",null,null,1207,278.60000000000002,null,null,null,"Refer to Distribution Partner",28.333333333333332,null,2,2,1,0,0,0,3,null,null,null,null,null,3286]
[3286,"A","Other","Regional","217 VIC Rural - Western District","Nonmetro","E Pop > 500",null,null,566,0,null,null,null,"Refer to Distribution Partner",21.666666666666668,null,2,2,0,0,0,0,3,null,null,null,null,null,3287]
[3287,"A","Other","Regional","217 VIC Rural - Western District","Nonmetro","F Pop <= 500",null,null,433,0,null,null,null,"Refer to Distribution Partner",21.666666666666668,null,2,2,0,0,0,0,3,null,null,null,null,null,3289]
[3289,"A","Other","Regional","217 VIC Rural - Western District","Nonmetro","E Pop > 500",null,null,756,234.6,null,null,null,"Refer to Distribution Partner",21.666666666666668,null,2,2,0,0,0,0,3,null,null,null,null,null,3292]
[3292,"A","Other","Regional","217 VIC Rural - Western District","Nonmetro","F Pop <= 500",null,null,190,347.9,null,null,null,"Refer to Distribution Partner",21.666666666666668,null,2,2,0,0,0,0,3,null,null,null,null,null,3293]
[3293,"A","Other","Regional","217 VIC Rural - Western District","Nonmetro","F Pop <= 500",null,null,301,0,null,null,null,"Refer to Distribution Partner",21.666666666666668,null,2,2,0,0,0,0,3,null,null,null,null,null,3294]
[3294,"A","Other","Regional","217 VIC Rural - Western District","Nonmetro","E Pop > 500",null,null,959,231,null,null,null,"Refer to Distribution Partner",21.666666666666668,null,2,2,0,0,0,0,3,null,null,null,null,null,3300]
[3300,"A","Other","Regional","217 VIC Rural - Western District","Nonmetro","C Pop > 7,000",3,null,10088,258.60000000000002,null,null,null,"Regional",48.333333333333336,null,2,2,1,1,2,0,3,null,null,null,null,null,3301]
[3301,"A","Other","Regional","217 VIC Rural - Western District","Nonmetro","E Pop > 500",null,null,1211,0,null,null,null,"Refer to Distribution Partner",21.666666666666668,null,2,2,0,0,0,0,3,null,null,null,null,null,3302]
[3302,"A","Other","Regional","217 VIC Rural - Western District","Nonmetro","E Pop > 500",null,null,371,0,null,null,null,"Refer to Distribution Partner",21.666666666666668,null,2,2,0,0,0,0,3,null,null,null,null,null,3303]
[3303,"A","Other","Regional","217 VIC Rural - Western District","Nonmetro","F Pop <= 500",null,null,336,0,null,null,null,"Refer to Distribution Partner",21.666666666666668,null,2,2,0,0,0,0,3,null,null,null,null,null,3304]
[3304,"A","Other","Regional","217 VIC Rural - Western District","Nonmetro","D Pop > 2,000",null,null,2725,299.5,null,null,null,"Refer to Distribution Partner",28.333333333333332,null,2,2,1,0,0,0,3,null,null,null,null,null,3305]
[3305,"A","Regional","Regional","217 VIC Rural - Western District","Nonmetro","B Regional",3,null,12816,300.3,null,null,null,"Regional",55.000000000000007,null,2,2,2,1,2,0,3,null,null,null,null,null,3309]
[3309,"A","Other","Regional","217 VIC Rural - Western District","Nonmetro","F Pop <= 500",null,null,124,0,null,null,null,"Refer to Distribution Partner",21.666666666666668,null,2,2,0,0,0,0,3,null,null,null,null,null,3310]
[3310,"A","Other","Regional","217 VIC Rural - Western District","Nonmetro","F Pop <= 500",null,null,276,0,null,null,null,"Refer to Distribution Partner",21.666666666666668,null,2,2,0,0,0,0,3,null,null,null,null,null,3311]
[3311,"A","Other","Regional","217 VIC Rural - Western District","Nonmetro","E Pop > 500",null,null,1696,314.60000000000002,null,null,null,"Refer to Distribution Partner",21.666666666666668,null,2,2,0,0,0,0,3,null,null,null,null,null,3312]
[3312,"A","Other","Regional","217 VIC Rural - Western District","Nonmetro","E Pop > 500",null,null,1031,0,null,null,null,"Refer to Distribution Partner",21.666666666666668,null,2,2,0,0,0,0,3,null,null,null,null,null,3314]
[3314,"A","Regional","Regional","217 VIC Rural - Western District","Nonmetro","B Regional",null,null,525,0,null,null,null,"Refer to Distribution Partner",35,null,2,2,2,0,0,0,3,null,null,null,null,null,3315]
[3315,"A","Other","Regional","217 VIC Rural - Western District","Nonmetro","E Pop > 500",null,null,1624,289.2,null,null,null,"Refer to Distribution Partner",21.666666666666668,null,2,2,0,0,0,0,3,null,null,null,null,null,3317]
[3317,"A","Other","Regional","215 VIC Rural - Wimmera Mallee","Nonmetro","F Pop <= 500",null,null,200,0,null,null,null,"Refer to Distribution Partner",21.666666666666668,null,2,2,0,0,0,0,3,null,null,null,null,null,3318]
[3318,"A","Other","Regional","215 VIC Rural - Wimmera Mallee","Nonmetro","E Pop > 500",null,null,1267,335.6,null,null,null,"Refer to Distribution Partner",21.666666666666668,null,2,2,0,0,0,0,3,null,null,null,null,null,3319]
[3319,"A","Other","Regional","215 VIC Rural - Wimmera Mallee","Nonmetro","F Pop <= 500",null,null,344,355.5,null,null,null,"Refer to Distribution Partner",21.666666666666668,null,2,2,0,0,0,0,3,null,null,null,null,null,3321]
[3321,"A","Other","Regional","203 VIC Rural - Geelong & Surf Coast","Nonmetro","E Pop > 500",null,null,1518,85.7,null,null,null,"Refer to Distribution Partner",25,null,2,2,0,0,0,1,3,null,null,null,null,null,3322]
[3322,"A","Other","Regional","217 VIC Rural - Western District","Nonmetro","F Pop <= 500",null,null,175,0,null,null,null,"Refer to Distribution Partner",21.666666666666668,null,2,2,0,0,0,0,3,null,null,null,null,null,3323]
[3323,"A","Other","Regional","217 VIC Rural - Western District","Nonmetro","F Pop <= 500",null,null,92,0,null,null,null,"Refer to Distribution Partner",21.666666666666668,null,2,2,0,0,0,0,3,null,null,null,null,null,3324]
[3324,"A","Other","Regional","217 VIC Rural - Western District","Nonmetro","E Pop > 500",null,null,529,143.19999999999999,null,null,null,"Refer to Distribution Partner",25,null,2,2,0,0,0,1,3,null,null,null,null,null,3325]
[3325,"A","Other","Regional","217 VIC Rural - Western District","Nonmetro","E Pop > 500",null,null,479,153.9,null,null,null,"Refer to Distribution Partner",21.666666666666668,null,2,2,0,0,0,0,3,null,null,null,null,null,3328]
[3328,"A","Other","Regional","203 VIC Rural - Geelong & Surf Coast","Nonmetro","E Pop > 500",null,null,1721,84.3,null,null,null,"Refer to Distribution Partner",25,null,2,2,0,0,0,1,3,null,null,null,null,null,3329]
[3329,"A","Other","Regional","203 VIC Rural - Geelong & Surf Coast","Nonmetro","F Pop <= 500",null,null,285,0,null,null,null,"Refer to Distribution Partner",21.666666666666668,null,2,2,0,0,0,0,3,null,null,null,null,null,3330]
[3330,"A","Other","Regional","203 VIC Rural - Geelong & Surf Coast","Nonmetro","F Pop <= 500",null,null,217,0,null,null,null,"Refer to Distribution Partner",21.666666666666668,null,2,2,0,0,0,0,3,null,null,null,null,null,3331]
[3331,"A","Regional","Regional","203 VIC Rural - Geelong & Surf Coast","Nonmetro","B Regional",3,null,5997,74.099999999999994,null,null,null,"Regional",51.666666666666657,null,2,2,2,1,1,1,3,null,null,null,null,null,3332]
[3332,"A","Other","Regional","203 VIC Rural - Geelong & Surf Coast","Nonmetro","E Pop > 500",null,null,1014,0,null,null,null,"Refer to Distribution Partner",21.666666666666668,null,2,2,0,0,0,0,3,null,null,null,null,null,3333]
[3333,"A","Other","Regional","203 VIC Rural - Geelong & Surf Coast","Nonmetro","E Pop > 500",null,null,825,0,null,null,null,"Refer to Distribution Partner",21.666666666666668,null,2,2,0,0,0,0,3,null,null,null,null,null,3334]
[3334,"A","Other","Regional","201 VIC Rural - Ballarat","Nonmetro","F Pop <= 500",null,null,565,0,null,null,null,"Refer to Distribution Partner",21.666666666666668,null,2,2,0,0,0,0,3,null,null,null,null,null,3335]
[3335,"A","Metro","Metro","213 VIC Metro - Melton / Werrribee","Metro","A Metro",1,null,5856,27.3,null,null,null,"Metro",83.333333333333343,null,3,3,3,3,1,2,3,null,null,null,null,null,3337]
[3337,"A","Metro","Metro","213 VIC Metro - Melton / Werrribee","Metro","A Metro",1,null,36454,38.200000000000003,null,null,null,"Metro",90,null,3,3,3,3,2,2,3,null,null,null,null,null,3338]
[3338,"A","Metro","Metro","213 VIC Metro - Melton / Werrribee","Metro","A Metro",1,null,23412,36.700000000000003,null,null,null,"Metro",90,null,3,3,3,3,2,2,3,null,null,null,null,null,3340]
[3340,"A","Regional","Metro","213 VIC Metro - Melton / Werrribee","Metro","B Regional",1,null,21121,49.6,null,null,null,"Metro",83.333333333333329,null,3,3,2,3,2,2,3,null,null,null,null,null,3341]
[3341,"A","Other","Metro","201 VIC Rural - Ballarat","Metro","E Pop > 500",1,null,1663,63.3,null,null,null,"Regional",51.666666666666671,null,2,3,0,3,0,1,3,null,null,null,null,null,3342]
[3342,"A","Other","Regional","201 VIC Rural - Ballarat","Nonmetro","D Pop > 2,000",null,null,3441,69.400000000000006,null,null,null,"Refer to Distribution Partner",31.666666666666664,null,2,2,1,0,0,1,3,null,null,null,null,null,3345]
[3345,"A","Other","Regional","201 VIC Rural - Ballarat","Nonmetro","E Pop > 500",null,null,1151,79.8,null,null,null,"Refer to Distribution Partner",25,null,2,2,0,0,0,1,3,null,null,null,null,null,3350]
[3350,"A","Regional","Regional","201 VIC Rural - Ballarat","Nonmetro","B Regional",2,null,59145,102,null,null,null,"Non Metro",65,null,2,2,2,2,2,1,3,null,null,null,null,null,3351]
[3351,"A","Regional","Regional","201 VIC Rural - Ballarat","Nonmetro","B Regional",null,null,8168,123.8,null,null,"Regional","Regional",44.999999999999993,null,2,2,2,0,1,1,3,null,null,null,null,null,3352]
[3352,"A","Regional","Regional","201 VIC Rural - Ballarat","Nonmetro","B Regional",3,null,15996,105.9,null,null,null,"Non Metro",58.333333333333336,null,2,2,2,1,2,1,3,null,null,null,null,null,3355]
[3355,"A","Regional","Regional","201 VIC Rural - Ballarat","Nonmetro","B Regional",2,null,13014,104.7,null,null,null,"Non Metro",65,null,2,2,2,2,2,1,3,null,null,null,null,null,3356]
[3356,"A","Regional","Regional","201 VIC Rural - Ballarat","Nonmetro","B Regional",2,null,16321,103.3,null,null,null,"Non Metro",65,null,2,2,2,2,2,1,3,null,null,null,null,null,3357]
[3357,"A","Other","Regional","201 VIC Rural - Ballarat","Nonmetro","D Pop > 2,000",3,null,3714,96.7,null,null,"Regional","Regional",38.333333333333329,null,2,2,1,1,0,1,3,null,null,null,null,null,3360]
[3360,"A","Other","Regional","201 VIC Rural - Ballarat","Nonmetro","E Pop > 500",null,null,765,124.1,null,null,null,"Refer to Distribution Partner",25,null,2,2,0,0,0,1,3,null,null,null,null,null,3361]
[3361,"A","Other","Regional","217 VIC Rural - Western District","Nonmetro","E Pop > 500",null,null,680,0,null,null,null,{"$f":"IF(ISBLANK(N962),IF(AND(H962<>\"\",IF(I962=\"High Density\",\"High Density\",IF(AND(P962<=45,P962>0),\"Refer to Distribution Partner\",IF(AND(P962<=55,P962>45),\"Regional\",IF(AND(P962>55,P962<=70),\"Non Metro\",IF(F962=\"Nonmetro\",\"Non Metro\",IF(P962>70,\"Metro\",\"\"))))))=\"Refer to Distribution Partner\"),\"Regional\",IF(I962=\"High Density\",\"High Density\",IF(AND(P962<=45,P962>0),\"Refer to Distribution Partner\",IF(AND(P962<=55,P962>45),\"Regional\",IF(AND(P962>55,P962<=70),\"Non Metro\",IF(F962=\"Nonmetro\",\"Non Metro\",IF(P962>70,\"Metro\",\"\"))))))),N962)","v":"Refer to Distribution Partner"},{"$f":"(R962/$AB$3*$AA$3+S962/$AB$4*$AA$4+T962/$AB$5*$AA$5+U962/$AB$6*$AA$6+V962/$AB$7*$AA$7+W962/$AB$8*$AA$8+X962/$AB$9*$AA$9)*100","v":21.666666666666668},null,{"$f":"IF(ISNUMBER(SEARCH(\"Metro\",E962)),3,IF(ISNUMBER(SEARCH(\"Rural\",E962)),2,1))","v":2},{"$f":"IF(ISNUMBER(FIND(\"Metro\",F962)),3,IF(ISNUMBER(FIND(\"Nonmetro\",F962)),2,3))","v":2},{"$f":"IF(G962=\"A Metro\",3,IF(G962=\"B Regional\",2,IF(G962=\"C Pop > 7,000\",1,IF(G962=\"D Pop > 2,000\",1,0))))","v":0},{"$f":"IF(H962=1,3,IF(H962=2,2,IF(H962=3,1,0)))","v":0},{"$f":"IF(J962>=100000,3,IF(AND(J962>=10000,J962<100000),2,IF(AND(J962>=5000,J962<10000),1,0)))","v":0},{"$f":"IF(AND(K962>=0.1,K962<25),3,IF(AND(K962>=25,K962<50),2,IF(AND(K962>=50,K962<150),1,0)))","v":0},{"$f":"IF(L962=\"\",3,0)","v":3},null,null,null,null,null,3363]
[3363,"A","Other","Regional","201 VIC Rural - Ballarat","Nonmetro","D Pop > 2,000",3,null,3479,104.3,null,null,"Regional","Regional",38.333333333333329,null,2,2,1,1,0,1,3,null,null,null,null,null,3364]
[3364,"A","Other","Regional","201 VIC Rural - Ballarat","Nonmetro","D Pop > 2,000",3,null,2149,100.5,null,null,"Regional","Regional",38.333333333333329,null,2,2,1,1,0,1,3,null,null,null,null,null,3370]
[3370,"A","Other","Regional","201 VIC Rural - Ballarat","Nonmetro","E Pop > 500",null,null,1783,118.7,null,null,null,"Refer to Distribution Partner",25,null,2,2,0,0,0,1,3,null,null,null,null,null,3371]
[3371,"A","Other","Regional","201 VIC Rural - Ballarat","Nonmetro","E Pop > 500",null,null,992,131.30000000000001,null,null,null,"Refer to Distribution Partner",25,null,2,2,0,0,0,1,3,null,null,null,null,null,3373]
[3373,"A","Other","Regional","201 VIC Rural - Ballarat","Nonmetro","E Pop > 500",null,null,2292,145.4,null,null,null,"Refer to Distribution Partner",25,null,2,2,0,0,0,1,3,null,null,null,null,null,3374]
[3374,"A","Other","Regional","215 VIC Rural - Wimmera Mallee","Nonmetro","E Pop > 500",null,null,400,0,null,null,null,"Refer to Distribution Partner",21.666666666666668,null,2,2,0,0,0,0,3,null,null,null,null,null,3375]
[3375,"A","Other","Regional","215 VIC Rural - Wimmera Mallee","Nonmetro","F Pop <= 500",null,null,208,0,null,null,null,"Refer to Distribution Partner",21.666666666666668,null,2,2,0,0,0,0,3,null,null,null,null,null,3377]
[3377,"A","Other","Regional","215 VIC Rural - Wimmera Mallee","Nonmetro","C Pop > 7,000",3,null,9416,189,null,null,null,"Regional",41.666666666666664,null,2,2,1,1,1,0,3,null,null,null,null,null,3378]
[3378,"A","Other","Regional","215 VIC Rural - Wimmera Mallee","Nonmetro","F Pop <= 500",null,null,146,0,null,null,null,"Refer to Distribution Partner",21.666666666666668,null,2,2,0,0,0,0,3,null,null,null,null,null,3379]
[3379,"A","Other","Regional","215 VIC Rural - Wimmera Mallee","Nonmetro","E Pop > 500",null,null,803,0,null,null,null,"Refer to Distribution Partner",21.666666666666668,null,2,2,0,0,0,0,3,null,null,null,null,null,3380]
[3380,"A","Other","Regional","215 VIC Rural - Wimmera Mallee","Nonmetro","D Pop > 2,000",null,null,6032,210.5,"Mining",null,"Not Acceptable","Not Acceptable",30,null,2,2,1,0,1,0,0,null,null,null,null,null,3381]
[3381,"A","Other","Regional","215 VIC Rural - Wimmera Mallee","Nonmetro","E Pop > 500",null,null,1212,224.3,null,null,null,"Refer to Distribution Partner",21.666666666666668,null,2,2,0,0,0,0,3,null,null,null,null,null,3384]
[3384,"A","Other","Regional","215 VIC Rural - Wimmera Mallee","Nonmetro","E Pop > 500",null,null,547,0,null,null,null,"Refer to Distribution Partner",21.666666666666668,null,2,2,0,0,0,0,3,null,null,null,null,null,3385]
[3385,"A","Other","Regional","215 VIC Rural - Wimmera Mallee","Nonmetro","E Pop > 500",null,null,517,0,null,null,null,"Refer to Distribution Partner",21.666666666666668,null,2,2,0,0,0,0,3,null,null,null,null,null,3387]
[3387,"A","Other","Regional","215 VIC Rural - Wimmera Mallee","Nonmetro","F Pop <= 500",null,null,312,0,null,null,null,"Refer to Distribution Partner",21.666666666666668,null,2,2,0,0,0,0,3,null,null,null,null,null,3388]
[3388,"A","Other","Regional","215 VIC Rural - Wimmera Mallee","Nonmetro","E Pop > 500",null,null,561,244.3,null,null,null,"Refer to Distribution Partner",21.666666666666668,null,2,2,0,0,0,0,3,null,null,null,null,null,3390]
[3390,"A","Other","Regional","215 VIC Rural - Wimmera Mallee","Nonmetro","E Pop > 500",null,null,910,258,null,null,null,"Refer to Distribution Partner",21.666666666666668,null,2,2,0,0,0,0,3,null,null,null,null,null,3391]
[3391,"A","Other","Regional","215 VIC Rural - Wimmera Mallee","Nonmetro","F Pop <= 500",null,null,171,0,null,null,null,"Refer to Distribution Partner",21.666666666666668,null,2,2,0,0,0,0,3,null,null,null,null,null,3392]
[3392,"A","Other","Regional","215 VIC Rural - Wimmera Mallee","Nonmetro","E Pop > 500",null,null,580,258.8,null,null,null,"Refer to Distribution Partner",21.666666666666668,null,2,2,0,0,0,0,3,null,null,null,null,null,3393]
[3393,"A","Other","Regional","215 VIC Rural - Wimmera Mallee","Nonmetro","D Pop > 2,000",null,null,2685,286.7,null,null,null,"Refer to Distribution Partner",28.333333333333332,null,2,2,1,0,0,0,3,null,null,null,null,null,3395]
[3395,"A","Other","Regional","215 VIC Rural - Wimmera Mallee","Nonmetro","E Pop > 500",null,null,364,0,null,null,null,"Refer to Distribution Partner",21.666666666666668,null,2,2,0,0,0,0,3,null,null,null,null,null,3396]
[3396,"A","Other","Regional","215 VIC Rural - Wimmera Mallee","Nonmetro","E Pop > 500",null,null,739,327.7,null,null,null,"Refer to Distribution Partner",21.666666666666668,null,2,2,0,0,0,0,3,null,null,null,null,null,3400]
[3400,"A","Regional","Regional","215 VIC Rural - Wimmera Mallee","Nonmetro","B Regional",3,null,14543,273.60000000000002,null,null,null,"Regional",55.000000000000007,null,2,2,2,1,2,0,3,null,null,null,null,null,3401]
[3401,"A","Other","Regional","215 VIC Rural - Wimmera Mallee","Nonmetro","D Pop > 2,000",null,null,4421,271.60000000000002,null,null,null,"Refer to Distribution Partner",28.333333333333332,null,2,2,1,0,0,0,3,null,null,null,null,null,3407]
[3407,"A","Other","Regional","217 VIC Rural - Western District","Nonmetro","F Pop <= 500",null,null,420,0,null,null,null,"Refer to Distribution Partner",21.666666666666668,null,2,2,0,0,0,0,3,null,null,null,null,null,3409]
[3409,"A","Other","Regional","215 VIC Rural - Wimmera Mallee","Nonmetro","E Pop > 500",null,null,932,292.10000000000002,null,null,null,"Refer to Distribution Partner",21.666666666666668,null,2,2,0,0,0,0,3,null,null,null,null,null,3412]
[3412,"A","Other","Regional","215 VIC Rural - Wimmera Mallee","Nonmetro","F Pop <= 500",null,null,299,0,null,null,null,"Refer to Distribution Partner",21.666666666666668,null,2,2,0,0,0,0,3,null,null,null,null,null,3413]
[3413,"A","Other","Regional","215 VIC Rural - Wimmera Mallee","Nonmetro","F Pop <= 500",null,null,215,0,null,null,null,"Refer to Distribution Partner",21.666666666666668,null,2,2,0,0,0,0,3,null,null,null,null,null,3414]
[3414,"A","Other","Regional","215 VIC Rural - Wimmera Mallee","Nonmetro","E Pop > 500",null,null,1826,301.2,null,null,null,"Refer to Distribution Partner",21.666666666666668,null,2,2,0,0,0,0,3,null,null,null,null,null,3415]
[3415,"A","Other","Regional","215 VIC Rural - Wimmera Mallee","Nonmetro","F Pop <= 500",null,null,40,0,null,null,null,"Refer to Distribution Partner",21.666666666666668,null,2,2,0,0,0,0,3,null,null,null,null,null,3418]
[3418,"A","Other","Regional","215 VIC Rural - Wimmera Mallee","Nonmetro","D Pop > 2,000",null,null,2772,336.3,null,null,null,"Refer to Distribution Partner",28.333333333333332,null,2,2,1,0,0,0,3,null,null,null,null,null,3419]
[3419,"A","Other","Regional","215 VIC Rural - Wimmera Mallee","Nonmetro","E Pop > 500",null,null,803,366.7,null,null,null,"Refer to Distribution Partner",21.666666666666668,null,2,2,0,0,0,0,3,null,null,null,null,null,3420]
[3420,"A","Other","Regional","215 VIC Rural - Wimmera Mallee","Nonmetro","F Pop <= 500",null,null,279,0,null,null,null,"Refer to Distribution Partner",21.666666666666668,null,2,2,0,0,0,0,3,null,null,null,null,null,3423]
[3423,"A","Other","Regional","215 VIC Rural - Wimmera Mallee","Nonmetro","E Pop > 500",null,null,477,0,null,null,null,"Refer to Distribution Partner",21.666666666666668,null,2,2,0,0,0,0,3,null,null,null,null,null,3424]
[3424,"A","Other","Regional","215 VIC Rural - Wimmera Mallee","Nonmetro","E Pop > 500",null,null,769,339.2,null,null,null,"Refer to Distribution Partner",21.666666666666668,null,2,2,0,0,0,0,3,null,null,null,null,null,3427]
[3427,"A","Other","Metro","210 VIC Metro - Sunbury","Metro","D Pop > 2,000",3,null,2763,30.8,null,null,null,"Regional",49.999999999999993,null,3,3,1,1,0,2,3,null,null,null,null,null,3428]
[3428,"A","Other","Metro","210 VIC Metro - Sunbury","Metro","E Pop > 500",null,null,675,0,null,null,null,"Refer to Distribution Partner",30,null,3,3,0,0,0,0,3,null,null,null,null,null,3429]
[3429,"A","Metro","Metro","210 VIC Metro - Sunbury","Metro","A Metro",1,null,36297,34.299999999999997,null,null,null,"Metro",90,null,3,3,3,3,2,2,3,null,null,null,null,null,3430]
[3430,"A","Other","Metro","210 VIC Metro - Sunbury","Metro","F Pop <= 500",null,null,320,0,null,null,null,"Refer to Distribution Partner",30,null,3,3,0,0,0,0,3,null,null,null,null,null,3431]
[3431,"A","Regional","Metro","210 VIC Metro - Sunbury","Metro","B Regional",3,null,3947,46.9,null,null,null,"Non Metro",56.666666666666664,null,3,3,2,1,0,2,3,null,null,null,null,null,3432]
[3432,"A","Other","Metro","210 VIC Metro - Sunbury","Metro","F Pop <= 500",null,null,197,0,null,null,null,"Refer to Distribution Partner",30,null,3,3,0,0,0,0,3,null,null,null,null,null,3433]
[3433,"A","Other","Metro","210 VIC Metro - Sunbury","Metro","F Pop <= 500",null,null,218,0,null,null,null,"Refer to Distribution Partner",30,null,3,3,0,0,0,0,3,null,null,null,null,null,3434]
[3434,"A","Other","Metro","210 VIC Metro - Sunbury","Metro","D Pop > 2,000",3,null,5069,55,null,null,null,"Regional",53.333333333333336,null,3,3,1,1,1,1,3,null,null,null,null,null,3435]
[3435,"A","Other","Metro","210 VIC Metro - Sunbury","Metro","D Pop > 2,000",null,null,2879,63.2,null,null,"Regional","Regional",40,null,3,3,1,0,0,1,3,null,null,null,null,null,3437]
[3437,"A","Regional","Metro","210 VIC Metro - Sunbury","Metro","B Regional",2,null,10439,48.6,null,null,null,"Metro",76.666666666666657,null,3,3,2,2,2,2,3,null,null,null,null,null,3438]
[3438,"A","Regional","Metro","210 VIC Metro - Sunbury","Metro","B Regional",2,null,2387,50.1,null,null,null,"Non Metro",60,null,3,3,2,2,0,1,3,null,null,null,null,null,3440]
[3440,"A","Other","Metro","210 VIC Metro - Sunbury","Metro","E Pop > 500",3,null,2040,55.5,null,null,"Regional","Regional",40,null,3,3,0,1,0,1,3,null,null,null,null,null,3441]
[3441,"A","Other","Metro","210 VIC Metro - Sunbury","Metro","E Pop > 500",null,null,1335,56.3,null,null,null,"Refer to Distribution Partner",33.333333333333329,null,3,3,0,0,0,1,3,null,null,null,null,null,3442]
[3442,"A","Other","Metro","202 VIC Rural - Bendigo","Metro","C Pop > 7,000",3,null,7463,63.8,null,null,null,"Regional",51.666666666666657,null,2,3,1,1,1,1,3,null,null,null,null,null,3444]
[3444,"A","Regional","Regional","202 VIC Rural - Bendigo","Nonmetro","B Regional",3,null,9198,78.5,null,null,null,"Regional",51.666666666666657,null,2,2,2,1,1,1,3,null,null,null,null,null,3446]
[3446,"A","Other","Regional","202 VIC Rural - Bendigo","Nonmetro","E Pop > 500",null,null,1025,86.3,null,null,null,"Refer to Distribution Partner",25,null,2,2,0,0,0,1,3,null,null,null,null,null,3447]
[3447,"A","Other","Regional","202 VIC Rural - Bendigo","Nonmetro","F Pop <= 500",null,null,448,0,null,null,null,"Refer to Distribution Partner",21.666666666666668,null,2,2,0,0,0,0,3,null,null,null,null,null,3448]
[3448,"A","Other","Regional","202 VIC Rural - Bendigo","Nonmetro","E Pop > 500",null,null,876,98.1,null,null,null,"Refer to Distribution Partner",25,null,2,2,0,0,0,1,3,null,null,null,null,null,3450]
[3450,"A","Other","Regional","202 VIC Rural - Bendigo","Nonmetro","D Pop > 2,000",3,null,6834,106.4,null,null,null,"Regional",44.999999999999993,null,2,2,1,1,1,1,3,null,null,null,null,null,3451]
[3451,"A","Other","Regional","202 VIC Rural - Bendigo","Nonmetro","D Pop > 2,000",3,null,5656,104.9,null,null,null,"Regional",44.999999999999993,null,2,2,1,1,1,1,3,null,null,null,null,null,3453]
[3453,"A","Other","Regional","202 VIC Rural - Bendigo","Nonmetro","E Pop > 500",null,null,1723,115.5,null,null,null,"Refer to Distribution Partner",25,null,2,2,0,0,0,1,3,null,null,null,null,null,3458]
[3458,"A","Other","Regional","201 VIC Rural - Ballarat","Nonmetro","E Pop > 500",null,null,1945,71.8,null,null,null,"Refer to Distribution Partner",25,null,2,2,0,0,0,1,3,null,null,null,null,null,3460]
[3460,"A","Regional","Regional","201 VIC Rural - Ballarat","Nonmetro","B Regional",2,null,2567,89.1,null,null,null,"Regional",51.666666666666671,null,2,2,2,2,0,1,3,null,null,null,null,null,3461]
[3461,"A","Other","Regional","201 VIC Rural - Ballarat","Nonmetro","D Pop > 2,000",2,null,4149,89,null,null,null,"Regional",45,null,2,2,1,2,0,1,3,null,null,null,null,null,3462]
[3462,"A","Other","Regional","202 VIC Rural - Bendigo","Nonmetro","E Pop > 500",null,null,1173,112.3,null,null,null,"Refer to Distribution Partner",25,null,2,2,0,0,0,1,3,null,null,null,null,null,3463]
[3463,"A","Other","Regional","202 VIC Rural - Bendigo","Nonmetro","D Pop > 2,000",null,null,2451,122.6,null,null,null,"Refer to Distribution Partner",31.666666666666664,null,2,2,1,0,0,1,3,null,null,null,null,null,3464]
[3464,"A","Other","Regional","201 VIC Rural - Ballarat","Nonmetro","E Pop > 500",null,null,1115,132.5,null,null,null,"Refer to Distribution Partner",25,null,2,2,0,0,0,1,3,null,null,null,null,null,3465]
[3465,"A","Other","Regional","201 VIC Rural - Ballarat","Nonmetro","C Pop > 7,000",3,null,9776,138.1,null,null,null,"Regional",44.999999999999993,null,2,2,1,1,1,1,3,null,null,null,null,null,3467]
[3467,"A","Other","Regional","201 VIC Rural - Ballarat","Nonmetro","E Pop > 500",null,null,1193,154.1,null,null,null,{"$f":"IF(ISBLANK(N1026),IF(AND(H1026<>\"\",IF(I1026=\"High Density\",\"High Density\",IF(AND(P1026<=45,P1026>0),\"Refer to Distribution Partner\",IF(AND(P1026<=55,P1026>45),\"Regional\",IF(AND(P1026>55,P1026<=70),\"Non Metro\",IF(F1026=\"Nonmetro\",\"Non Metro\",IF(P1026>70,\"Metro\",\"\"))))))=\"Refer to Distribution Partner\"),\"Regional\",IF(I1026=\"High Density\",\"High Density\",IF(AND(P1026<=45,P1026>0),\"Refer to Distribution Partner\",IF(AND(P1026<=55,P1026>45),\"Regional\",IF(AND(P1026>55,P1026<=70),\"Non Metro\",IF(F1026=\"Nonmetro\",\"Non Metro\",IF(P1026>70,\"Metro\",\"\"))))))),N1026)","v":"Refer to Distribution Partner"},{"$f":"(R1026/$AB$3*$AA$3+S1026/$AB$4*$AA$4+T1026/$AB$5*$AA$5+U1026/$AB$6*$AA$6+V1026/$AB$7*$AA$7+W1026/$AB$8*$AA$8+X1026/$AB$9*$AA$9)*100","v":21.666666666666668},null,{"$f":"IF(ISNUMBER(SEARCH(\"Metro\",E1026)),3,IF(ISNUMBER(SEARCH(\"Rural\",E1026)),2,1))","v":2},{"$f":"IF(ISNUMBER(FIND(\"Metro\",F1026)),3,IF(ISNUMBER(FIND(\"Nonmetro\",F1026)),2,3))","v":2},{"$f":"IF(G1026=\"A Metro\",3,IF(G1026=\"B Regional\",2,IF(G1026=\"C Pop > 7,000\",1,IF(G1026=\"D Pop > 2,000\",1,0))))","v":0},{"$f":"IF(H1026=1,3,IF(H1026=2,2,IF(H1026=3,1,0)))","v":0},{"$f":"IF(J1026>=100000,3,IF(AND(J1026>=10000,J1026<100000),2,IF(AND(J1026>=5000,J1026<10000),1,0)))","v":0},{"$f":"IF(AND(K1026>=0.1,K1026<25),3,IF(AND(K1026>=25,K1026<50),2,IF(AND(K1026>=50,K1026<150),1,0)))","v":0},{"$f":"IF(L1026=\"\",3,0)","v":3},null,null,null,null,null,3468]
[3468,"A","Other","Regional","201 VIC Rural - Ballarat","Nonmetro","F Pop <= 500",null,null,286,0,null,null,null,"Refer to Distribution Partner",21.666666666666668,null,2,2,0,0,0,0,3,null,null,null,null,null,3469]
[3469,"A","Other","Regional","201 VIC Rural - Ballarat","Nonmetro","F Pop <= 500",null,null,280,0,null,null,null,"Refer to Distribution Partner",21.666666666666668,null,2,2,0,0,0,0,3,null,null,null,null,null,3472]
[3472,"A","Other","Regional","201 VIC Rural - Ballarat","Nonmetro","E Pop > 500",null,null,1480,152,null,null,null,"Refer to Distribution Partner",21.666666666666668,null,2,2,0,0,0,0,3,null,null,null,null,null,3475]
[3475,"A","Other","Regional","201 VIC Rural - Ballarat","Nonmetro","F Pop <= 500",null,null,345,0,null,null,null,"Refer to Distribution Partner",21.666666666666668,null,2,2,0,0,0,0,3,null,null,null,null,null,3477]
[3477,"A","Other","Regional","215 VIC Rural - Wimmera Mallee","Nonmetro","F Pop <= 500",null,null,829,186,null,null,null,"Refer to Distribution Partner",21.666666666666668,null,2,2,0,0,0,0,3,null,null,null,null,null,3478]
[3478,"A","Other","Regional","215 VIC Rural - Wimmera Mallee","Nonmetro","D Pop > 2,000",null,null,2456,199.2,null,null,null,"Refer to Distribution Partner",28.333333333333332,null,2,2,1,0,0,0,3,null,null,null,null,null,3480]
[3480,"A","Other","Regional","215 VIC Rural - Wimmera Mallee","Nonmetro","E Pop > 500",null,null,1856,237.7,null,null,null,"Refer to Distribution Partner",21.666666666666668,null,2,2,0,0,0,0,3,null,null,null,null,null,3482]
[3482,"A","Other","Regional","215 VIC Rural - Wimmera Mallee","Nonmetro","F Pop <= 500",null,null,164,0,null,null,null,"Refer to Distribution Partner",21.666666666666668,null,2,2,0,0,0,0,3,null,null,null,null,null,3483]
[3483,"A","Other","Regional","215 VIC Rural - Wimmera Mallee","Nonmetro","E Pop > 500",null,null,889,272.89999999999998,null,null,null,"Refer to Distribution Partner",21.666666666666668,null,2,2,0,0,0,0,3,null,null,null,null,null,3485]
[3485,"A","Other","Regional","215 VIC Rural - Wimmera Mallee","Nonmetro","F Pop <= 500",null,null,302,0,null,null,null,"Refer to Distribution Partner",21.666666666666668,null,2,2,0,0,0,0,3,null,null,null,null,null,3487]
[3487,"A","Other","Regional","215 VIC Rural - Wimmera Mallee","Nonmetro","F Pop <= 500",null,null,93,0,null,null,null,"Refer to Distribution Partner",21.666666666666668,null,2,2,0,0,0,0,3,null,null,null,null,null,3488]
[3488,"A","Other","Regional","215 VIC Rural - Wimmera Mallee","Nonmetro","F Pop <= 500",null,null,115,0,null,null,null,"Refer to Distribution Partner",21.666666666666668,null,2,2,0,0,0,0,3,null,null,null,null,null,3489]
[3489,"A","Other","Regional","215 VIC Rural - Wimmera Mallee","Nonmetro","F Pop <= 500",null,null,57,0,null,null,null,"Refer to Distribution Partner",21.666666666666668,null,2,2,0,0,0,0,3,null,null,null,null,null,3490]
[3490,"A","Other","Regional","215 VIC Rural - Wimmera Mallee","Nonmetro","E Pop > 500",null,null,1293,385.6,null,null,null,"Refer to Distribution Partner",21.666666666666668,null,2,2,0,0,0,0,3,null,null,null,null,null,3491]
[3491,"A","Other","Regional","215 VIC Rural - Wimmera Mallee","Nonmetro","F Pop <= 500",null,null,133,0,null,null,null,"Refer to Distribution Partner",21.666666666666668,null,2,2,0,0,0,0,3,null,null,null,null,null,3494]
[3494,"A","Other","Regional","215 VIC Rural - Wimmera Mallee","Nonmetro","E Pop > 500",null,null,663,0,null,null,null,"Refer to Distribution Partner",21.666666666666668,null,2,2,0,0,0,0,3,null,null,null,null,null,3496]
[3496,"A","Other","Regional","215 VIC Rural - Wimmera Mallee","Nonmetro","D Pop > 2,000",null,null,6224,464.2,null,null,null,"Refer to Distribution Partner",35,null,2,2,1,0,1,0,3,null,null,null,null,null,3498]
[3498,"A","Other","Regional","215 VIC Rural - Wimmera Mallee","Nonmetro","D Pop > 2,000",null,null,5325,470.3,null,null,null,"Refer to Distribution Partner",35,null,2,2,1,0,1,0,3,null,null,null,null,null,3500]
[3500,"A","Regional","Regional","215 VIC Rural - Wimmera Mallee","Nonmetro","B Regional",2,null,32738,475.6,null,null,null,"Non Metro",61.666666666666671,null,2,2,2,2,2,0,3,null,null,null,null,null,3501]
[3501,"A","Regional","Regional","215 VIC Rural - Wimmera Mallee","Nonmetro","B Regional",2,null,1941,471,null,null,null,"Regional",48.333333333333336,null,2,2,2,2,0,0,3,null,null,null,null,null,3505]
[3505,"A","Other","Regional","215 VIC Rural - Wimmera Mallee","Nonmetro","D Pop > 2,000",null,null,4832,481.9,null,null,null,"Refer to Distribution Partner",28.333333333333332,null,2,2,1,0,0,0,3,null,null,null,null,null,3506]
[3506,"A","Other","Regional","215 VIC Rural - Wimmera Mallee","Nonmetro","F Pop <= 500",null,null,36,0,null,null,null,"Refer to Distribution Partner",21.666666666666668,null,2,2,0,0,0,0,3,null,null,null,null,null,3507]
[3507,"A","Other","Regional","215 VIC Rural - Wimmera Mallee","Nonmetro","F Pop <= 500",null,null,158,0,null,null,null,"Refer to Distribution Partner",21.666666666666668,null,2,2,0,0,0,0,3,null,null,null,null,null,3509]
[3509,"A","Other","Regional","215 VIC Rural - Wimmera Mallee","Nonmetro","F Pop <= 500",null,null,233,0,null,null,null,"Refer to Distribution Partner",21.666666666666668,null,2,2,0,0,0,0,3,null,null,null,null,null,3512]
[3512,"A","Other","Regional","215 VIC Rural - Wimmera Mallee","Nonmetro","E Pop > 500",null,null,371,0,null,null,null,"Refer to Distribution Partner",21.666666666666668,null,2,2,0,0,0,0,3,null,null,null,null,null,3515]
[3515,"A","Other","Regional","202 VIC Rural - Bendigo","Nonmetro","E Pop > 500",null,null,1944,139.5,null,null,null,"Refer to Distribution Partner",25,null,2,2,0,0,0,1,3,null,null,null,null,null,3516]
[3516,"A","Other","Regional","202 VIC Rural - Bendigo","Nonmetro","E Pop > 500",null,null,694,160.80000000000001,null,null,null,"Refer to Distribution Partner",21.666666666666668,null,2,2,0,0,0,0,3,null,null,null,null,null,3517]
[3517,"A","Other","Regional","202 VIC Rural - Bendigo","Nonmetro","E Pop > 500",null,null,1421,170,null,null,null,"Refer to Distribution Partner",21.666666666666668,null,2,2,0,0,0,0,3,null,null,null,null,null,3518]
[3518,"A","Other","Regional","202 VIC Rural - Bendigo","Nonmetro","E Pop > 500",null,null,1306,196.1,null,null,null,"Refer to Distribution Partner",21.666666666666668,null,2,2,0,0,0,0,3,null,null,null,null,null,3520]
[3520,"A","Other","Regional","202 VIC Rural - Bendigo","Nonmetro","F Pop <= 500",null,null,180,0,null,null,null,"Refer to Distribution Partner",21.666666666666668,null,2,2,0,0,0,0,3,null,null,null,null,null,3521]
[3521,"A","Other","Regional","204 VIC Rural - Wodonga & North East","Nonmetro","E Pop > 500",null,null,660,0,null,null,null,"Refer to Distribution Partner",21.666666666666668,null,2,2,0,0,0,0,3,null,null,null,null,null,3522]
[3522,"A","Other","Regional","204 VIC Rural - Wodonga & North East","Nonmetro","F Pop <= 500",null,null,339,0,null,null,null,"Refer to Distribution Partner",21.666666666666668,null,2,2,0,0,0,0,3,null,null,null,null,null,3523]
[3523,"A","Other","Regional","202 VIC Rural - Bendigo","Nonmetro","D Pop > 2,000",null,null,3620,102.5,"Mining",null,null,"Refer to Distribution Partner",26.666666666666668,null,2,2,1,0,0,1,0,null,null,null,null,null,3525]
[3525,"A","Other","Regional","215 VIC Rural - Wimmera Mallee","Nonmetro","E Pop > 500",null,null,1301,223.8,null,null,null,"Refer to Distribution Partner",21.666666666666668,null,2,2,0,0,0,0,3,null,null,null,null,null,3527]
[3527,"A","Other","Regional","215 VIC Rural - Wimmera Mallee","Nonmetro","E Pop > 500",null,null,785,247,null,null,null,"Refer to Distribution Partner",21.666666666666668,null,2,2,0,0,0,0,3,null,null,null,null,null,3529]
[3529,"A","Other","Regional","215 VIC Rural - Wimmera Mallee","Nonmetro","F Pop <= 500",null,null,121,0,null,null,null,"Refer to Distribution Partner",21.666666666666668,null,2,2,0,0,0,0,3,null,null,null,null,null,3530]
[3530,"A","Other","Regional","215 VIC Rural - Wimmera Mallee","Nonmetro","F Pop <= 500",null,null,126,0,null,null,null,"Refer to Distribution Partner",21.666666666666668,null,2,2,0,0,0,0,3,null,null,null,null,null,3531]
[3531,"A","Other","Regional","215 VIC Rural - Wimmera Mallee","Nonmetro","F Pop <= 500",null,null,191,0,null,null,null,"Refer to Distribution Partner",21.666666666666668,null,2,2,0,0,0,0,3,null,null,null,null,null,3533]
[3533,"A","Other","Regional","215 VIC Rural - Wimmera Mallee","Nonmetro","E Pop > 500",null,null,778,318.39999999999998,null,null,null,"Refer to Distribution Partner",21.666666666666668,null,2,2,0,0,0,0,3,null,null,null,null,null,3537]
[3537,"A","Other","Regional","202 VIC Rural - Bendigo","Nonmetro","E Pop > 500",null,null,1043,218.6,null,null,null,"Refer to Distribution Partner",21.666666666666668,null,2,2,0,0,0,0,3,null,null,null,null,null,3540]
[3540,"A","Other","Regional","215 VIC Rural - Wimmera Mallee","Nonmetro","F Pop <= 500",null,null,291,0,null,null,null,"Refer to Distribution Partner",21.666666666666668,null,2,2,0,0,0,0,3,null,null,null,null,null,3542]
[3542,"A","Other","Regional","215 VIC Rural - Wimmera Mallee","Nonmetro","F Pop <= 500",null,null,157,0,null,null,null,"Refer to Distribution Partner",21.666666666666668,null,2,2,0,0,0,0,3,null,null,null,null,null,3544]
[3544,"A","Other","Regional","215 VIC Rural - Wimmera Mallee","Nonmetro","F Pop <= 500",null,null,250,0,null,null,null,"Refer to Distribution Partner",21.666666666666668,null,2,2,0,0,0,0,3,null,null,null,null,null,3546]
[3546,"A","Other","Regional","215 VIC Rural - Wimmera Mallee","Nonmetro","F Pop <= 500",null,null,402,0,null,null,null,"Refer to Distribution Partner",21.666666666666668,null,2,2,0,0,0,0,3,null,null,null,null,null,3549]
[3549,"A","Other","Regional","215 VIC Rural - Wimmera Mallee","Nonmetro","D Pop > 2,000",null,null,3522,408,null,null,null,"Refer to Distribution Partner",28.333333333333332,null,2,2,1,0,0,0,3,null,null,null,null,null,3550]
[3550,"A","Regional","Regional","202 VIC Rural - Bendigo","Nonmetro","B Regional",2,null,40339,131.6,null,null,null,"Non Metro",65,null,2,2,2,2,2,1,3,null,null,null,null,null,3551]
[3551,"A","Regional","Regional","202 VIC Rural - Bendigo","Nonmetro","B Regional",2,null,29565,131.19999999999999,null,null,null,"Non Metro",65,null,2,2,2,2,2,1,3,null,null,null,null,null,3555]
[3555,"A","Regional","Regional","202 VIC Rural - Bendigo","Nonmetro","B Regional",2,null,19687,130.9,null,null,null,"Non Metro",65,null,2,2,2,2,2,1,3,null,null,null,null,null,3556]
[3556,"A","Regional","Regional","202 VIC Rural - Bendigo","Nonmetro","B Regional",2,null,13085,137.30000000000001,null,null,null,"Non Metro",65,null,2,2,2,2,2,1,3,null,null,null,null,null,3557]
[3557,"A","Other","Regional","202 VIC Rural - Bendigo","Nonmetro","E Pop > 500",null,null,785,0,"Mining",null,null,"Refer to Distribution Partner",16.666666666666664,null,2,2,0,0,0,0,0,null,null,null,null,null,3558]
[3558,"A","Other","Regional","202 VIC Rural - Bendigo","Nonmetro","E Pop > 500",null,null,913,150.4,null,null,null,"Refer to Distribution Partner",21.666666666666668,null,2,2,0,0,0,0,3,null,null,null,null,null,3559]
[3559,"A","Other","Regional","216 VIC Rural - Goulburn Valley","Nonmetro","E Pop > 500",null,null,542,0,null,null,null,"Refer to Distribution Partner",21.666666666666668,null,2,2,0,0,0,0,3,null,null,null,null,null,3561]
[3561,"A","Other","Regional","216 VIC Rural - Goulburn Valley","Nonmetro","D Pop > 2,000",null,null,4436,164.4,null,null,null,"Refer to Distribution Partner",28.333333333333332,null,2,2,1,0,0,0,3,null,null,null,null,null,3562]
[3562,"A","Other","Regional","216 VIC Rural - Goulburn Valley","Nonmetro","F Pop <= 500",null,null,279,0,null,null,null,"Refer to Distribution Partner",21.666666666666668,null,2,2,0,0,0,0,3,null,null,null,null,null,3563]
[3563,"A","Other","Regional","216 VIC Rural - Goulburn Valley","Nonmetro","E Pop > 500",null,null,808,0,null,null,null,"Refer to Distribution Partner",21.666666666666668,null,2,2,0,0,0,0,3,null,null,null,null,null,3564]
[3564,"A","Regional","Regional","216 VIC Rural - Goulburn Valley","Nonmetro","B Regional",2,null,15944,187.7,null,null,null,"Non Metro",61.666666666666671,null,2,2,2,2,2,0,3,null,null,null,null,null,3565]
[3565,"A","Other","Regional","216 VIC Rural - Goulburn Valley","Nonmetro","F Pop <= 500",null,null,109,0,null,null,null,"Refer to Distribution Partner",21.666666666666668,null,2,2,0,0,0,0,3,null,null,null,null,null,3566]
[3566,"A","Other","Regional","216 VIC Rural - Goulburn Valley","Nonmetro","E Pop > 500",null,null,551,213.3,null,null,null,"Refer to Distribution Partner",21.666666666666668,null,2,2,0,0,0,0,3,null,null,null,null,null,3567]
[3567,"A","Other","Regional","215 VIC Rural - Wimmera Mallee","Nonmetro","E Pop > 500",null,null,655,219.9,null,null,null,"Refer to Distribution Partner",21.666666666666668,null,2,2,0,0,0,0,3,null,null,null,null,null,3568]
[3568,"A","Other","Regional","215 VIC Rural - Wimmera Mallee","Nonmetro","D Pop > 2,000",null,null,2945,232.9,null,null,null,"Refer to Distribution Partner",28.333333333333332,null,2,2,1,0,0,0,3,null,null,null,null,null,3570]
[3570,"A","Other","Regional","202 VIC Rural - Bendigo","Nonmetro","E Pop > 500",null,null,753,0,null,null,null,"Refer to Distribution Partner",21.666666666666668,null,2,2,0,0,0,0,3,null,null,null,null,null,3571]
[3571,"A","Other","Regional","202 VIC Rural - Bendigo","Nonmetro","F Pop <= 500",null,null,318,0,null,null,null,"Refer to Distribution Partner",21.666666666666668,null,2,2,0,0,0,0,3,null,null,null,null,null,3572]
[3572,"A","Other","Regional","216 VIC Rural - Goulburn Valley","Nonmetro","F Pop <= 500",null,null,151,0,null,null,null,"Refer to Distribution Partner",21.666666666666668,null,2,2,0,0,0,0,3,null,null,null,null,null,3573]
[3573,"A","Other","Regional","202 VIC Rural - Bendigo","Nonmetro","E Pop > 500",null,null,333,0,null,null,null,{"$f":"IF(ISBLANK(N1090),IF(AND(H1090<>\"\",IF(I1090=\"High Density\",\"High Density\",IF(AND(P1090<=45,P1090>0),\"Refer to Distribution Partner\",IF(AND(P1090<=55,P1090>45),\"Regional\",IF(AND(P1090>55,P1090<=70),\"Non Metro\",IF(F1090=\"Nonmetro\",\"Non Metro\",IF(P1090>70,\"Metro\",\"\"))))))=\"Refer to Distribution Partner\"),\"Regional\",IF(I1090=\"High Density\",\"High Density\",IF(AND(P1090<=45,P1090>0),\"Refer to Distribution Partner\",IF(AND(P1090<=55,P1090>45),\"Regional\",IF(AND(P1090>55,P1090<=70),\"Non Metro\",IF(F1090=\"Nonmetro\",\"Non Metro\",IF(P1090>70,\"Metro\",\"\"))))))),N1090)","v":"Refer to Distribution Partner"},{"$f":"(R1090/$AB$3*$AA$3+S1090/$AB$4*$AA$4+T1090/$AB$5*$AA$5+U1090/$AB$6*$AA$6+V1090/$AB$7*$AA$7+W1090/$AB$8*$AA$8+X1090/$AB$9*$AA$9)*100","v":21.666666666666668},null,{"$f":"IF(ISNUMBER(SEARCH(\"Metro\",E1090)),3,IF(ISNUMBER(SEARCH(\"Rural\",E1090)),2,1))","v":2},{"$f":"IF(ISNUMBER(FIND(\"Metro\",F1090)),3,IF(ISNUMBER(FIND(\"Nonmetro\",F1090)),2,3))","v":2},{"$f":"IF(G1090=\"A Metro\",3,IF(G1090=\"B Regional\",2,IF(G1090=\"C Pop > 7,000\",1,IF(G1090=\"D Pop > 2,000\",1,0))))","v":0},{"$f":"IF(H1090=1,3,IF(H1090=2,2,IF(H1090=3,1,0)))","v":0},{"$f":"IF(J1090>=100000,3,IF(AND(J1090>=10000,J1090<100000),2,IF(AND(J1090>=5000,J1090<10000),1,0)))","v":0},{"$f":"IF(AND(K1090>=0.1,K1090<25),3,IF(AND(K1090>=25,K1090<50),2,IF(AND(K1090>=50,K1090<150),1,0)))","v":0},{"$f":"IF(L1090=\"\",3,0)","v":3},null,null,null,null,null,3575]
[3575,"A","Other","Regional","202 VIC Rural - Bendigo","Nonmetro","E Pop > 500",null,null,811,208.9,null,null,null,"Refer to Distribution Partner",21.666666666666668,null,2,2,0,0,0,0,3,null,null,null,null,null,3576]
[3576,"A","Other","Regional","202 VIC Rural - Bendigo","Nonmetro","F Pop <= 500",null,null,74,0,null,null,null,"Refer to Distribution Partner",21.666666666666668,null,2,2,0,0,0,0,3,null,null,null,null,null,3579]
[3579,"A","Other","Regional","215 VIC Rural - Wimmera Mallee","Nonmetro","D Pop > 2,000",null,null,5365,250.9,null,null,null,"Refer to Distribution Partner",35,null,2,2,1,0,1,0,3,null,null,null,null,null,3580]
[3580,"A","Other","Regional","215 VIC Rural - Wimmera Mallee","Nonmetro","E Pop > 500",null,null,991,253.2,null,null,null,"Refer to Distribution Partner",21.666666666666668,null,2,2,0,0,0,0,3,null,null,null,null,null,3581]
[3581,"A","Other","Regional","215 VIC Rural - Wimmera Mallee","Nonmetro","F Pop <= 500",null,null,168,0,null,null,null,"Refer to Distribution Partner",21.666666666666668,null,2,2,0,0,0,0,3,null,null,null,null,null,3583]
[3583,"A","Other","Regional","215 VIC Rural - Wimmera Mallee","Nonmetro","E Pop > 500",null,null,209,0,null,null,null,"Refer to Distribution Partner",21.666666666666668,null,2,2,0,0,0,0,3,null,null,null,null,null,3584]
[3584,"A","Other","Regional","215 VIC Rural - Wimmera Mallee","Nonmetro","E Pop > 500",null,null,1138,287.60000000000002,null,null,null,"Refer to Distribution Partner",21.666666666666668,null,2,2,0,0,0,0,3,null,null,null,null,null,3585]
[3585,"A","Regional","Regional","215 VIC Rural - Wimmera Mallee","Nonmetro","B Regional",3,null,11206,302.7,null,null,null,"Regional",55.000000000000007,null,2,2,2,1,2,0,3,null,null,null,null,null,3586]
[3586,"A","Other","Regional","215 VIC Rural - Wimmera Mallee","Nonmetro","E Pop > 500",null,null,829,0,null,null,null,"Refer to Distribution Partner",21.666666666666668,null,2,2,0,0,0,0,3,null,null,null,null,null,3588]
[3588,"A","Other","Regional","215 VIC Rural - Wimmera Mallee","Nonmetro","F Pop <= 500",null,null,356,0,null,null,null,"Refer to Distribution Partner",21.666666666666668,null,2,2,0,0,0,0,3,null,null,null,null,null,3589]
[3589,"A","Other","Regional","215 VIC Rural - Wimmera Mallee","Nonmetro","F Pop <= 500",null,null,352,0,null,null,null,"Refer to Distribution Partner",21.666666666666668,null,2,2,0,0,0,0,3,null,null,null,null,null,3590]
[3590,"A","Other","Regional","215 VIC Rural - Wimmera Mallee","Nonmetro","F Pop <= 500",null,null,336,0,null,null,null,"Refer to Distribution Partner",21.666666666666668,null,2,2,0,0,0,0,3,null,null,null,null,null,3591]
[3591,"A","Other","Regional","215 VIC Rural - Wimmera Mallee","Nonmetro","F Pop <= 500",null,null,159,0,null,null,null,"Refer to Distribution Partner",21.666666666666668,null,2,2,0,0,0,0,3,null,null,null,null,null,3594]
[3594,"A","Other","Regional","215 VIC Rural - Wimmera Mallee","Nonmetro","F Pop <= 500",null,null,530,325.8,null,null,null,"Refer to Distribution Partner",21.666666666666668,null,2,2,0,0,0,0,3,null,null,null,null,null,3595]
[3595,"A","Other","Regional","215 VIC Rural - Wimmera Mallee","Nonmetro","E Pop > 500",null,null,663,325.89999999999998,null,null,null,"Refer to Distribution Partner",21.666666666666668,null,2,2,0,0,0,0,3,null,null,null,null,null,3596]
[3596,"A","Other","Regional","215 VIC Rural - Wimmera Mallee","Nonmetro","F Pop <= 500",null,null,94,0,null,null,null,"Refer to Distribution Partner",21.666666666666668,null,2,2,0,0,0,0,3,null,null,null,null,null,3597]
[3597,"A","Other","Regional","215 VIC Rural - Wimmera Mallee","Nonmetro","E Pop > 500",null,null,415,0,null,null,null,"Refer to Distribution Partner",21.666666666666668,null,2,2,0,0,0,0,3,null,null,null,null,null,3599]
[3599,"A","Other","Regional","215 VIC Rural - Wimmera Mallee","Nonmetro","F Pop <= 500",null,null,132,0,null,null,null,"Refer to Distribution Partner",21.666666666666668,null,2,2,0,0,0,0,3,null,null,null,null,null,3607]
[3607,"A","Other","Regional","204 VIC Rural - Wodonga & North East","Nonmetro","F Pop <= 500",null,null,131,0,null,null,null,"Refer to Distribution Partner",21.666666666666668,null,2,2,0,0,0,0,3,null,null,null,null,null,3608]
[3608,"A","Other","Regional","204 VIC Rural - Wodonga & North East","Nonmetro","F Pop <= 500",null,null,2418,115.7,null,null,null,"Refer to Distribution Partner",25,null,2,2,0,0,0,1,3,null,null,null,null,null,3610]
[3610,"A","Other","Regional","216 VIC Rural - Goulburn Valley","Nonmetro","E Pop > 500",null,null,1712,135.6,null,null,null,"Refer to Distribution Partner",25,null,2,2,0,0,0,1,3,null,null,null,null,null,3612]
[3612,"A","Other","Regional","216 VIC Rural - Goulburn Valley","Nonmetro","E Pop > 500",null,null,1709,136.4,null,null,null,"Refer to Distribution Partner",25,null,2,2,0,0,0,1,3,null,null,null,null,null,3614]
[3614,"A","Other","Regional","216 VIC Rural - Goulburn Valley","Nonmetro","E Pop > 500",null,null,882,150.6,null,null,null,"Refer to Distribution Partner",21.666666666666668,null,2,2,0,0,0,0,3,null,null,null,null,null,3616]
[3616,"A","Other","Regional","216 VIC Rural - Goulburn Valley","Nonmetro","D Pop > 2,000",3,null,5357,154.69999999999999,null,null,null,"Regional",41.666666666666664,null,2,2,1,1,1,0,3,null,null,null,null,null,3617]
[3617,"A","Other","Regional","216 VIC Rural - Goulburn Valley","Nonmetro","F Pop <= 500",null,null,158,0,null,null,null,"Refer to Distribution Partner",21.666666666666668,null,2,2,0,0,0,0,3,null,null,null,null,null,3618]
[3618,"A","Other","Regional","216 VIC Rural - Goulburn Valley","Nonmetro","E Pop > 500",null,null,679,160.9,null,null,null,"Refer to Distribution Partner",21.666666666666668,null,2,2,0,0,0,0,3,null,null,null,null,null,3620]
[3620,"A","Other","Regional","216 VIC Rural - Goulburn Valley","Nonmetro","C Pop > 7,000",3,null,8240,167,null,null,null,"Regional",41.666666666666664,null,2,2,1,1,1,0,3,null,null,null,null,null,3621]
[3621,"A","Other","Regional","216 VIC Rural - Goulburn Valley","Nonmetro","D Pop > 2,000",null,null,2368,173.9,null,null,null,"Refer to Distribution Partner",28.333333333333332,null,2,2,1,0,0,0,3,null,null,null,null,null,3622]
[3622,"A","Other","Regional","216 VIC Rural - Goulburn Valley","Nonmetro","F Pop <= 500",null,null,457,0,null,null,null,"Refer to Distribution Partner",21.666666666666668,null,2,2,0,0,0,0,3,null,null,null,null,null,3623]
[3623,"A","Other","Regional","216 VIC Rural - Goulburn Valley","Nonmetro","E Pop > 500",null,null,899,152.4,null,null,null,"Refer to Distribution Partner",21.666666666666668,null,2,2,0,0,0,0,3,null,null,null,null,null,3624]
[3624,"A","Other","Regional","216 VIC Rural - Goulburn Valley","Nonmetro","E Pop > 500",null,null,561,0,null,null,null,"Refer to Distribution Partner",21.666666666666668,null,2,2,0,0,0,0,3,null,null,null,null,null,3629]
[3629,"A","Other","Regional","216 VIC Rural - Goulburn Valley","Nonmetro","C Pop > 7,000",3,null,9127,162.5,null,null,null,"Regional",41.666666666666664,null,2,2,1,1,1,0,3,null,null,null,null,null,3630]
[3630,"A","Regional","Regional","216 VIC Rural - Goulburn Valley","Nonmetro","B Regional",2,null,31272,164.8,null,null,null,"Non Metro",61.666666666666671,null,2,2,2,2,2,0,3,null,null,null,null,null,3631]
[3631,"A","Regional","Regional","216 VIC Rural - Goulburn Valley","Nonmetro","B Regional",2,null,11612,161.5,null,null,null,"Non Metro",61.666666666666671,null,2,2,2,2,2,0,3,null,null,null,null,null,3633]
[3633,"A","Other","Regional","216 VIC Rural - Goulburn Valley","Nonmetro","E Pop > 500",null,null,605,0,null,null,null,"Refer to Distribution Partner",21.666666666666668,null,2,2,0,0,0,0,3,null,null,null,null,null,3634]
[3634,"A","Other","Regional","216 VIC Rural - Goulburn Valley","Nonmetro","E Pop > 500",null,null,1799,182.1,null,null,null,"Refer to Distribution Partner",21.666666666666668,null,2,2,0,0,0,0,3,null,null,null,null,null,3635]
[3635,"A","Other","Regional","216 VIC Rural - Goulburn Valley","Nonmetro","E Pop > 500",null,null,537,0,null,null,null,"Refer to Distribution Partner",21.666666666666668,null,2,2,0,0,0,0,3,null,null,null,null,null,3636]
[3636,"A","Other","Regional","216 VIC Rural - Goulburn Valley","Nonmetro","D Pop > 2,000",3,null,5241,196.6,null,null,null,"Regional",41.666666666666664,null,2,2,1,1,1,0,3,null,null,null,null,null,3637]
[3637,"A","Other","Regional","216 VIC Rural - Goulburn Valley","Nonmetro","E Pop > 500",null,null,594,0,null,null,null,"Refer to Distribution Partner",21.666666666666668,null,2,2,0,0,0,0,3,null,null,null,null,null,3638]
[3638,"A","Other","Regional","216 VIC Rural - Goulburn Valley","Nonmetro","D Pop > 2,000",null,null,2074,196.4,null,null,null,"Refer to Distribution Partner",28.333333333333332,null,2,2,1,0,0,0,3,null,null,null,null,null,3639]
[3639,"A","Other","Regional","216 VIC Rural - Goulburn Valley","Nonmetro","E Pop > 500",null,null,526,201.1,null,null,null,"Refer to Distribution Partner",21.666666666666668,null,2,2,0,0,0,0,3,null,null,null,null,null,3640]
[3640,"A","Other","Regional","216 VIC Rural - Goulburn Valley","Nonmetro","E Pop > 500",null,null,996,0,null,null,null,"Refer to Distribution Partner",21.666666666666668,null,2,2,0,0,0,0,3,null,null,null,null,null,3641]
[3641,"A","Other","Regional","216 VIC Rural - Goulburn Valley","Nonmetro","E Pop > 500",null,null,1238,214.4,null,null,null,"Refer to Distribution Partner",21.666666666666668,null,2,2,0,0,0,0,3,null,null,null,null,null,3644]
[3644,"A","Regional","Regional","216 VIC Rural - Goulburn Valley","Nonmetro","B Regional",null,null,9227,296.10000000000002,null,null,null,"Refer to Distribution Partner",41.666666666666664,null,2,2,2,0,1,0,3,null,null,null,null,null,3646]
[3646,"A","Other","Regional","216 VIC Rural - Goulburn Valley","Nonmetro","E Pop > 500",null,null,584,0,null,null,null,"Refer to Distribution Partner",21.666666666666668,null,2,2,0,0,0,0,3,null,null,null,null,null,3649]
[3649,"A","Other","Regional","216 VIC Rural - Goulburn Valley","Nonmetro","F Pop <= 500",null,null,434,0,null,null,null,"Refer to Distribution Partner",21.666666666666668,null,2,2,0,0,0,0,3,null,null,null,null,null,3658]
[3658,"A","Other","Regional","204 VIC Rural - Wodonga & North East","Nonmetro","D Pop > 2,000",null,null,6222,65.7,null,null,"Regional","Regional",38.333333333333329,null,2,2,1,0,1,1,3,null,null,null,null,null,3659]
[3659,"A","Other","Regional","204 VIC Rural - Wodonga & North East","Nonmetro","E Pop > 500",null,null,736,0,null,null,null,"Refer to Distribution Partner",21.666666666666668,null,2,2,0,0,0,0,3,null,null,null,null,null,3660]
[3660,"A","Other","Regional","204 VIC Rural - Wodonga & North East","Nonmetro","C Pop > 7,000",3,null,7574,88.9,null,null,null,"Regional",44.999999999999993,null,2,2,1,1,1,1,3,null,null,null,null,null,3663]
[3663,"A","Other","Regional","204 VIC Rural - Wodonga & North East","Nonmetro","F Pop <= 500",null,null,182,0,null,null,null,"Refer to Distribution Partner",21.666666666666668,null,2,2,0,0,0,0,3,null,null,null,null,null,3664]
[3664,"A","Other","Regional","204 VIC Rural - Wodonga & North East","Nonmetro","E Pop > 500",null,null,1070,104.4,null,null,null,"Refer to Distribution Partner",25,null,2,2,0,0,0,1,3,null,null,null,null,null,3665]
[3665,"A","Other","Regional","204 VIC Rural - Wodonga & North East","Nonmetro","E Pop > 500",null,null,359,0,null,null,null,"Refer to Distribution Partner",21.666666666666668,null,2,2,0,0,0,0,3,null,null,null,null,null,3666]
[3666,"A","Other","Regional","204 VIC Rural - Wodonga & North East","Nonmetro","D Pop > 2,000",null,null,4698,128.30000000000001,null,null,null,"Refer to Distribution Partner",31.666666666666664,null,2,2,1,0,0,1,3,null,null,null,null,null,3669]
[3669,"A","Other","Regional","204 VIC Rural - Wodonga & North East","Nonmetro","E Pop > 500",null,null,1337,146.9,null,null,null,"Refer to Distribution Partner",25,null,2,2,0,0,0,1,3,null,null,null,null,null,3670]
[3670,"A","Other","Regional","204 VIC Rural - Wodonga & North East","Nonmetro","E Pop > 500",null,null,572,0,null,null,null,"Refer to Distribution Partner",21.666666666666668,null,2,2,0,0,0,0,3,null,null,null,null,null,3672]
[3672,"A","Other","Regional","204 VIC Rural - Wodonga & North East","Nonmetro","C Pop > 7,000",3,null,10330,167,null,null,null,"Regional",48.333333333333336,null,2,2,1,1,2,0,3,null,null,null,null,null,3673]
[3673,"A","Other","Regional","204 VIC Rural - Wodonga & North East","Nonmetro","E Pop > 500",null,null,1732,158.5,null,null,null,"Refer to Distribution Partner",21.666666666666668,null,2,2,0,0,0,0,3,null,null,null,null,null,3675]
[3675,"A","Other","Regional","204 VIC Rural - Wodonga & North East","Nonmetro","E Pop > 500",null,null,1805,188.5,null,null,null,"Refer to Distribution Partner",21.666666666666668,null,2,2,0,0,0,0,3,null,null,null,null,null,3677]
[3677,"A","Regional","Regional","204 VIC Rural - Wodonga & North East","Nonmetro","B Regional",3,null,18102,201.4,null,null,null,"Regional",55.000000000000007,null,2,2,2,1,2,0,3,null,null,null,null,null,3678]
[3678,"A","Other","Regional","204 VIC Rural - Wodonga & North East","Nonmetro","D Pop > 2,000",null,null,6356,201.4,null,null,null,"Refer to Distribution Partner",35,null,2,2,1,0,1,0,3,null,null,null,null,null,3682]
[3682,"A","Other","Regional","204 VIC Rural - Wodonga & North East","Nonmetro","E Pop > 500",null,null,613,0,null,null,null,"Refer to Distribution Partner",21.666666666666668,null,2,2,0,0,0,0,3,null,null,null,null,null,3683]
[3683,"A","Other","Regional","204 VIC Rural - Wodonga & North East","Nonmetro","E Pop > 500",null,null,1757,235.4,null,null,null,"Refer to Distribution Partner",21.666666666666668,null,2,2,0,0,0,0,3,null,null,null,null,null,3685]
[3685,"A","Other","Regional","204 VIC Rural - Wodonga & North East","Nonmetro","D Pop > 2,000",null,null,2722,236.4,null,null,null,"Refer to Distribution Partner",28.333333333333332,null,2,2,1,0,0,0,3,null,null,null,null,null,3687]
[3687,"A","Other","Regional","204 VIC Rural - Wodonga & North East","Nonmetro","E Pop > 500",null,null,1098,237.6,null,null,null,{"$f":"IF(ISBLANK(N1154),IF(AND(H1154<>\"\",IF(I1154=\"High Density\",\"High Density\",IF(AND(P1154<=45,P1154>0),\"Refer to Distribution Partner\",IF(AND(P1154<=55,P1154>45),\"Regional\",IF(AND(P1154>55,P1154<=70),\"Non Metro\",IF(F1154=\"Nonmetro\",\"Non Metro\",IF(P1154>70,\"Metro\",\"\"))))))=\"Refer to Distribution Partner\"),\"Regional\",IF(I1154=\"High Density\",\"High Density\",IF(AND(P1154<=45,P1154>0),\"Refer to Distribution Partner\",IF(AND(P1154<=55,P1154>45),\"Regional\",IF(AND(P1154>55,P1154<=70),\"Non Metro\",IF(F1154=\"Nonmetro\",\"Non Metro\",IF(P1154>70,\"Metro\",\"\"))))))),N1154)","v":"Refer to Distribution Partner"},{"$f":"(R1154/$AB$3*$AA$3+S1154/$AB$4*$AA$4+T1154/$AB$5*$AA$5+U1154/$AB$6*$AA$6+V1154/$AB$7*$AA$7+W1154/$AB$8*$AA$8+X1154/$AB$9*$AA$9)*100","v":21.666666666666668},null,{"$f":"IF(ISNUMBER(SEARCH(\"Metro\",E1154)),3,IF(ISNUMBER(SEARCH(\"Rural\",E1154)),2,1))","v":2},{"$f":"IF(ISNUMBER(FIND(\"Metro\",F1154)),3,IF(ISNUMBER(FIND(\"Nonmetro\",F1154)),2,3))","v":2},{"$f":"IF(G1154=\"A Metro\",3,IF(G1154=\"B Regional\",2,IF(G1154=\"C Pop > 7,000\",1,IF(G1154=\"D Pop > 2,000\",1,0))))","v":0},{"$f":"IF(H1154=1,3,IF(H1154=2,2,IF(H1154=3,1,0)))","v":0},{"$f":"IF(J1154>=100000,3,IF(AND(J1154>=10000,J1154<100000),2,IF(AND(J1154>=5000,J1154<10000),1,0)))","v":0},{"$f":"IF(AND(K1154>=0.1,K1154<25),3,IF(AND(K1154>=25,K1154<50),2,IF(AND(K1154>=50,K1154<150),1,0)))","v":0},{"$f":"IF(L1154=\"\",3,0)","v":3},null,null,null,null,null,3688]
[3688,"A","Other","Regional","204 VIC Rural - Wodonga & North East","Nonmetro","E Pop > 500",null,null,1236,243.2,null,null,null,"Refer to Distribution Partner",21.666666666666668,null,2,2,0,0,0,0,3,null,null,null,null,null,3690]
[3690,"A","Regional","Regional","204 VIC Rural - Wodonga & North East","Nonmetro","B Regional",1,null,33518,252.8,null,null,null,"Non Metro",68.333333333333329,null,2,2,2,3,2,0,3,null,null,null,null,null,3691]
[3691,"A","Regional","Regional","204 VIC Rural - Wodonga & North East","Nonmetro","B Regional",2,null,9704,256.10000000000002,null,null,null,"Regional",55.000000000000007,null,2,2,2,2,1,0,3,null,null,null,null,null,3694]
[3694,"A","Other","Regional","204 VIC Rural - Wodonga & North East","Nonmetro","E Pop > 500",null,null,90,0,null,null,null,"Refer to Distribution Partner",21.666666666666668,null,2,2,0,0,0,0,3,null,null,null,null,null,3695]
[3695,"A","Other","Regional","204 VIC Rural - Wodonga & North East","Nonmetro","F Pop <= 500",null,null,471,0,null,null,null,"Refer to Distribution Partner",21.666666666666668,null,2,2,0,0,0,0,3,null,null,null,null,null,3697]
[3697,"A","Other","Regional","204 VIC Rural - Wodonga & North East","Nonmetro","E Pop > 500",null,null,574,0,null,null,null,"Refer to Distribution Partner",21.666666666666668,null,2,2,0,0,0,0,3,null,null,null,null,null,3698]
[3698,"A","Other","Regional","204 VIC Rural - Wodonga & North East","Nonmetro","E Pop > 500",null,null,862,227.9,null,null,null,"Refer to Distribution Partner",21.666666666666668,null,2,2,0,0,0,0,3,null,null,null,null,null,3699]
[3699,"A","Other","Regional","204 VIC Rural - Wodonga & North East","Nonmetro","E Pop > 500",null,null,1124,229.5,null,null,null,"Refer to Distribution Partner",21.666666666666668,null,2,2,0,0,0,0,3,null,null,null,null,null,3700]
[3700,"A","Other","Regional","204 VIC Rural - Wodonga & North East","Nonmetro","E Pop > 500",null,null,1318,265.2,null,null,null,"Refer to Distribution Partner",21.666666666666668,null,2,2,0,0,0,0,3,null,null,null,null,null,3701]
[3701,"A","Other","Regional","204 VIC Rural - Wodonga & North East","Nonmetro","E Pop > 500",null,null,1078,260.39999999999998,null,null,null,"Refer to Distribution Partner",21.666666666666668,null,2,2,0,0,0,0,3,null,null,null,null,null,3704]
[3704,"A","Other","Regional","204 VIC Rural - Wodonga & North East","Nonmetro","F Pop <= 500",null,null,20,0,null,null,null,"Refer to Distribution Partner",21.666666666666668,null,2,2,0,0,0,0,3,null,null,null,null,null,3705]
[3705,"A","Other","Regional","204 VIC Rural - Wodonga & North East","Nonmetro","F Pop <= 500",null,null,261,0,null,null,null,"Refer to Distribution Partner",21.666666666666668,null,2,2,0,0,0,0,3,null,null,null,null,null,3707]
[3707,"A","Other","Regional","204 VIC Rural - Wodonga & North East","Nonmetro","E Pop > 500",null,null,1836,317.39999999999998,null,null,null,"Refer to Distribution Partner",21.666666666666668,null,2,2,0,0,0,0,3,null,null,null,null,null,3708]
[3708,"A","Other","Regional","204 VIC Rural - Wodonga & North East","Nonmetro","F Pop <= 500",null,null,60,0,null,null,null,"Refer to Distribution Partner",21.666666666666668,null,2,2,0,0,0,0,3,null,null,null,null,null,3709]
[3709,"A","Other","Regional","204 VIC Rural - Wodonga & North East","Nonmetro","F Pop <= 500",null,null,290,0,null,null,null,"Refer to Distribution Partner",21.666666666666668,null,2,2,0,0,0,0,3,null,null,null,null,null,3711]
[3711,"A","Other","Regional","204 VIC Rural - Wodonga & North East","Nonmetro","F Pop <= 500",null,null,492,78.900000000000006,null,null,null,"Refer to Distribution Partner",25,null,2,2,0,0,0,1,3,null,null,null,null,null,3712]
[3712,"A","Other","Regional","204 VIC Rural - Wodonga & North East","Nonmetro","F Pop <= 500",null,null,353,0,null,null,null,"Refer to Distribution Partner",21.666666666666668,null,2,2,0,0,0,0,3,null,null,null,null,null,3713]
[3713,"A","Other","Regional","204 VIC Rural - Wodonga & North East","Nonmetro","E Pop > 500",null,null,1024,105.2,null,null,null,"Refer to Distribution Partner",25,null,2,2,0,0,0,1,3,null,null,null,null,null,3714]
[3714,"A","Other","Regional","204 VIC Rural - Wodonga & North East","Nonmetro","D Pop > 2,000",null,null,3509,94.4,null,null,null,"Refer to Distribution Partner",31.666666666666664,null,2,2,1,0,0,1,3,null,null,null,null,null,3715]
[3715,"A","Other","Regional","204 VIC Rural - Wodonga & North East","Nonmetro","F Pop <= 500",null,null,307,0,null,null,null,"Refer to Distribution Partner",21.666666666666668,null,2,2,0,0,0,0,3,null,null,null,null,null,3717]
[3717,"A","Other","Regional","204 VIC Rural - Wodonga & North East","Nonmetro","D Pop > 2,000",null,null,2650,75.3,null,null,null,"Refer to Distribution Partner",31.666666666666664,null,2,2,1,0,0,1,3,null,null,null,null,null,3718]
[3718,"A","Other","Regional","204 VIC Rural - Wodonga & North East","Nonmetro","F Pop <= 500",null,null,72,0,null,null,null,"Refer to Distribution Partner",21.666666666666668,null,2,2,0,0,0,0,3,null,null,null,null,null,3719]
[3719,"A","Other","Regional","204 VIC Rural - Wodonga & North East","Nonmetro","E Pop > 500",null,null,367,0,null,null,null,"Refer to Distribution Partner",21.666666666666668,null,2,2,0,0,0,0,3,null,null,null,null,null,3720]
[3720,"A","Other","Regional","204 VIC Rural - Wodonga & North East","Nonmetro","E Pop > 500",null,null,570,118.3,null,null,null,"Refer to Distribution Partner",25,null,2,2,0,0,0,1,3,null,null,null,null,null,3722]
[3722,"A","Other","Regional","204 VIC Rural - Wodonga & North East","Nonmetro","D Pop > 2,000",null,null,5018,130.6,null,null,"Regional","Regional",38.333333333333329,null,2,2,1,0,1,1,3,null,null,null,null,null,3723]
[3723,"A","Other","Regional","204 VIC Rural - Wodonga & North East","Nonmetro","D Pop > 2,000",null,null,3005,145.4,null,null,null,"Refer to Distribution Partner",31.666666666666664,null,2,2,1,0,0,1,3,null,null,null,null,null,3725]
[3725,"A","Other","Regional","204 VIC Rural - Wodonga & North East","Nonmetro","F Pop <= 500",null,null,629,0,null,null,null,"Refer to Distribution Partner",21.666666666666668,null,2,2,0,0,0,0,3,null,null,null,null,null,3726]
[3726,"A","Other","Regional","204 VIC Rural - Wodonga & North East","Nonmetro","E Pop > 500",null,null,401,0,null,null,null,"Refer to Distribution Partner",21.666666666666668,null,2,2,0,0,0,0,3,null,null,null,null,null,3727]
[3727,"A","Other","Regional","216 VIC Rural - Goulburn Valley","Nonmetro","F Pop <= 500",null,null,309,0,null,null,null,"Refer to Distribution Partner",21.666666666666668,null,2,2,0,0,0,0,3,null,null,null,null,null,3728]
[3728,"A","Other","Regional","216 VIC Rural - Goulburn Valley","Nonmetro","E Pop > 500",null,null,636,202,null,null,null,"Refer to Distribution Partner",21.666666666666668,null,2,2,0,0,0,0,3,null,null,null,null,null,3730]
[3730,"A","Regional","Regional","216 VIC Rural - Goulburn Valley","Nonmetro","B Regional",3,null,8833,221.3,null,null,null,"Regional",48.333333333333329,null,2,2,2,1,1,0,3,null,null,null,null,null,3732]
[3732,"A","Other","Regional","204 VIC Rural - Wodonga & North East","Nonmetro","F Pop <= 500",null,null,588,183.1,null,null,null,"Refer to Distribution Partner",21.666666666666668,null,2,2,0,0,0,0,3,null,null,null,null,null,3733]
[3733,"A","Other","Regional","204 VIC Rural - Wodonga & North East","Nonmetro","F Pop <= 500",null,null,215,0,null,null,null,"Refer to Distribution Partner",21.666666666666668,null,2,2,0,0,0,0,3,null,null,null,null,null,3735]
[3735,"A","Other","Regional","204 VIC Rural - Wodonga & North East","Nonmetro","E Pop > 500",null,null,602,0,null,null,null,"Refer to Distribution Partner",21.666666666666668,null,2,2,0,0,0,0,3,null,null,null,null,null,3737]
[3737,"A","Other","Regional","204 VIC Rural - Wodonga & North East","Nonmetro","D Pop > 2,000",null,null,4303,209.9,null,null,null,"Refer to Distribution Partner",28.333333333333332,null,2,2,1,0,0,0,3,null,null,null,null,null,3738]
[3738,"A","Other","Regional","204 VIC Rural - Wodonga & North East","Nonmetro","F Pop <= 500",null,null,219,0,null,null,null,"Refer to Distribution Partner",21.666666666666668,null,2,2,0,0,0,0,3,null,null,null,null,null,3739]
[3739,"A","Other","Regional","204 VIC Rural - Wodonga & North East","Nonmetro","F Pop <= 500",null,null,212,0,null,null,null,"Refer to Distribution Partner",21.666666666666668,null,2,2,0,0,0,0,3,null,null,null,null,null,3740]
[3740,"A","Other","Regional","204 VIC Rural - Wodonga & North East","Nonmetro","E Pop > 500",null,null,1072,212,null,null,null,"Refer to Distribution Partner",21.666666666666668,null,2,2,0,0,0,0,3,null,null,null,null,null,3741]
[3741,"A","Other","Regional","204 VIC Rural - Wodonga & North East","Nonmetro","D Pop > 2,000",null,null,3100,214.1,null,null,null,"Refer to Distribution Partner",28.333333333333332,null,2,2,1,0,0,0,3,null,null,null,null,null,3744]
[3744,"A","Other","Regional","204 VIC Rural - Wodonga & North East","Nonmetro","F Pop <= 500",null,null,453,213.1,null,null,null,"Refer to Distribution Partner",21.666666666666668,null,2,2,0,0,0,0,3,null,null,null,null,null,3746]
[3746,"A","Other","Regional","204 VIC Rural - Wodonga & North East","Nonmetro","F Pop <= 500",null,null,385,0,null,null,null,"Refer to Distribution Partner",21.666666666666668,null,2,2,0,0,0,0,3,null,null,null,null,null,3747]
[3747,"A","Other","Regional","204 VIC Rural - Wodonga & North East","Nonmetro","F Pop <= 500",null,null,4625,222.8,null,null,null,"Refer to Distribution Partner",21.666666666666668,null,2,2,0,0,0,0,3,null,null,null,null,null,3749]
[3749,"A","Other","Regional","204 VIC Rural - Wodonga & North East","Nonmetro","E Pop > 500",null,null,1888,235.9,null,null,null,"Refer to Distribution Partner",21.666666666666668,null,2,2,0,0,0,0,3,null,null,null,null,null,3750]
[3750,"A","Other","Metro","209 VIC Metro - Greensborough","Metro","E Pop > 500",1,null,9060,23.2,null,null,null,"Non Metro",66.666666666666671,null,3,3,0,3,1,3,3,null,null,null,null,null,3751]
[3751,"A","Other","Metro","209 VIC Metro - Greensborough","Metro","F Pop <= 500",1,null,277,30.2,null,null,null,"Non Metro",56.666666666666679,null,3,3,0,3,0,2,3,null,null,null,null,null,3752]
[3752,"A","Metro","Metro","209 VIC Metro - Greensborough","Metro","A Metro",1,null,24060,22.6,null,null,null,"Metro",93.333333333333329,null,3,3,3,3,2,3,3,null,null,null,null,null,3753]
[3753,"A","Regional","Metro","209 VIC Metro - Greensborough","Metro","B Regional",1,null,2330,37.4,null,null,null,"Non Metro",70,null,3,3,2,3,0,2,3,null,null,null,null,null,3754]
[3754,"A","Metro","Metro","209 VIC Metro - Greensborough","Metro","A Metro",1,null,37757,27.2,null,null,null,"Metro",90,null,3,3,3,3,2,2,3,null,null,null,null,null,3755]
[3755,"A","Metro","Metro","209 VIC Metro - Greensborough","Metro","A Metro",1,null,252,0,null,null,null,"Non Metro",70,null,3,3,3,3,0,0,3,null,null,null,null,null,3756]
[3756,"A","Regional","Metro","209 VIC Metro - Greensborough","Metro","B Regional",2,null,11926,44.9,null,null,null,"Metro",76.666666666666657,null,3,3,2,2,2,2,3,null,null,null,null,null,3757]
[3757,"A","Regional","Metro","209 VIC Metro - Greensborough","Metro","B Regional",2,null,8959,38.5,null,null,null,"Non Metro",70,null,3,3,2,2,1,2,3,null,null,null,null,null,3758]
[3758,"A","Other","Metro","209 VIC Metro - Greensborough","Metro","D Pop > 2,000",3,null,2181,50.6,null,null,null,"Regional",46.666666666666664,null,3,3,1,1,0,1,3,null,null,null,null,null,3759]
[3759,"A","Metro","Metro","209 VIC Metro - Greensborough","Metro","A Metro",2,null,1062,30.9,null,null,null,"Non Metro",70,null,3,3,3,2,0,2,3,null,null,null,null,null,3760]
[3760,"A","Other","Metro","209 VIC Metro - Greensborough","Metro","F Pop <= 500",null,null,369,0,null,null,null,"Refer to Distribution Partner",30,null,3,3,0,0,0,0,3,null,null,null,null,null,3761]
[3761,"A","Metro","Metro","209 VIC Metro - Greensborough","Metro","A Metro",2,null,1226,36.5,null,null,null,"Non Metro",70,null,3,3,3,2,0,2,3,null,null,null,null,null,3762]
[3762,"A","Other","Metro","209 VIC Metro - Greensborough","Metro","E Pop > 500",null,null,131,0,null,null,null,"Refer to Distribution Partner",30,null,3,3,0,0,0,0,3,null,null,null,null,null,3763]
[3763,"A","Other","Metro","209 VIC Metro - Greensborough","Metro","E Pop > 500",null,null,1536,47.1,null,null,null,"Refer to Distribution Partner",36.666666666666664,null,3,3,0,0,0,2,3,null,null,null,null,null,3764]
[3764,"A","Metro","Metro","204 VIC Rural - Wodonga & North East","Metro","A Metro",3,null,9165,57.4,null,null,null,"Non Metro",65,null,2,3,3,1,1,1,3,null,null,null,null,null,3765]
[3765,"A","Metro","Metro","211 VIC Metro - Lilydale","Metro","A Metro",1,null,6761,33.6,null,null,null,"Metro",83.333333333333343,null,3,3,3,3,1,2,3,null,null,null,null,null,3766]
[3766,"A","Metro","Metro","211 VIC Metro - Lilydale","Metro","A Metro",1,null,1239,36,null,null,null,"Metro",76.666666666666671,null,3,3,3,3,0,2,3,null,null,null,null,null,3767]
[3767,"A","Metro","Metro","211 VIC Metro - Lilydale","Metro","A Metro",1,null,1251,34.700000000000003,null,null,null,"Metro",76.666666666666671,null,3,3,3,3,0,2,3,null,null,null,null,null,3770]
[3770,"A","Metro","Metro","211 VIC Metro - Lilydale","Metro","A Metro",2,null,3218,39.5,null,null,null,"Non Metro",70,null,3,3,3,2,0,2,3,null,null,null,null,null,3775]
[3775,"A","Regional","Metro","211 VIC Metro - Lilydale","Metro","B Regional",2,null,3861,40.799999999999997,null,null,null,"Non Metro",63.333333333333329,null,3,3,2,2,0,2,3,null,null,null,null,null,3777]
[3777,"A","Regional","Metro","211 VIC Metro - Lilydale","Metro","B Regional",2,null,10751,52.4,null,null,null,{"$f":"IF(ISBLANK(N1218),IF(AND(H1218<>\"\",IF(I1218=\"High Density\",\"High Density\",IF(AND(P1218<=45,P1218>0),\"Refer to Distribution Partner\",IF(AND(P1218<=55,P1218>45),\"Regional\",IF(AND(P1218>55,P1218<=70),\"Non Metro\",IF(F1218=\"Nonmetro\",\"Non Metro\",IF(P1218>70,\"Metro\",\"\"))))))=\"Refer to Distribution Partner\"),\"Regional\",IF(I1218=\"High Density\",\"High Density\",IF(AND(P1218<=45,P1218>0),\"Refer to Distribution Partner\",IF(AND(P1218<=55,P1218>45),\"Regional\",IF(AND(P1218>55,P1218<=70),\"Non Metro\",IF(F1218=\"Nonmetro\",\"Non Metro\",IF(P1218>70,\"Metro\",\"\"))))))),N1218)","v":"Metro"},{"$f":"(R1218/$AB$3*$AA$3+S1218/$AB$4*$AA$4+T1218/$AB$5*$AA$5+U1218/$AB$6*$AA$6+V1218/$AB$7*$AA$7+W1218/$AB$8*$AA$8+X1218/$AB$9*$AA$9)*100","v":73.333333333333329},null,{"$f":"IF(ISNUMBER(SEARCH(\"Metro\",E1218)),3,IF(ISNUMBER(SEARCH(\"Rural\",E1218)),2,1))","v":3},{"$f":"IF(ISNUMBER(FIND(\"Metro\",F1218)),3,IF(ISNUMBER(FIND(\"Nonmetro\",F1218)),2,3))","v":3},{"$f":"IF(G1218=\"A Metro\",3,IF(G1218=\"B Regional\",2,IF(G1218=\"C Pop > 7,000\",1,IF(G1218=\"D Pop > 2,000\",1,0))))","v":2},{"$f":"IF(H1218=1,3,IF(H1218=2,2,IF(H1218=3,1,0)))","v":2},{"$f":"IF(J1218>=100000,3,IF(AND(J1218>=10000,J1218<100000),2,IF(AND(J1218>=5000,J1218<10000),1,0)))","v":2},{"$f":"IF(AND(K1218>=0.1,K1218<25),3,IF(AND(K1218>=25,K1218<50),2,IF(AND(K1218>=50,K1218<150),1,0)))","v":1},{"$f":"IF(L1218=\"\",3,0)","v":3},null,null,null,null,null,3778]
[3778,"A","Other","Metro","204 VIC Rural - Wodonga & North East","Metro","F Pop <= 500",null,null,205,0,null,null,null,"Refer to Distribution Partner",28.333333333333332,null,2,3,0,0,0,0,3,null,null,null,null,null,3779]
[3779,"A","Other","Metro","204 VIC Rural - Wodonga & North East","Metro","F Pop <= 500",null,null,394,76.5,null,null,null,"Refer to Distribution Partner",31.666666666666664,null,2,3,0,0,0,1,3,null,null,null,null,null,3781]
[3781,"A","Metro","Metro","212 VIC Metro - Dandenong","Metro","A Metro",1,null,4477,48.7,null,null,null,"Metro",76.666666666666671,null,3,3,3,3,0,2,3,null,null,null,null,null,3782]
[3782,"A","Other","Metro","212 VIC Metro - Dandenong","Metro","C Pop > 7,000",1,null,7827,44.6,null,null,null,"Non Metro",70,null,3,3,1,3,1,2,3,null,null,null,null,null,3783]
[3783,"A","Metro","Metro","212 VIC Metro - Dandenong","Metro","A Metro",1,null,2350,54.2,null,null,null,"Metro",73.333333333333343,null,3,3,3,3,0,1,3,null,null,null,null,null,3785]
[3785,"A","Metro","Metro","211 VIC Metro - Lilydale","Metro","A Metro",1,null,77,0,null,null,null,"Non Metro",70,null,3,3,3,3,0,0,3,null,null,null,null,null,3786]
[3786,"A","Metro","Metro","211 VIC Metro - Lilydale","Metro","A Metro",1,null,1518,33.6,null,null,null,"Metro",76.666666666666671,null,3,3,3,3,0,2,3,null,null,null,null,null,3787]
[3787,"A","Metro","Metro","211 VIC Metro - Lilydale","Metro","A Metro",1,null,1062,34.6,null,null,null,"Metro",76.666666666666671,null,3,3,3,3,0,2,3,null,null,null,null,null,3788]
[3788,"A","Metro","Metro","211 VIC Metro - Lilydale","Metro","A Metro",1,null,1738,36.299999999999997,null,null,null,"Metro",76.666666666666671,null,3,3,3,3,0,2,3,null,null,null,null,null,3789]
[3789,"A","Metro","Metro","211 VIC Metro - Lilydale","Metro","A Metro",1,null,265,0,null,null,null,"Non Metro",70,null,3,3,3,3,0,0,3,null,null,null,null,null,3791]
[3791,"A","Metro","Metro","211 VIC Metro - Lilydale","Metro","A Metro",1,null,1437,37.799999999999997,null,null,null,"Metro",76.666666666666671,null,3,3,3,3,0,2,3,null,null,null,null,null,3792]
[3792,"A","Metro","Metro","211 VIC Metro - Lilydale","Metro","A Metro",1,null,1065,38.700000000000003,null,null,null,"Metro",76.666666666666671,null,3,3,3,3,0,2,3,null,null,null,null,null,3793]
[3793,"A","Metro","Metro","211 VIC Metro - Lilydale","Metro","A Metro",1,null,3577,40.299999999999997,null,null,null,"Metro",76.666666666666671,null,3,3,3,3,0,2,3,null,null,null,null,null,3795]
[3795,"A","Metro","Metro","211 VIC Metro - Lilydale","Metro","A Metro",1,null,1246,41.5,null,null,null,"Metro",76.666666666666671,null,3,3,3,3,0,2,3,null,null,null,null,null,3796]
[3796,"A","Metro","Metro","211 VIC Metro - Lilydale","Metro","A Metro",1,null,9702,36.700000000000003,null,null,null,"Metro",83.333333333333343,null,3,3,3,3,1,2,3,null,null,null,null,null,3797]
[3797,"A","Other","Metro","211 VIC Metro - Lilydale","Metro","D Pop > 2,000",null,null,3476,58,null,null,"Regional","Regional",40,null,3,3,1,0,0,1,3,null,null,null,null,null,3799]
[3799,"A","Regional","Metro","211 VIC Metro - Lilydale","Metro","B Regional",null,null,5798,64.2,null,null,null,"Regional",53.333333333333336,null,3,3,2,0,1,1,3,null,null,null,null,null,3800]
[3800,"A","Other","Metro","212 VIC Metro - Dandenong","Metro","E Pop > 500",null,null,2211,0,null,null,null,"Refer to Distribution Partner",30,null,3,3,0,0,0,0,3,null,null,null,null,null,3802]
[3802,"A","Metro","Metro","212 VIC Metro - Dandenong","Metro","A Metro",1,null,24298,31.8,null,null,null,"Metro",90,null,3,3,3,3,2,2,3,null,null,null,null,null,3803]
[3803,"A","Metro","Metro","212 VIC Metro - Dandenong","Metro","A Metro",1,null,10855,34.6,null,null,null,"Metro",90,null,3,3,3,3,2,2,3,null,null,null,null,null,3804]
[3804,"A","Metro","Metro","212 VIC Metro - Dandenong","Metro","A Metro",1,null,8094,36.4,null,null,null,"Metro",83.333333333333343,null,3,3,3,3,1,2,3,null,null,null,null,null,3805]
[3805,"A","Metro","Metro","212 VIC Metro - Dandenong","Metro","A Metro",1,null,56933,39,null,null,null,"Metro",90,null,3,3,3,3,2,2,3,null,null,null,null,null,3806]
[3806,"A","Metro","Metro","212 VIC Metro - Dandenong","Metro","A Metro",1,null,48520,41.8,null,null,null,"Metro",90,null,3,3,3,3,2,2,3,null,null,null,null,null,3807]
[3807,"A","Metro","Metro","212 VIC Metro - Dandenong","Metro","A Metro",1,null,7097,44.8,null,null,null,"Metro",83.333333333333343,null,3,3,3,3,1,2,3,null,null,null,null,null,3808]
[3808,"A","Metro","Metro","212 VIC Metro - Dandenong","Metro","A Metro",1,null,3033,45.3,null,null,null,"Metro",76.666666666666671,null,3,3,3,3,0,2,3,null,null,null,null,null,3809]
[3809,"A","Metro","Metro","212 VIC Metro - Dandenong","Metro","A Metro",1,null,7210,48.9,null,null,null,"Metro",83.333333333333343,null,3,3,3,3,1,2,3,null,null,null,null,null,3810]
[3810,"A","Metro","Metro","212 VIC Metro - Dandenong","Metro","A Metro",1,null,47894,53.4,null,null,null,"Metro",86.666666666666671,null,3,3,3,3,2,1,3,null,null,null,null,null,3812]
[3812,"A","Other","Regional","212 VIC Metro - Dandenong","Nonmetro","D Pop > 2,000",1,null,2312,60.2,null,null,"Non Metro","Non Metro",53.333333333333336,null,3,2,1,3,0,1,3,null,null,null,null,null,3813]
[3813,"A","Other","Regional","212 VIC Metro - Dandenong","Nonmetro","E Pop > 500",null,null,886,0,null,null,null,"Refer to Distribution Partner",23.333333333333332,null,3,2,0,0,0,0,3,null,null,null,null,null,3814]
[3814,"A","Other","Regional","212 VIC Metro - Dandenong","Nonmetro","E Pop > 500",3,null,2255,69.7,null,null,"Regional","Regional",33.333333333333329,null,3,2,0,1,0,1,3,null,null,null,null,null,3815]
[3815,"A","Other","Regional","212 VIC Metro - Dandenong","Nonmetro","D Pop > 2,000",3,null,3022,73.099999999999994,null,null,"Regional","Regional",40,null,3,2,1,1,0,1,3,null,null,null,null,null,3816]
[3816,"A","Other","Regional","205 VIC Rural - Gippsland","Nonmetro","E Pop > 500",3,null,2721,77.8,null,null,"Regional","Regional",31.666666666666664,null,2,2,0,1,0,1,3,null,null,null,null,null,3818]
[3818,"A","Other","Regional","205 VIC Rural - Gippsland","Nonmetro","C Pop > 7,000",3,null,14167,86,null,null,null,"Regional",51.666666666666671,null,2,2,1,1,2,1,3,null,null,null,null,null,3820]
[3820,"A","Regional","Regional","205 VIC Rural - Gippsland","Nonmetro","B Regional",3,null,15952,93.2,null,null,"Non Metro","Non Metro",58.333333333333336,null,2,2,2,1,2,1,3,null,null,null,null,null,3821]
[3821,"A","Other","Regional","205 VIC Rural - Gippsland","Nonmetro","D Pop > 2,000",null,null,2917,94.5,null,null,null,"Refer to Distribution Partner",31.666666666666664,null,2,2,1,0,0,1,3,null,null,null,null,null,3822]
[3822,"A","Other","Regional","205 VIC Rural - Gippsland","Nonmetro","E Pop > 500",null,null,985,0,null,null,null,"Refer to Distribution Partner",21.666666666666668,null,2,2,0,0,0,0,3,null,null,null,null,null,3823]
[3823,"A","Other","Regional","205 VIC Rural - Gippsland","Nonmetro","E Pop > 500",3,null,1838,105.8,null,null,"Regional","Regional",31.666666666666664,null,2,2,0,1,0,1,3,null,null,null,null,null,3824]
[3824,"A","Other","Regional","205 VIC Rural - Gippsland","Nonmetro","D Pop > 2,000",3,null,5004,113.8,null,null,null,"Regional",44.999999999999993,null,2,2,1,1,1,1,3,null,null,null,null,null,3825]
[3825,"A","Regional","Regional","205 VIC Rural - Gippsland","Nonmetro","B Regional",3,null,20281,122.2,null,null,null,"Non Metro",58.333333333333336,null,2,2,2,1,2,1,3,null,null,null,null,null,3831]
[3831,"A","Other","Regional","205 VIC Rural - Gippsland","Nonmetro","E Pop > 500",null,null,1702,90.3,null,null,null,"Refer to Distribution Partner",25,null,2,2,0,0,0,1,3,null,null,null,null,null,3832]
[3832,"A","Other","Regional","205 VIC Rural - Gippsland","Nonmetro","F Pop <= 500",null,null,247,0,null,null,null,"Refer to Distribution Partner",21.666666666666668,null,2,2,0,0,0,0,3,null,null,null,null,null,3833]
[3833,"A","Other","Regional","205 VIC Rural - Gippsland","Nonmetro","F Pop <= 500",null,null,307,0,null,null,null,"Refer to Distribution Partner",21.666666666666668,null,2,2,0,0,0,0,3,null,null,null,null,null,3835]
[3835,"A","Other","Regional","205 VIC Rural - Gippsland","Nonmetro","E Pop > 500",null,null,471,0,null,null,null,"Refer to Distribution Partner",21.666666666666668,null,2,2,0,0,0,0,3,null,null,null,null,null,3840]
[3840,"A","Regional","Regional","205 VIC Rural - Gippsland","Nonmetro","B Regional",2,null,16476,135.6,null,null,null,"Non Metro",65,null,2,2,2,2,2,1,3,null,null,null,null,null,3842]
[3842,"A","Other","Regional","205 VIC Rural - Gippsland","Nonmetro","D Pop > 2,000",2,null,4783,138.80000000000001,null,null,null,"Regional",45,null,2,2,1,2,0,1,3,null,null,null,null,null,3844]
[3844,"A","Regional","Regional","205 VIC Rural - Gippsland","Nonmetro","B Regional",2,null,28980,144.19999999999999,null,null,null,"Non Metro",65,null,2,2,2,2,2,1,3,null,null,null,null,null,3847]
[3847,"A","Other","Regional","205 VIC Rural - Gippsland","Nonmetro","D Pop > 2,000",null,null,2191,163.9,null,null,null,"Refer to Distribution Partner",28.333333333333332,null,2,2,1,0,0,0,3,null,null,null,null,null,3850]
[3850,"A","Regional","Regional","205 VIC Rural - Gippsland","Nonmetro","B Regional",3,null,14779,187.8,null,null,null,"Regional",55.000000000000007,null,2,2,2,1,2,0,3,null,null,null,null,null,3851]
[3851,"A","Other","Regional","205 VIC Rural - Gippsland","Nonmetro","D Pop > 2,000",null,null,5687,218.4,null,null,null,"Refer to Distribution Partner",35,null,2,2,1,0,1,0,3,null,null,null,null,null,3852]
[3852,"A","Other","Regional","205 VIC Rural - Gippsland","Nonmetro","F Pop <= 500",null,null,93,0,null,null,null,"Refer to Distribution Partner",21.666666666666668,null,2,2,0,0,0,0,3,null,null,null,null,null,3854]
[3854,"A","Other","Regional","205 VIC Rural - Gippsland","Nonmetro","E Pop > 500",null,null,1397,0,null,null,null,"Refer to Distribution Partner",21.666666666666668,null,2,2,0,0,0,0,3,null,null,null,null,null,3856]
[3856,"A","Other","Regional","205 VIC Rural - Gippsland","Nonmetro","E Pop > 500",null,null,989,148.19999999999999,null,null,null,"Refer to Distribution Partner",25,null,2,2,0,0,0,1,3,null,null,null,null,null,3857]
[3857,"A","Other","Regional","205 VIC Rural - Gippsland","Nonmetro","F Pop <= 500",null,null,364,0,null,null,null,"Refer to Distribution Partner",21.666666666666668,null,2,2,0,0,0,0,3,null,null,null,null,null,3858]
[3858,"A","Other","Regional","205 VIC Rural - Gippsland","Nonmetro","D Pop > 2,000",null,null,3025,160.4,null,null,null,"Refer to Distribution Partner",28.333333333333332,null,2,2,1,0,0,0,3,null,null,null,null,null,3859]
[3859,"A","Other","Regional","205 VIC Rural - Gippsland","Nonmetro","E Pop > 500",null,null,834,169.4,null,null,null,"Refer to Distribution Partner",21.666666666666668,null,2,2,0,0,0,0,3,null,null,null,null,null,3860]
[3860,"A","Other","Regional","205 VIC Rural - Gippsland","Nonmetro","D Pop > 2,000",null,null,7172,177.9,null,null,null,"Refer to Distribution Partner",35,null,2,2,1,0,1,0,3,null,null,null,null,null,3862]
[3862,"A","Other","Regional","205 VIC Rural - Gippsland","Nonmetro","D Pop > 2,000",null,null,3156,187.4,null,null,null,"Refer to Distribution Partner",28.333333333333332,null,2,2,1,0,0,0,3,null,null,null,null,null,3864]
[3864,"A","Other","Regional","205 VIC Rural - Gippsland","Nonmetro","F Pop <= 500",null,null,217,0,null,null,null,"Refer to Distribution Partner",21.666666666666668,null,2,2,0,0,0,0,3,null,null,null,null,null,3865]
[3865,"A","Other","Regional","205 VIC Rural - Gippsland","Nonmetro","F Pop <= 500",null,null,449,218.8,null,null,null,"Refer to Distribution Partner",21.666666666666668,null,2,2,0,0,0,0,3,null,null,null,null,null,3869]
[3869,"A","Other","Regional","205 VIC Rural - Gippsland","Nonmetro","E Pop > 500",null,null,1626,133.9,null,null,null,"Refer to Distribution Partner",25,null,2,2,0,0,0,1,3,null,null,null,null,null,3870]
[3870,"A","Other","Regional","205 VIC Rural - Gippsland","Nonmetro","E Pop > 500",null,null,1271,131.19999999999999,null,null,null,"Refer to Distribution Partner",25,null,2,2,0,0,0,1,3,null,null,null,null,null,3871]
[3871,"A","Other","Regional","205 VIC Rural - Gippsland","Nonmetro","D Pop > 2,000",null,null,2902,123.1,null,null,null,"Refer to Distribution Partner",31.666666666666664,null,2,2,1,0,0,1,3,null,null,null,null,null,3873]
[3873,"A","Other","Regional","205 VIC Rural - Gippsland","Nonmetro","F Pop <= 500",null,null,321,0,null,null,null,"Refer to Distribution Partner",21.666666666666668,null,2,2,0,0,0,0,3,null,null,null,null,null,3874]
[3874,"A","Other","Regional","205 VIC Rural - Gippsland","Nonmetro","F Pop <= 500",null,null,558,191.1,null,null,null,{"$f":"IF(ISBLANK(N1282),IF(AND(H1282<>\"\",IF(I1282=\"High Density\",\"High Density\",IF(AND(P1282<=45,P1282>0),\"Refer to Distribution Partner\",IF(AND(P1282<=55,P1282>45),\"Regional\",IF(AND(P1282>55,P1282<=70),\"Non Metro\",IF(F1282=\"Nonmetro\",\"Non Metro\",IF(P1282>70,\"Metro\",\"\"))))))=\"Refer to Distribution Partner\"),\"Regional\",IF(I1282=\"High Density\",\"High Density\",IF(AND(P1282<=45,P1282>0),\"Refer to Distribution Partner\",IF(AND(P1282<=55,P1282>45),\"Regional\",IF(AND(P1282>55,P1282<=70),\"Non Metro\",IF(F1282=\"Nonmetro\",\"Non Metro\",IF(P1282>70,\"Metro\",\"\"))))))),N1282)","v":"Refer to Distribution Partner"},{"$f":"(R1282/$AB$3*$AA$3+S1282/$AB$4*$AA$4+T1282/$AB$5*$AA$5+U1282/$AB$6*$AA$6+V1282/$AB$7*$AA$7+W1282/$AB$8*$AA$8+X1282/$AB$9*$AA$9)*100","v":21.666666666666668},null,{"$f":"IF(ISNUMBER(SEARCH(\"Metro\",E1282)),3,IF(ISNUMBER(SEARCH(\"Rural\",E1282)),2,1))","v":2},{"$f":"IF(ISNUMBER(FIND(\"Metro\",F1282)),3,IF(ISNUMBER(FIND(\"Nonmetro\",F1282)),2,3))","v":2},{"$f":"IF(G1282=\"A Metro\",3,IF(G1282=\"B Regional\",2,IF(G1282=\"C Pop > 7,000\",1,IF(G1282=\"D Pop > 2,000\",1,0))))","v":0},{"$f":"IF(H1282=1,3,IF(H1282=2,2,IF(H1282=3,1,0)))","v":0},{"$f":"IF(J1282>=100000,3,IF(AND(J1282>=10000,J1282<100000),2,IF(AND(J1282>=5000,J1282<10000),1,0)))","v":0},{"$f":"IF(AND(K1282>=0.1,K1282<25),3,IF(AND(K1282>=25,K1282<50),2,IF(AND(K1282>=50,K1282<150),1,0)))","v":0},{"$f":"IF(L1282=\"\",3,0)","v":3},null,null,null,null,null,3875]
[3875,"A","Regional","Regional","205 VIC Rural - Gippsland","Nonmetro","B Regional",3,null,18625,233.7,null,null,null,"Regional",55.000000000000007,null,2,2,2,1,2,0,3,null,null,null,null,null,3878]
[3878,"A","Other","Regional","205 VIC Rural - Gippsland","Nonmetro","E Pop > 500",null,null,1094,239.4,null,null,null,"Refer to Distribution Partner",21.666666666666668,null,2,2,0,0,0,0,3,null,null,null,null,null,3880]
[3880,"A","Other","Regional","205 VIC Rural - Gippsland","Nonmetro","D Pop > 2,000",3,null,4032,242.2,null,null,"Regional","Regional",35,null,2,2,1,1,0,0,3,null,null,null,null,null,3882]
[3882,"A","Other","Regional","205 VIC Rural - Gippsland","Nonmetro","E Pop > 500",null,null,1095,244.6,null,null,null,"Refer to Distribution Partner",21.666666666666668,null,2,2,0,0,0,0,3,null,null,null,null,null,3885]
[3885,"A","Other","Regional","205 VIC Rural - Gippsland","Nonmetro","E Pop > 500",null,null,1871,259,null,null,null,"Refer to Distribution Partner",21.666666666666668,null,2,2,0,0,0,0,3,null,null,null,null,null,3886]
[3886,"A","Other","Regional","205 VIC Rural - Gippsland","Nonmetro","F Pop <= 500",null,null,389,305.3,null,null,null,"Refer to Distribution Partner",21.666666666666668,null,2,2,0,0,0,0,3,null,null,null,null,null,3887]
[3887,"A","Other","Regional","205 VIC Rural - Gippsland","Nonmetro","F Pop <= 500",null,null,342,0,null,null,null,"Refer to Distribution Partner",21.666666666666668,null,2,2,0,0,0,0,3,null,null,null,null,null,3888]
[3888,"A","Other","Regional","205 VIC Rural - Gippsland","Nonmetro","D Pop > 2,000",null,null,3426,309.2,null,null,null,"Refer to Distribution Partner",28.333333333333332,null,2,2,1,0,0,0,3,null,null,null,null,null,3889]
[3889,"A","Other","Regional","205 VIC Rural - Gippsland","Nonmetro","F Pop <= 500",null,null,184,339.3,null,null,null,"Refer to Distribution Partner",21.666666666666668,null,2,2,0,0,0,0,3,null,null,null,null,null,3890]
[3890,"A","Other","Regional","205 VIC Rural - Gippsland","Nonmetro","F Pop <= 500",null,null,324,0,null,null,null,"Refer to Distribution Partner",21.666666666666668,null,2,2,0,0,0,0,3,null,null,null,null,null,3891]
[3891,"A","Other","Regional","205 VIC Rural - Gippsland","Nonmetro","F Pop <= 500",null,null,106,0,null,null,null,"Refer to Distribution Partner",21.666666666666668,null,2,2,0,0,0,0,3,null,null,null,null,null,3892]
[3892,"A","Other","Regional","205 VIC Rural - Gippsland","Nonmetro","E Pop > 500",null,null,1063,422.4,null,null,null,"Refer to Distribution Partner",21.666666666666668,null,2,2,0,0,0,0,3,null,null,null,null,null,3893]
[3893,"A","Other","Regional","205 VIC Rural - Gippsland","Nonmetro","F Pop <= 500",null,null,23,0,null,null,null,"Refer to Distribution Partner",21.666666666666668,null,2,2,0,0,0,0,3,null,null,null,null,null,3895]
[3895,"A","Other","Regional","205 VIC Rural - Gippsland","Nonmetro","D Pop > 2,000",null,null,193,0,null,null,null,"Refer to Distribution Partner",28.333333333333332,null,2,2,1,0,0,0,3,null,null,null,null,null,3896]
[3896,"A","Other","Regional","205 VIC Rural - Gippsland","Nonmetro","F Pop <= 500",null,null,406,0,null,null,null,"Refer to Distribution Partner",21.666666666666668,null,2,2,0,0,0,0,3,null,null,null,null,null,3898]
[3898,"A","Other","Regional","205 VIC Rural - Gippsland","Nonmetro","E Pop > 500",null,null,790,228.9,null,null,null,"Refer to Distribution Partner",21.666666666666668,null,2,2,0,0,0,0,3,null,null,null,null,null,3900]
[3900,"A","Other","Regional","205 VIC Rural - Gippsland","Nonmetro","F Pop <= 500",null,null,149,0,null,null,null,"Refer to Distribution Partner",21.666666666666668,null,2,2,0,0,0,0,3,null,null,null,null,null,3902]
[3902,"A","Other","Regional","205 VIC Rural - Gippsland","Nonmetro","F Pop <= 500",null,null,408,0,null,null,null,"Refer to Distribution Partner",21.666666666666668,null,2,2,0,0,0,0,3,null,null,null,null,null,3903]
[3903,"A","Other","Regional","205 VIC Rural - Gippsland","Nonmetro","E Pop > 500",null,null,751,254.6,null,null,null,"Refer to Distribution Partner",21.666666666666668,null,2,2,0,0,0,0,3,null,null,null,null,null,3904]
[3904,"A","Other","Regional","205 VIC Rural - Gippsland","Nonmetro","E Pop > 500",null,null,1449,253,null,null,null,"Refer to Distribution Partner",21.666666666666668,null,2,2,0,0,0,0,3,null,null,null,null,null,3909]
[3909,"A","Other","Regional","205 VIC Rural - Gippsland","Nonmetro","C Pop > 7,000",3,null,7901,267.2,null,null,null,"Regional",41.666666666666664,null,2,2,1,1,1,0,3,null,null,null,null,null,3910]
[3910,"A","Metro","Metro","214 VIC Metro - Mornington Peninsula","Metro","A Metro",1,null,22588,42.9,null,null,null,"Metro",90,null,3,3,3,3,2,2,3,null,null,null,null,null,3911]
[3911,"A","Metro","Metro","214 VIC Metro - Mornington Peninsula","Metro","A Metro",null,null,2414,45.9,null,null,null,"Non Metro",56.666666666666679,null,3,3,3,0,0,2,3,null,null,null,null,null,3912]
[3912,"A","Metro","Metro","214 VIC Metro - Mornington Peninsula","Metro","A Metro",null,null,15157,49.6,null,null,null,"Non Metro",70,null,3,3,3,0,2,2,3,null,null,null,null,null,3913]
[3913,"A","Metro","Metro","214 VIC Metro - Mornington Peninsula","Metro","A Metro",null,null,3338,53.3,null,null,"Metro","Metro",53.333333333333336,null,3,3,3,0,0,1,3,null,null,null,null,null,3915]
[3915,"A","Regional","Metro","214 VIC Metro - Mornington Peninsula","Metro","B Regional",null,null,9960,58.2,null,null,null,"Regional",53.333333333333336,null,3,3,2,0,1,1,3,null,null,null,null,null,3916]
[3916,"A","Regional","Metro","214 VIC Metro - Mornington Peninsula","Metro","B Regional",null,null,955,67.8,null,null,null,"Regional",46.666666666666664,null,3,3,2,0,0,1,3,null,null,null,null,null,3918]
[3918,"A","Regional","Metro","214 VIC Metro - Mornington Peninsula","Metro","B Regional",null,null,3705,61.4,null,null,null,"Regional",46.666666666666664,null,3,3,2,0,0,1,3,null,null,null,null,null,3919]
[3919,"A","Regional","Metro","214 VIC Metro - Mornington Peninsula","Metro","B Regional",null,null,3183,64.099999999999994,null,null,null,"Regional",46.666666666666664,null,3,3,2,0,0,1,3,null,null,null,null,null,3920]
[3920,"A","Regional","Metro","214 VIC Metro - Mornington Peninsula","Metro","B Regional",1,null,1040,0,null,null,null,"Non Metro",63.333333333333329,null,3,3,2,3,0,0,3,null,null,null,null,null,3921]
[3921,"A","Regional","Regional","205 VIC Rural - Gippsland","Nonmetro","B Regional",null,null,119,0,null,null,null,"Refer to Distribution Partner",35,null,2,2,2,0,0,0,3,null,null,null,null,null,3922]
[3922,"A","Regional","Regional","205 VIC Rural - Gippsland","Nonmetro","B Regional",3,null,7738,76.8,null,null,null,"Regional",51.666666666666657,null,2,2,2,1,1,1,3,null,null,null,null,null,3923]
[3923,"A","Other","Regional","205 VIC Rural - Gippsland","Nonmetro","E Pop > 500",null,null,519,78.2,null,null,null,"Refer to Distribution Partner",25,null,2,2,0,0,0,1,3,null,null,null,null,null,3925]
[3925,"A","Other","Regional","205 VIC Rural - Gippsland","Nonmetro","D Pop > 2,000",null,null,3384,86.3,null,null,"Regional","Regional",31.666666666666664,null,2,2,1,0,0,1,3,null,null,null,null,null,3926]
[3926,"A","Metro","Metro","214 VIC Metro - Mornington Peninsula","Metro","A Metro",1,null,3242,64.099999999999994,null,null,null,"Metro",73.333333333333343,null,3,3,3,3,0,1,3,null,null,null,null,null,3927]
[3927,"A","Metro","Metro","214 VIC Metro - Mornington Peninsula","Metro","A Metro",1,null,1667,66.8,null,null,null,"Metro",73.333333333333343,null,3,3,3,3,0,1,3,null,null,null,null,null,3928]
[3928,"A","Metro","Metro","214 VIC Metro - Mornington Peninsula","Metro","A Metro",1,null,416,0,null,null,null,"Non Metro",70,null,3,3,3,3,0,0,3,null,null,null,null,null,3929]
[3929,"A","Metro","Metro","214 VIC Metro - Mornington Peninsula","Metro","A Metro",1,null,905,72.900000000000006,null,null,null,"Metro",73.333333333333343,null,3,3,3,3,0,1,3,null,null,null,null,null,3930]
[3930,"A","Metro","Metro","214 VIC Metro - Mornington Peninsula","Metro","A Metro",1,null,17888,43.4,null,null,null,"Metro",90,null,3,3,3,3,2,2,3,null,null,null,null,null,3931]
[3931,"A","Metro","Metro","214 VIC Metro - Mornington Peninsula","Metro","A Metro",1,null,23989,47.1,null,null,null,"Metro",90,null,3,3,3,3,2,2,3,null,null,null,null,null,3933]
[3933,"A","Metro","Metro","214 VIC Metro - Mornington Peninsula","Metro","A Metro",1,null,1098,0,null,null,null,"Non Metro",70,null,3,3,3,3,0,0,3,null,null,null,null,null,3934]
[3934,"A","Metro","Metro","214 VIC Metro - Mornington Peninsula","Metro","A Metro",1,null,18548,51.1,null,null,null,"Metro",86.666666666666671,null,3,3,3,3,2,1,3,null,null,null,null,null,3936]
[3936,"A","Metro","Metro","214 VIC Metro - Mornington Peninsula","Metro","A Metro",1,null,11024,57.3,null,null,null,"Metro",86.666666666666671,null,3,3,3,3,2,1,3,null,null,null,null,null,3937]
[3937,"A","Metro","Metro","214 VIC Metro - Mornington Peninsula","Metro","A Metro",1,null,1524,63.3,null,null,null,"Metro",73.333333333333343,null,3,3,3,3,0,1,3,null,null,null,null,null,3938]
[3938,"A","Metro","Metro","214 VIC Metro - Mornington Peninsula","Metro","A Metro",1,null,2823,60.5,null,null,null,"Metro",73.333333333333343,null,3,3,3,3,0,1,3,null,null,null,null,null,3939]
[3939,"A","Metro","Metro","214 VIC Metro - Mornington Peninsula","Metro","A Metro",1,null,14524,62.9,null,null,null,"Metro",86.666666666666671,null,3,3,3,3,2,1,3,null,null,null,null,null,3940]
[3940,"A","Metro","Metro","214 VIC Metro - Mornington Peninsula","Metro","A Metro",1,null,4930,62.4,null,null,null,"Metro",73.333333333333343,null,3,3,3,3,0,1,3,null,null,null,null,null,3941]
[3941,"A","Metro","Metro","214 VIC Metro - Mornington Peninsula","Metro","A Metro",1,null,12172,64.400000000000006,null,null,null,"Metro",86.666666666666671,null,3,3,3,3,2,1,3,null,null,null,null,null,3942]
[3942,"A","Metro","Metro","214 VIC Metro - Mornington Peninsula","Metro","A Metro",1,null,2313,63.8,null,null,null,"Metro",73.333333333333343,null,3,3,3,3,0,1,3,null,null,null,null,null,3943]
[3943,"A","Metro","Metro","214 VIC Metro - Mornington Peninsula","Metro","A Metro",1,null,1592,62.2,null,null,null,"Metro",73.333333333333343,null,3,3,3,3,0,1,3,null,null,null,null,null,3944]
[3944,"A","Metro","Metro","214 VIC Metro - Mornington Peninsula","Metro","A Metro",1,null,510,61.1,null,null,null,"Metro",73.333333333333343,null,3,3,3,3,0,1,3,null,null,null,null,null,3945]
[3945,"A","Other","Regional","205 VIC Rural - Gippsland","Nonmetro","E Pop > 500",null,null,978,90.2,null,null,null,"Refer to Distribution Partner",25,null,2,2,0,0,0,1,3,null,null,null,null,null,3946]
[3946,"A","Other","Regional","205 VIC Rural - Gippsland","Nonmetro","F Pop <= 500",null,null,209,90.2,null,null,null,"Refer to Distribution Partner",25,null,2,2,0,0,0,1,3,null,null,null,null,null,3950]
[3950,"A","Other","Regional","205 VIC Rural - Gippsland","Nonmetro","D Pop > 2,000",null,null,4800,102.3,null,null,null,"Refer to Distribution Partner",31.666666666666664,null,2,2,1,0,0,1,3,null,null,null,null,null,3951]
[3951,"A","Other","Regional","205 VIC Rural - Gippsland","Nonmetro","E Pop > 500",null,null,1003,102.5,null,null,null,"Refer to Distribution Partner",25,null,2,2,0,0,0,1,3,null,null,null,null,null,3953]
[3953,"A","Other","Regional","205 VIC Rural - Gippsland","Nonmetro","C Pop > 7,000",null,null,7855,114,null,null,"Regional","Regional",38.333333333333329,null,2,2,1,0,1,1,3,null,null,null,null,null,3954]
[3954,"A","Other","Regional","205 VIC Rural - Gippsland","Nonmetro","F Pop <= 500",null,null,404,114,null,null,null,"Refer to Distribution Partner",25,null,2,2,0,0,0,1,3,null,null,null,null,null,3956]
[3956,"A","Other","Regional","205 VIC Rural - Gippsland","Nonmetro","D Pop > 2,000",null,null,2821,124.8,null,null,null,"Refer to Distribution Partner",31.666666666666664,null,2,2,1,0,0,1,3,null,null,null,null,null,3957]
[3957,"A","Other","Regional","205 VIC Rural - Gippsland","Nonmetro","F Pop <= 500",null,null,281,124.8,null,null,null,"Refer to Distribution Partner",25,null,2,2,0,0,0,1,3,null,null,null,null,null,3958]
[3958,"A","Other","Regional","205 VIC Rural - Gippsland","Nonmetro","F Pop <= 500",null,null,272,124.8,null,null,null,"Refer to Distribution Partner",25,null,2,2,0,0,0,1,3,null,null,null,null,null,3959]
[3959,"A","Other","Regional","205 VIC Rural - Gippsland","Nonmetro","E Pop > 500",null,null,1151,148,null,null,null,"Refer to Distribution Partner",25,null,2,2,0,0,0,1,3,null,null,null,null,null,3960]
[3960,"A","Other","Regional","205 VIC Rural - Gippsland","Nonmetro","D Pop > 2,000",null,null,2474,143.9,null,null,null,"Refer to Distribution Partner",31.666666666666664,null,2,2,1,0,0,1,3,null,null,null,null,null,3962]
[3962,"A","Other","Regional","205 VIC Rural - Gippsland","Nonmetro","E Pop > 500",null,null,914,152.1,null,null,null,"Refer to Distribution Partner",21.666666666666668,null,2,2,0,0,0,0,3,null,null,null,null,null,3964]
[3964,"A","Other","Regional","205 VIC Rural - Gippsland","Nonmetro","F Pop <= 500",null,null,134,152.1,null,null,null,{"$f":"IF(ISBLANK(N1346),IF(AND(H1346<>\"\",IF(I1346=\"High Density\",\"High Density\",IF(AND(P1346<=45,P1346>0),\"Refer to Distribution Partner\",IF(AND(P1346<=55,P1346>45),\"Regional\",IF(AND(P1346>55,P1346<=70),\"Non Metro\",IF(F1346=\"Nonmetro\",\"Non Metro\",IF(P1346>70,\"Metro\",\"\"))))))=\"Refer to Distribution Partner\"),\"Regional\",IF(I1346=\"High Density\",\"High Density\",IF(AND(P1346<=45,P1346>0),\"Refer to Distribution Partner\",IF(AND(P1346<=55,P1346>45),\"Regional\",IF(AND(P1346>55,P1346<=70),\"Non Metro\",IF(F1346=\"Nonmetro\",\"Non Metro\",IF(P1346>70,\"Metro\",\"\"))))))),N1346)","v":"Refer to Distribution Partner"},{"$f":"(R1346/$AB$3*$AA$3+S1346/$AB$4*$AA$4+T1346/$AB$5*$AA$5+U1346/$AB$6*$AA$6+V1346/$AB$7*$AA$7+W1346/$AB$8*$AA$8+X1346/$AB$9*$AA$9)*100","v":21.666666666666668},null,{"$f":"IF(ISNUMBER(SEARCH(\"Metro\",E1346)),3,IF(ISNUMBER(SEARCH(\"Rural\",E1346)),2,1))","v":2},{"$f":"IF(ISNUMBER(FIND(\"Metro\",F1346)),3,IF(ISNUMBER(FIND(\"Nonmetro\",F1346)),2,3))","v":2},{"$f":"IF(G1346=\"A Metro\",3,IF(G1346=\"B Regional\",2,IF(G1346=\"C Pop > 7,000\",1,IF(G1346=\"D Pop > 2,000\",1,0))))","v":0},{"$f":"IF(H1346=1,3,IF(H1346=2,2,IF(H1346=3,1,0)))","v":0},{"$f":"IF(J1346>=100000,3,IF(AND(J1346>=10000,J1346<100000),2,IF(AND(J1346>=5000,J1346<10000),1,0)))","v":0},{"$f":"IF(AND(K1346>=0.1,K1346<25),3,IF(AND(K1346>=25,K1346<50),2,IF(AND(K1346>=50,K1346<150),1,0)))","v":0},{"$f":"IF(L1346=\"\",3,0)","v":3},null,null,null,null,null,3965]
[3965,"A","Other","Regional","205 VIC Rural - Gippsland","Nonmetro","F Pop <= 500",null,null,209,163.69999999999999,null,null,null,"Refer to Distribution Partner",21.666666666666668,null,2,2,0,0,0,0,3,null,null,null,null,null,3966]
[3966,"A","Other","Regional","205 VIC Rural - Gippsland","Nonmetro","E Pop > 500",null,null,511,163.69999999999999,null,null,null,"Refer to Distribution Partner",21.666666666666668,null,2,2,0,0,0,0,3,null,null,null,null,null,3967]
[3967,"A","Other","Regional","205 VIC Rural - Gippsland","Nonmetro","F Pop <= 500",null,null,125,163.69999999999999,null,null,null,"Refer to Distribution Partner",21.666666666666668,null,2,2,0,0,0,0,3,null,null,null,null,null,3971]
[3971,"A","Other","Regional","205 VIC Rural - Gippsland","Nonmetro","D Pop > 2,000",null,null,4018,173.7,null,null,null,"Refer to Distribution Partner",28.333333333333332,null,2,2,1,0,0,0,3,null,null,null,null,null,3975]
[3975,"A","Metro","Metro","212 VIC Metro - Dandenong","Metro","A Metro",1,null,15248,37.6,null,null,null,"Metro",90,null,3,3,3,3,2,2,3,null,null,null,null,null,3976]
[3976,"A","Metro","Metro","212 VIC Metro - Dandenong","Metro","A Metro",1,null,25530,36.4,null,null,null,"Metro",90,null,3,3,3,3,2,2,3,null,null,null,null,null,3977]
[3977,"A","Metro","Metro","212 VIC Metro - Dandenong","Metro","A Metro",1,null,93326,42.4,null,null,null,"Metro",90,null,3,3,3,3,2,2,3,null,null,null,null,null,3978]
[3978,"A","Metro","Metro","212 VIC Metro - Dandenong","Metro","A Metro",1,null,10648,46.4,null,null,null,"Metro",90,null,3,3,3,3,2,2,3,null,null,null,null,null,3979]
[3979,"A","Other","Regional","205 VIC Rural - Gippsland","Nonmetro","E Pop > 500",null,null,321,55.6,null,null,null,"Refer to Distribution Partner",25,null,2,2,0,0,0,1,3,null,null,null,null,null,3980]
[3980,"A","Regional","Metro","212 VIC Metro - Dandenong","Metro","B Regional",3,null,3350,55.6,null,null,null,"Regional",53.333333333333336,null,3,3,2,1,0,1,3,null,null,null,null,null,3981]
[3981,"A","Other","Metro","212 VIC Metro - Dandenong","Metro","D Pop > 2,000",3,null,4898,63.6,null,null,null,"Regional",46.666666666666664,null,3,3,1,1,0,1,3,null,null,null,null,null,3984]
[3984,"A","Other","Regional","205 VIC Rural - Gippsland","Nonmetro","D Pop > 2,000",null,null,5209,78.5,null,null,"Regional","Regional",38.333333333333329,null,2,2,1,0,1,1,3,null,null,null,null,null,3987]
[3987,"A","Other","Regional","205 VIC Rural - Gippsland","Nonmetro","E Pop > 500",null,null,1527,84.7,null,null,null,"Refer to Distribution Partner",25,null,2,2,0,0,0,1,3,null,null,null,null,null,3988]
[3988,"A","Other","Regional","205 VIC Rural - Gippsland","Nonmetro","E Pop > 500",null,null,999,91.1,null,null,null,"Refer to Distribution Partner",25,null,2,2,0,0,0,1,3,null,null,null,null,null,3990]
[3990,"A","Other","Regional","205 VIC Rural - Gippsland","Nonmetro","F Pop <= 500",null,null,106,91.1,null,null,null,"Refer to Distribution Partner",25,null,2,2,0,0,0,1,3,null,null,null,null,null,3991]
[3991,"A","Other","Regional","205 VIC Rural - Gippsland","Nonmetro","F Pop <= 500",null,null,359,91.1,null,null,null,"Refer to Distribution Partner",25,null,2,2,0,0,0,1,3,null,null,null,null,null,3992]
[3992,"A","Other","Regional","205 VIC Rural - Gippsland","Nonmetro","E Pop > 500",null,null,967,96.8,null,null,null,"Refer to Distribution Partner",25,null,2,2,0,0,0,1,3,null,null,null,null,null,3995]
[3995,"A","Regional","Regional","205 VIC Rural - Gippsland","Nonmetro","B Regional",3,null,10173,104.2,null,null,null,"Non Metro",58.333333333333336,null,2,2,2,1,2,1,3,null,null,null,null,null,3996]
[3996,"A","Other","Regional","205 VIC Rural - Gippsland","Nonmetro","D Pop > 2,000",3,null,5538,112.9,null,null,null,"Regional",44.999999999999993,null,2,2,1,1,1,1,3,null,null,null,null,null,4000]
[4000,"A","Metro","Inner City","305 QLD Metro - CBD & Inner Suburbs","Metro","A Metro",1,null,16552,1.4,null,null,null,"Metro",93.333333333333329,null,3,3,3,3,2,3,3,null,null,null,null,null,4005]
[4005,"A","Metro","Metro","305 QLD Metro - CBD & Inner Suburbs","Metro","A Metro",1,null,17876,2.1,null,null,null,"Metro",93.333333333333329,null,3,3,3,3,2,3,3,null,null,null,null,null,4006]
[4006,"A","Metro","Metro","305 QLD Metro - CBD & Inner Suburbs","Metro","A Metro",null,null,14530,2.5,null,null,null,"Metro",73.333333333333343,null,3,3,3,0,2,3,3,null,null,null,null,null,4007]
[4007,"A","Metro","Metro","305 QLD Metro - CBD & Inner Suburbs","Metro","A Metro",1,null,12769,5.4,null,null,null,"Metro",93.333333333333329,null,3,3,3,3,2,3,3,null,null,null,null,null,4008]
[4008,"A","Metro","Metro","302 QLD Metro - Chermside","Metro","A Metro",1,null,368,5.4,null,null,null,"Metro",80,null,3,3,3,3,0,3,3,null,null,null,null,null,4009]
[4009,null,null,null,null,null,null,null,null,null,null,null,null,"Metro","Metro",null,null,null,null,null,null,null,null,null,null,null,null,null,null,4010]
[4010,"A","Metro","Metro","305 QLD Metro - CBD & Inner Suburbs","Metro","A Metro",1,null,2296,4.5999999999999996,null,null,null,{"$f":"IF(ISBLANK(N1372),IF(AND(H1372<>\"\",IF(I1372=\"High Density\",\"High Density\",IF(AND(P1372<=45,P1372>0),\"Refer to Distribution Partner\",IF(AND(P1372<=55,P1372>45),\"Regional\",IF(AND(P1372>55,P1372<=70),\"Non Metro\",IF(F1372=\"Nonmetro\",\"Non Metro\",IF(P1372>70,\"Metro\",\"\"))))))=\"Refer to Distribution Partner\"),\"Regional\",IF(I1372=\"High Density\",\"High Density\",IF(AND(P1372<=45,P1372>0),\"Refer to Distribution Partner\",IF(AND(P1372<=55,P1372>45),\"Regional\",IF(AND(P1372>55,P1372<=70),\"Non Metro\",IF(F1372=\"Nonmetro\",\"Non Metro\",IF(P1372>70,\"Metro\",\"\"))))))),N1372)","v":"Metro"},{"$f":"(R1372/$AB$3*$AA$3+S1372/$AB$4*$AA$4+T1372/$AB$5*$AA$5+U1372/$AB$6*$AA$6+V1372/$AB$7*$AA$7+W1372/$AB$8*$AA$8+X1372/$AB$9*$AA$9)*100","v":80},null,{"$f":"IF(ISNUMBER(SEARCH(\"Metro\",E1372)),3,IF(ISNUMBER(SEARCH(\"Rural\",E1372)),2,1))","v":3},{"$f":"IF(ISNUMBER(FIND(\"Metro\",F1372)),3,IF(ISNUMBER(FIND(\"Nonmetro\",F1372)),2,3))","v":3},{"$f":"IF(G1372=\"A Metro\",3,IF(G1372=\"B Regional\",2,IF(G1372=\"C Pop > 7,000\",1,IF(G1372=\"D Pop > 2,000\",1,0))))","v":3},{"$f":"IF(H1372=1,3,IF(H1372=2,2,IF(H1372=3,1,0)))","v":3},{"$f":"IF(J1372>=100000,3,IF(AND(J1372>=10000,J1372<100000),2,IF(AND(J1372>=5000,J1372<10000),1,0)))","v":0},{"$f":"IF(AND(K1372>=0.1,K1372<25),3,IF(AND(K1372>=25,K1372<50),2,IF(AND(K1372>=50,K1372<150),1,0)))","v":3},{"$f":"IF(L1372=\"\",3,0)","v":3},null,null,null,null,null,4011]
[4011,"A","Metro","Metro","305 QLD Metro - CBD & Inner Suburbs","Metro","A Metro",1,null,15180,6.3,null,null,null,"Metro",93.333333333333329,null,3,3,3,3,2,3,3,null,null,null,null,null,4012]
[4012,"A","Metro","Metro","302 QLD Metro - Chermside","Metro","A Metro",1,null,21828,8.5,null,null,null,"Metro",93.333333333333329,null,3,3,3,3,2,3,3,null,null,null,null,null,4013]
[4013,"A","Metro","Metro","302 QLD Metro - Chermside","Metro","A Metro",1,null,4568,9.5,null,null,null,"Metro",80,null,3,3,3,3,0,3,3,null,null,null,null,null,4014]
[4014,"A","Metro","Metro","302 QLD Metro - Chermside","Metro","A Metro",1,null,11913,12.4,null,null,null,"Metro",93.333333333333329,null,3,3,3,3,2,3,3,null,null,null,null,null,4017]
[4017,"A","Metro","Metro","302 QLD Metro - Chermside","Metro","A Metro",1,null,36869,17.3,null,null,null,"Metro",93.333333333333329,null,3,3,3,3,2,3,3,null,null,null,null,null,4018]
[4018,"A","Metro","Metro","302 QLD Metro - Chermside","Metro","A Metro",1,null,12153,14.2,null,null,null,"Metro",93.333333333333329,null,3,3,3,3,2,3,3,null,null,null,null,null,4019]
[4019,"A","Metro","Metro","313 QLD Metro - Caboolture","Metro","A Metro",1,null,20106,25.4,null,null,null,"Metro",90,null,3,3,3,3,2,2,3,null,null,null,null,null,4020]
[4020,"A","Metro","Metro","313 QLD Metro - Caboolture","Metro","A Metro",1,null,22043,29.1,null,null,null,"Metro",90,null,3,3,3,3,2,2,3,null,null,null,null,null,4021]
[4021,"A","Metro","Metro","313 QLD Metro - Caboolture","Metro","A Metro",1,null,9790,27.6,null,null,null,"Metro",83.333333333333343,null,3,3,3,3,1,2,3,null,null,null,null,null,4022]
[4022,"A","Metro","Metro","313 QLD Metro - Caboolture","Metro","A Metro",1,null,7165,28.6,null,null,null,"Metro",83.333333333333343,null,3,3,3,3,1,2,3,null,null,null,null,null,4025]
[4025,"A","Metro","Metro","301 QLD Metro - Wynnum","Metro","A Metro",null,null,368,0,null,null,"Refer to Distribution Partner","Refer to Distribution Partner",50,null,3,3,3,0,0,0,3,null,null,null,null,null,4029]
[4029,"A","Metro","Metro","305 QLD Metro - CBD & Inner Suburbs","Metro","A Metro",null,null,81,0,null,null,null,"Regional",50,null,3,3,3,0,0,0,3,null,null,null,null,null,4030]
[4030,"A","Metro","Metro","305 QLD Metro - CBD & Inner Suburbs","Metro","A Metro",1,null,16530,5.0999999999999996,null,null,null,"Metro",93.333333333333329,null,3,3,3,3,2,3,3,null,null,null,null,null,4031]
[4031,"A","Metro","Metro","302 QLD Metro - Chermside","Metro","A Metro",1,null,13588,6.8,null,null,null,"Metro",93.333333333333329,null,3,3,3,3,2,3,3,null,null,null,null,null,4032]
[4032,"A","Metro","Metro","302 QLD Metro - Chermside","Metro","A Metro",1,null,15777,9.4,null,null,null,"Metro",93.333333333333329,null,3,3,3,3,2,3,3,null,null,null,null,null,4034]
[4034,"A","Metro","Metro","302 QLD Metro - Chermside","Metro","A Metro",1,null,44463,12.7,null,null,null,"Metro",93.333333333333329,null,3,3,3,3,2,3,3,null,null,null,null,null,4035]
[4035,"A","Metro","Metro","314 QLD Metro - Strathpine","Metro","A Metro",1,null,24209,13.7,null,null,null,"Metro",93.333333333333329,null,3,3,3,3,2,3,3,null,null,null,null,null,4036]
[4036,"A","Metro","Metro","302 QLD Metro - Chermside","Metro","A Metro",1,null,6502,17.100000000000001,null,null,null,"Metro",86.666666666666671,null,3,3,3,3,1,3,3,null,null,null,null,null,4037]
[4037,"A","Metro","Metro","314 QLD Metro - Strathpine","Metro","A Metro",1,null,7973,16.399999999999999,null,null,null,"Metro",86.666666666666671,null,3,3,3,3,1,3,3,null,null,null,null,null,4051]
[4051,"A","Metro","Metro","305 QLD Metro - CBD & Inner Suburbs","Metro","A Metro",1,null,27531,5.5,null,null,null,"Metro",93.333333333333329,null,3,3,3,3,2,3,3,null,null,null,null,null,4053]
[4053,"A","Metro","Metro","302 QLD Metro - Chermside","Metro","A Metro",1,null,43986,8.6999999999999993,null,null,null,"Metro",93.333333333333329,null,3,3,3,3,2,3,3,null,null,null,null,null,4054]
[4054,"A","Metro","Metro","304 QLD Metro - Indooroopilly","Metro","A Metro",1,null,13620,10.5,null,null,null,"Metro",93.333333333333329,null,3,3,3,3,2,3,3,null,null,null,null,null,4055]
[4055,"A","Metro","Metro","314 QLD Metro - Strathpine","Metro","A Metro",1,null,20561,12.3,null,null,null,"Metro",93.333333333333329,null,3,3,3,3,2,3,3,null,null,null,null,null,4059]
[4059,"A","Metro","Metro","305 QLD Metro - CBD & Inner Suburbs","Metro","A Metro",1,null,13495,3,null,null,null,"Metro",93.333333333333329,null,3,3,3,3,2,3,3,null,null,null,null,null,4060]
[4060,"A","Metro","Metro","305 QLD Metro - CBD & Inner Suburbs","Metro","A Metro",1,null,13039,5.0999999999999996,null,null,null,"Metro",93.333333333333329,null,3,3,3,3,2,3,3,null,null,null,null,null,4061]
[4061,"A","Metro","Metro","304 QLD Metro - Indooroopilly","Metro","A Metro",1,null,16692,8.8000000000000007,null,null,null,"Metro",93.333333333333329,null,3,3,3,3,2,3,3,null,null,null,null,null,4064]
[4064,"A","Metro","Metro","305 QLD Metro - CBD & Inner Suburbs","Metro","A Metro",1,null,10837,3.2,null,null,null,"Metro",93.333333333333329,null,3,3,3,3,2,3,3,null,null,null,null,null,4065]
[4065,"A","Metro","Metro","305 QLD Metro - CBD & Inner Suburbs","Metro","A Metro",1,null,9500,5.0999999999999996,null,null,null,"Metro",86.666666666666671,null,3,3,3,3,1,3,3,null,null,null,null,null,4066]
[4066,"A","Metro","Metro","305 QLD Metro - CBD & Inner Suburbs","Metro","A Metro",1,null,16698,4.2,null,null,null,"Metro",93.333333333333329,null,3,3,3,3,2,3,3,null,null,null,null,null,4067]
[4067,"A","Metro","Metro","304 QLD Metro - Indooroopilly","Metro","A Metro",1,null,10424,4.5,null,null,null,"Metro",93.333333333333329,null,3,3,3,3,2,3,3,null,null,null,null,null,4068]
[4068,"A","Metro","Metro","304 QLD Metro - Indooroopilly","Metro","A Metro",1,null,23617,6.7,null,null,null,"Metro",93.333333333333329,null,3,3,3,3,2,3,3,null,null,null,null,null,4069]
[4069,"A","Metro","Metro","304 QLD Metro - Indooroopilly","Metro","A Metro",1,null,33627,10.6,null,null,null,"Metro",93.333333333333329,null,3,3,3,3,2,3,3,null,null,null,null,null,4070]
[4070,"A","Metro","Metro","304 QLD Metro - Indooroopilly","Metro","A Metro",1,null,11613,18.5,null,null,null,"Metro",93.333333333333329,null,3,3,3,3,2,3,3,null,null,null,null,null,4072]
[4072,"A","Metro","Metro","304 QLD Metro - Indooroopilly","Metro","A Metro",1,null,2152,0,null,null,null,"Non Metro",70,null,3,3,3,3,0,0,3,null,null,null,null,null,4073]
[4073,"A","Metro","Metro","304 QLD Metro - Indooroopilly","Metro","A Metro",1,null,9138,11.6,null,null,null,"Metro",86.666666666666671,null,3,3,3,3,1,3,3,null,null,null,null,null,4074]
[4074,"A","Metro","Metro","304 QLD Metro - Indooroopilly","Metro","A Metro",1,null,23735,13.7,null,null,null,"Metro",93.333333333333329,null,3,3,3,3,2,3,3,null,null,null,null,null,4075]
[4075,"A","Metro","Metro","304 QLD Metro - Indooroopilly","Metro","A Metro",1,null,23352,9.8000000000000007,null,null,null,"Metro",93.333333333333329,null,3,3,3,3,2,3,3,null,null,null,null,null,4076]
[4076,"A","Metro","Metro","310 QLD Metro - Ipswich","Metro","A Metro",1,null,8107,14.4,null,null,null,"Metro",86.666666666666671,null,3,3,3,3,1,3,3,null,null,null,null,null,4077]
[4077,"A","Metro","Metro","310 QLD Metro - Ipswich","Metro","A Metro",1,null,30758,15.8,null,null,null,"Metro",93.333333333333329,null,3,3,3,3,2,3,3,null,null,null,null,null,4078]
[4078,"A","Metro","Metro","310 QLD Metro - Ipswich","Metro","A Metro",1,null,25806,18.2,null,null,null,"Metro",93.333333333333329,null,3,3,3,3,2,3,3,null,null,null,null,null,4101]
[4101,"A","Metro","Metro","305 QLD Metro - CBD & Inner Suburbs","Metro","A Metro",1,null,22861,2.6,null,null,null,"Metro",93.333333333333329,null,3,3,3,3,2,3,3,null,null,null,null,null,4102]
[4102,"A","Metro","Metro","303 QLD Metro - Mt Gravatt","Metro","A Metro",1,null,7660,2.9,null,null,null,"Metro",86.666666666666671,null,3,3,3,3,1,3,3,null,null,null,null,null,4103]
[4103,"A","Metro","Metro","303 QLD Metro - Mt Gravatt","Metro","A Metro",1,null,14316,5,null,null,null,"Metro",93.333333333333329,null,3,3,3,3,2,3,3,null,null,null,null,null,4104]
[4104,"A","Metro","Metro","303 QLD Metro - Mt Gravatt","Metro","A Metro",1,null,6535,5.7,null,null,null,"Metro",86.666666666666671,null,3,3,3,3,1,3,3,null,null,null,null,null,4105]
[4105,"A","Metro","Metro","303 QLD Metro - Mt Gravatt","Metro","A Metro",1,null,13321,7.3,null,null,null,"Metro",93.333333333333329,null,3,3,3,3,2,3,3,null,null,null,null,null,4106]
[4106,"A","Metro","Metro","303 QLD Metro - Mt Gravatt","Metro","A Metro",1,null,1595,9.3000000000000007,null,null,null,"Metro",80,null,3,3,3,3,0,3,3,null,null,null,null,null,4107]
[4107,"A","Metro","Metro","303 QLD Metro - Mt Gravatt","Metro","A Metro",1,null,6290,9.5,null,null,null,"Metro",86.666666666666671,null,3,3,3,3,1,3,3,null,null,null,null,null,4108]
[4108,"A","Metro","Metro","303 QLD Metro - Mt Gravatt","Metro","A Metro",1,null,6028,11.2,null,null,null,"Metro",86.666666666666671,null,3,3,3,3,1,3,3,null,null,null,null,null,4109]
[4109,"A","Metro","Metro","303 QLD Metro - Mt Gravatt","Metro","A Metro",1,null,37607,13.1,null,null,null,"Metro",93.333333333333329,null,3,3,3,3,2,3,3,null,null,null,null,null,4110]
[4110,"A","Metro","Metro","303 QLD Metro - Mt Gravatt","Metro","A Metro",1,null,10918,15.9,null,null,null,"Metro",93.333333333333329,null,3,3,3,3,2,3,3,null,null,null,null,null,4111]
[4111,"A","Metro","Metro","303 QLD Metro - Mt Gravatt","Metro","A Metro",1,null,1183,0,null,null,null,"Non Metro",70,null,3,3,3,3,0,0,3,null,null,null,null,null,4112]
[4112,"A","Metro","Metro","303 QLD Metro - Mt Gravatt","Metro","A Metro",1,null,8108,16.7,null,null,null,"Metro",86.666666666666671,null,3,3,3,3,1,3,3,null,null,null,null,null,4113]
[4113,"A","Metro","Metro","303 QLD Metro - Mt Gravatt","Metro","A Metro",1,null,29913,14.7,null,null,null,"Metro",93.333333333333329,null,3,3,3,3,2,3,3,null,null,null,null,null,4114]
[4114,"A","Metro","Metro","311 QLD Metro - Logan","Metro","A Metro",1,null,29064,21,null,null,null,"Metro",93.333333333333329,null,3,3,3,3,2,3,3,null,null,null,null,null,4115]
[4115,"A","Metro","Metro","303 QLD Metro - Mt Gravatt","Metro","A Metro",1,null,19308,17.5,null,null,null,"Metro",93.333333333333329,null,3,3,3,3,2,3,3,null,null,null,null,null,4116]
[4116,"A","Metro","Metro","303 QLD Metro - Mt Gravatt","Metro","A Metro",1,null,25936,18.2,null,null,null,"Metro",93.333333333333329,null,3,3,3,3,2,3,3,null,null,null,null,null,4117]
[4117,"A","Metro","Metro","311 QLD Metro - Logan","Metro","A Metro",1,null,1365,21.7,null,null,null,"Metro",80,null,3,3,3,3,0,3,3,null,null,null,null,null,4118]
[4118,"A","Metro","Metro","311 QLD Metro - Logan","Metro","A Metro",1,null,30400,22.9,null,null,null,"Metro",93.333333333333329,null,3,3,3,3,2,3,3,null,null,null,null,null,4119]
[4119,"A","Metro","Metro","311 QLD Metro - Logan","Metro","A Metro",1,null,6341,17.3,null,null,null,"Metro",86.666666666666671,null,3,3,3,3,1,3,3,null,null,null,null,null,4120]
[4120,"A","Metro","Metro","303 QLD Metro - Mt Gravatt","Metro","A Metro",1,null,8936,5,null,null,null,"Metro",86.666666666666671,null,3,3,3,3,1,3,3,null,null,null,null,null,4121]
[4121,"A","Metro","Metro","303 QLD Metro - Mt Gravatt","Metro","A Metro",1,null,25264,7,null,null,null,"Metro",93.333333333333329,null,3,3,3,3,2,3,3,null,null,null,null,null,4122]
[4122,"A","Metro","Metro","303 QLD Metro - Mt Gravatt","Metro","A Metro",1,null,43850,10.5,null,null,null,"Metro",93.333333333333329,null,3,3,3,3,2,3,3,null,null,null,null,null,4123]
[4123,"A","Metro","Metro","311 QLD Metro - Logan","Metro","A Metro",1,null,18491,17,null,null,null,"Metro",93.333333333333329,null,3,3,3,3,2,3,3,null,null,null,null,null,4124]
[4124,"A","Metro","Metro","311 QLD Metro - Logan","Metro","A Metro",1,null,19672,28,null,null,null,{"$f":"IF(ISBLANK(N1436),IF(AND(H1436<>\"\",IF(I1436=\"High Density\",\"High Density\",IF(AND(P1436<=45,P1436>0),\"Refer to Distribution Partner\",IF(AND(P1436<=55,P1436>45),\"Regional\",IF(AND(P1436>55,P1436<=70),\"Non Metro\",IF(F1436=\"Nonmetro\",\"Non Metro\",IF(P1436>70,\"Metro\",\"\"))))))=\"Refer to Distribution Partner\"),\"Regional\",IF(I1436=\"High Density\",\"High Density\",IF(AND(P1436<=45,P1436>0),\"Refer to Distribution Partner\",IF(AND(P1436<=55,P1436>45),\"Regional\",IF(AND(P1436>55,P1436<=70),\"Non Metro\",IF(F1436=\"Nonmetro\",\"Non Metro\",IF(P1436>70,\"Metro\",\"\"))))))),N1436)","v":"Metro"},{"$f":"(R1436/$AB$3*$AA$3+S1436/$AB$4*$AA$4+T1436/$AB$5*$AA$5+U1436/$AB$6*$AA$6+V1436/$AB$7*$AA$7+W1436/$AB$8*$AA$8+X1436/$AB$9*$AA$9)*100","v":90},null,{"$f":"IF(ISNUMBER(SEARCH(\"Metro\",E1436)),3,IF(ISNUMBER(SEARCH(\"Rural\",E1436)),2,1))","v":3},{"$f":"IF(ISNUMBER(FIND(\"Metro\",F1436)),3,IF(ISNUMBER(FIND(\"Nonmetro\",F1436)),2,3))","v":3},{"$f":"IF(G1436=\"A Metro\",3,IF(G1436=\"B Regional\",2,IF(G1436=\"C Pop > 7,000\",1,IF(G1436=\"D Pop > 2,000\",1,0))))","v":3},{"$f":"IF(H1436=1,3,IF(H1436=2,2,IF(H1436=3,1,0)))","v":3},{"$f":"IF(J1436>=100000,3,IF(AND(J1436>=10000,J1436<100000),2,IF(AND(J1436>=5000,J1436<10000),1,0)))","v":2},{"$f":"IF(AND(K1436>=0.1,K1436<25),3,IF(AND(K1436>=25,K1436<50),2,IF(AND(K1436>=50,K1436<150),1,0)))","v":2},{"$f":"IF(L1436=\"\",3,0)","v":3},null,null,null,null,null,4125]
[4125,"A","Metro","Metro","311 QLD Metro - Logan","Metro","A Metro",1,null,7142,28.3,null,null,null,"Metro",83.333333333333343,null,3,3,3,3,1,2,3,null,null,null,null,null,4127]
[4127,"A","Metro","Metro","311 QLD Metro - Logan","Metro","A Metro",1,null,26373,21.4,null,null,null,"Metro",93.333333333333329,null,3,3,3,3,2,3,3,null,null,null,null,null,4128]
[4128,"A","Metro","Metro","311 QLD Metro - Logan","Metro","A Metro",1,null,16506,25.8,null,null,null,"Metro",90,null,3,3,3,3,2,2,3,null,null,null,null,null,4129]
[4129,"A","Metro","Metro","311 QLD Metro - Logan","Metro","A Metro",1,null,6303,28.8,null,null,null,"Metro",83.333333333333343,null,3,3,3,3,1,2,3,null,null,null,null,null,4130]
[4130,"A","Metro","Metro","311 QLD Metro - Logan","Metro","A Metro",1,null,8532,28.5,null,null,null,"Metro",83.333333333333343,null,3,3,3,3,1,2,3,null,null,null,null,null,4131]
[4131,"A","Metro","Metro","311 QLD Metro - Logan","Metro","A Metro",1,null,10439,25.4,null,null,null,"Metro",90,null,3,3,3,3,2,2,3,null,null,null,null,null,4132]
[4132,"A","Metro","Metro","311 QLD Metro - Logan","Metro","A Metro",1,null,26215,24.8,null,null,null,"Metro",93.333333333333329,null,3,3,3,3,2,3,3,null,null,null,null,null,4133]
[4133,"A","Metro","Metro","311 QLD Metro - Logan","Metro","A Metro",1,null,17769,28.5,null,null,null,"Metro",90,null,3,3,3,3,2,2,3,null,null,null,null,null,4151]
[4151,"A","Metro","Metro","303 QLD Metro - Mt Gravatt","Metro","A Metro",1,null,16282,5.2,null,null,null,"Metro",93.333333333333329,null,3,3,3,3,2,3,3,null,null,null,null,null,4152]
[4152,"A","Metro","Metro","303 QLD Metro - Mt Gravatt","Metro","A Metro",1,null,44684,7.5,null,null,null,"Metro",93.333333333333329,null,3,3,3,3,2,3,3,null,null,null,null,null,4153]
[4153,"A","Metro","Metro","301 QLD Metro - Wynnum","Metro","A Metro",1,null,4374,10.3,null,null,null,"Metro",80,null,3,3,3,3,0,3,3,null,null,null,null,null,4154]
[4154,"A","Metro","Metro","301 QLD Metro - Wynnum","Metro","A Metro",1,null,10974,13,null,null,null,"Metro",93.333333333333329,null,3,3,3,3,2,3,3,null,null,null,null,null,4155]
[4155,"A","Metro","Metro","301 QLD Metro - Wynnum","Metro","A Metro",1,null,1442,14.8,null,null,null,"Metro",80,null,3,3,3,3,0,3,3,null,null,null,null,null,4156]
[4156,"A","Metro","Metro","303 QLD Metro - Mt Gravatt","Metro","A Metro",1,null,3146,14,null,null,null,"Metro",80,null,3,3,3,3,0,3,3,null,null,null,null,null,4157]
[4157,"A","Metro","Metro","301 QLD Metro - Wynnum","Metro","A Metro",1,null,19035,19.2,null,null,null,"Metro",93.333333333333329,null,3,3,3,3,2,3,3,null,null,null,null,null,4158]
[4158,"A","Metro","Metro","301 QLD Metro - Wynnum","Metro","A Metro",1,null,3761,17.399999999999999,null,null,null,"Metro",80,null,3,3,3,3,0,3,3,null,null,null,null,null,4159]
[4159,"A","Metro","Metro","301 QLD Metro - Wynnum","Metro","A Metro",1,null,14497,18.8,null,null,null,"Metro",93.333333333333329,null,3,3,3,3,2,3,3,null,null,null,null,null,4160]
[4160,"A","Metro","Metro","301 QLD Metro - Wynnum","Metro","A Metro",1,null,18139,22.2,null,null,null,"Metro",93.333333333333329,null,3,3,3,3,2,3,3,null,null,null,null,null,4161]
[4161,"A","Metro","Metro","301 QLD Metro - Wynnum","Metro","A Metro",1,null,16254,20.5,null,null,null,"Metro",93.333333333333329,null,3,3,3,3,2,3,3,null,null,null,null,null,4163]
[4163,"A","Metro","Metro","301 QLD Metro - Wynnum","Metro","A Metro",1,null,14801,24.9,null,null,null,"Metro",93.333333333333329,null,3,3,3,3,2,3,3,null,null,null,null,null,4164]
[4164,"A","Metro","Metro","301 QLD Metro - Wynnum","Metro","A Metro",1,null,14694,27.2,null,null,null,"Metro",90,null,3,3,3,3,2,2,3,null,null,null,null,null,4165]
[4165,"A","Metro","Metro","301 QLD Metro - Wynnum","Metro","A Metro",1,null,36815,30.7,null,null,null,"Metro",90,null,3,3,3,3,2,2,3,null,null,null,null,null,4169]
[4169,"A","Metro","Metro","305 QLD Metro - CBD & Inner Suburbs","Metro","A Metro",1,null,13995,2.4,null,null,null,"Metro",93.333333333333329,null,3,3,3,3,2,3,3,null,null,null,null,null,4170]
[4170,"A","Metro","Metro","305 QLD Metro - CBD & Inner Suburbs","Metro","A Metro",1,null,24514,4.7,null,null,null,"Metro",93.333333333333329,null,3,3,3,3,2,3,3,null,null,null,null,null,4171]
[4171,"A","Metro","Metro","305 QLD Metro - CBD & Inner Suburbs","Metro","A Metro",1,null,15721,3.7,null,null,null,"Metro",93.333333333333329,null,3,3,3,3,2,3,3,null,null,null,null,null,4172]
[4172,"A","Metro","Metro","301 QLD Metro - Wynnum","Metro","A Metro",1,null,4303,7.1,null,null,null,"Metro",80,null,3,3,3,3,0,3,3,null,null,null,null,null,4173]
[4173,"A","Metro","Metro","301 QLD Metro - Wynnum","Metro","A Metro",1,null,8290,10.3,null,null,null,"Metro",86.666666666666671,null,3,3,3,3,1,3,3,null,null,null,null,null,4174]
[4174,"A","Metro","Metro","301 QLD Metro - Wynnum","Metro","A Metro",1,null,2385,10.4,null,null,null,"Metro",80,null,3,3,3,3,0,3,3,null,null,null,null,null,4178]
[4178,"A","Metro","Metro","301 QLD Metro - Wynnum","Metro","A Metro",1,null,25208,13.7,null,null,null,"Metro",93.333333333333329,null,3,3,3,3,2,3,3,null,null,null,null,null,4179]
[4179,"A","Metro","Metro","301 QLD Metro - Wynnum","Metro","A Metro",1,null,19291,14.5,null,null,null,"Metro",93.333333333333329,null,3,3,3,3,2,3,3,null,null,null,null,null,4183]
[4183,"A","Regional","Metro","301 QLD Metro - Wynnum","Metro","B Regional",null,null,2102,49.5,null,null,null,"Regional",49.999999999999993,null,3,3,2,0,0,2,3,null,null,null,null,null,4184]
[4184,"A","Other","Metro","301 QLD Metro - Wynnum","Metro","D Pop > 2,000",null,null,6906,38.4,null,null,"Not acceptable","Not acceptable",49.999999999999993,null,3,3,1,0,1,2,3,null,null,null,null,null,4205]
[4205,"A","Metro","Metro","311 QLD Metro - Logan","Metro","A Metro",1,null,5385,27.8,null,null,null,"Metro",83.333333333333343,null,3,3,3,3,1,2,3,null,null,null,null,null,4207]
[4207,"A","Metro","Metro","311 QLD Metro - Logan","Metro","A Metro",null,null,55215,33.9,null,null,null,"Non Metro",70,null,3,3,3,0,2,2,3,null,null,null,null,null,4208]
[4208,"A","Metro","Metro","309 QLD Rural - Gold Coast","Metro","A Metro",1,null,19965,42.9,null,null,null,"Metro",88.333333333333329,null,2,3,3,3,2,2,3,null,null,null,null,null,4209]
[4209,"A","Metro","Metro","309 QLD Rural - Gold Coast","Metro","A Metro",null,null,50073,51.8,null,null,null,"Non Metro",65,null,2,3,3,0,2,1,3,null,null,null,null,null,4210]
[4210,"A","Metro","Regional","309 QLD Rural - Gold Coast","Nonmetro","A Metro",1,null,19475,56.8,null,null,null,"Non Metro",78.333333333333329,null,2,2,3,3,2,1,3,null,null,null,null,null,4211]
[4211,"A","Metro","Regional","309 QLD Rural - Gold Coast","Nonmetro","A Metro",1,null,60801,66.2,null,null,null,"Non Metro",78.333333333333329,null,2,2,3,3,2,1,3,null,null,null,null,null,4212]
[4212,"A","Metro","Regional","309 QLD Rural - Gold Coast","Nonmetro","A Metro",1,null,28053,55.8,null,null,null,"Non Metro",78.333333333333329,null,2,2,3,3,2,1,3,null,null,null,null,null,4213]
[4213,"A","Metro","Regional","309 QLD Rural - Gold Coast","Nonmetro","A Metro",1,null,29042,76.5,null,null,null,"Non Metro",78.333333333333329,null,2,2,3,3,2,1,3,null,null,null,null,null,4214]
[4214,"A","Metro","Regional","309 QLD Rural - Gold Coast","Nonmetro","A Metro",1,null,37238,64.8,null,null,null,"Non Metro",78.333333333333329,null,2,2,3,3,2,1,3,null,null,null,null,null,4215]
[4215,"A","Metro","Regional","309 QLD Rural - Gold Coast","Nonmetro","A Metro",1,null,50166,66.400000000000006,null,null,null,"Non Metro",78.333333333333329,null,2,2,3,3,2,1,3,null,null,null,null,null,4216]
[4216,"A","Metro","Regional","309 QLD Rural - Gold Coast","Nonmetro","A Metro",1,null,37435,61.3,null,null,null,"Non Metro",78.333333333333329,null,2,2,3,3,2,1,3,null,null,null,null,null,4217]
[4217,"A","Metro","Regional","309 QLD Rural - Gold Coast","Nonmetro","A Metro",1,null,40836,70.900000000000006,null,null,null,"Non Metro",78.333333333333329,null,2,2,3,3,2,1,3,null,null,null,null,null,4218]
[4218,"A","Metro","Regional","309 QLD Rural - Gold Coast","Nonmetro","A Metro",1,null,31864,74.599999999999994,null,null,null,"Non Metro",78.333333333333329,null,2,2,3,3,2,1,3,null,null,null,null,null,4219]
[4219,"A","Metro","Regional","309 QLD Rural - Gold Coast","Nonmetro","A Metro",1,null,0,74.599999999999994,null,null,null,"Non Metro",65,null,2,2,3,3,0,1,3,null,"S&P Rating",null,null,null,4220]
[4220,"A","Metro","Regional","309 QLD Rural - Gold Coast","Nonmetro","A Metro",1,null,31233,79.7,null,null,null,"Non Metro",78.333333333333329,null,2,2,3,3,2,1,3,null,null,null,null,null,4221]
[4221,"A","Metro","Regional","309 QLD Rural - Gold Coast","Nonmetro","A Metro",1,null,26802,84.4,null,null,null,"Non Metro",78.333333333333329,null,2,2,3,3,2,1,3,null,null,null,null,null,4222]
[4222,"A","Metro","Regional","Unknown","Nonmetro","A Metro",null,null,0,84.4,null,null,null,"Refer to Distribution Partner",43.333333333333329,null,1,2,3,0,0,1,3,null,"La Trobe  Risk Location ",null,null,null,4223]
[4223,"A","Metro","Regional","309 QLD Rural - Gold Coast","Nonmetro","A Metro",1,null,13892,87.5,null,null,null,"Non Metro",78.333333333333329,null,2,2,3,3,2,1,3,null,null,null,null,null,4224]
[4224,"A","Metro","Regional","309 QLD Rural - Gold Coast","Nonmetro","A Metro",1,null,6588,88.2,null,null,null,"Non Metro",71.666666666666671,null,2,2,3,3,1,1,3,null,null,null,null,null,4225]
[4225,"A","Metro","Regional","309 QLD Rural - Gold Coast","Nonmetro","A Metro",1,null,7754,92.2,null,null,null,"Non Metro",71.666666666666671,null,2,2,3,3,1,1,3,null,null,null,null,null,4226]
[4226,"A","Metro","Regional","309 QLD Rural - Gold Coast","Nonmetro","A Metro",1,null,32243,75.3,null,null,null,"Non Metro",78.333333333333329,null,2,2,3,3,2,1,3,null,null,null,null,null,4227]
[4227,"A","Metro","Regional","309 QLD Rural - Gold Coast","Nonmetro","A Metro",1,null,21687,79.3,null,null,null,"Non Metro",78.333333333333329,null,2,2,3,3,2,1,3,null,null,null,null,null,4228]
[4228,"A","Metro","Regional","309 QLD Rural - Gold Coast","Nonmetro","A Metro",1,null,5297,84.7,null,null,null,"Non Metro",71.666666666666671,null,2,2,3,3,1,1,3,null,null,null,null,null,4229]
[4229,"A","Metro","Regional","309 QLD Rural - Gold Coast","Nonmetro","A Metro",1,null,384,84.7,null,null,null,"Non Metro",65,null,2,2,3,3,0,1,3,null,null,null,null,null,4230]
[4230,"A","Metro","Regional","309 QLD Rural - Gold Coast","Nonmetro","A Metro",null,null,1674,76,null,null,null,"Refer to Distribution Partner",45,null,2,2,3,0,0,1,3,null,null,null,null,null,4270]
[4270,"A","Regional","Regional","309 QLD Rural - Gold Coast","Nonmetro","B Regional",2,null,3950,46.1,null,null,null,"Regional",55.000000000000007,null,2,2,2,2,0,2,3,null,null,null,null,null,4271]
[4271,"A","Metro","Regional","309 QLD Rural - Gold Coast","Nonmetro","A Metro",2,null,2888,52.3,null,null,null,"Non Metro",58.333333333333336,null,2,2,3,2,0,1,3,null,null,null,null,null,4272]
[4272,"A","Metro","Regional","309 QLD Rural - Gold Coast","Nonmetro","A Metro",2,null,4612,56,null,null,null,"Non Metro",58.333333333333336,null,2,2,3,2,0,1,3,null,null,null,null,null,4275]
[4275,"A","Other","Regional","309 QLD Rural - Gold Coast","Nonmetro","D Pop > 2,000",null,null,3434,60.6,null,null,null,"Refer to Distribution Partner",31.666666666666664,null,2,2,1,0,0,1,3,null,null,null,null,null,4280]
[4280,"A","Regional","Regional","311 QLD Metro - Logan","Nonmetro","B Regional",1,null,16862,39.5,null,null,null,"Non Metro",76.666666666666657,null,3,2,2,3,2,2,3,null,null,null,null,null,4285]
[4285,"A","Regional","Regional","311 QLD Metro - Logan","Nonmetro","B Regional",3,null,20247,65.2,null,null,null,"Non Metro",60,null,3,2,2,1,2,1,3,null,null,null,null,null,4287]
[4287,"A","Other","Regional","311 QLD Metro - Logan","Nonmetro","E Pop > 500",null,null,824,65.2,null,null,null,{"$f":"IF(ISBLANK(N1500),IF(AND(H1500<>\"\",IF(I1500=\"High Density\",\"High Density\",IF(AND(P1500<=45,P1500>0),\"Refer to Distribution Partner\",IF(AND(P1500<=55,P1500>45),\"Regional\",IF(AND(P1500>55,P1500<=70),\"Non Metro\",IF(F1500=\"Nonmetro\",\"Non Metro\",IF(P1500>70,\"Metro\",\"\"))))))=\"Refer to Distribution Partner\"),\"Regional\",IF(I1500=\"High Density\",\"High Density\",IF(AND(P1500<=45,P1500>0),\"Refer to Distribution Partner\",IF(AND(P1500<=55,P1500>45),\"Regional\",IF(AND(P1500>55,P1500<=70),\"Non Metro\",IF(F1500=\"Nonmetro\",\"Non Metro\",IF(P1500>70,\"Metro\",\"\"))))))),N1500)","v":"Refer to Distribution Partner"},{"$f":"(R1500/$AB$3*$AA$3+S1500/$AB$4*$AA$4+T1500/$AB$5*$AA$5+U1500/$AB$6*$AA$6+V1500/$AB$7*$AA$7+W1500/$AB$8*$AA$8+X1500/$AB$9*$AA$9)*100","v":26.666666666666668},null,{"$f":"IF(ISNUMBER(SEARCH(\"Metro\",E1500)),3,IF(ISNUMBER(SEARCH(\"Rural\",E1500)),2,1))","v":3},{"$f":"IF(ISNUMBER(FIND(\"Metro\",F1500)),3,IF(ISNUMBER(FIND(\"Nonmetro\",F1500)),2,3))","v":2},{"$f":"IF(G1500=\"A Metro\",3,IF(G1500=\"B Regional\",2,IF(G1500=\"C Pop > 7,000\",1,IF(G1500=\"D Pop > 2,000\",1,0))))","v":0},{"$f":"IF(H1500=1,3,IF(H1500=2,2,IF(H1500=3,1,0)))","v":0},{"$f":"IF(J1500>=100000,3,IF(AND(J1500>=10000,J1500<100000),2,IF(AND(J1500>=5000,J1500<10000),1,0)))","v":0},{"$f":"IF(AND(K1500>=0.1,K1500<25),3,IF(AND(K1500>=25,K1500<50),2,IF(AND(K1500>=50,K1500<150),1,0)))","v":1},{"$f":"IF(L1500=\"\",3,0)","v":3},null,null,null,null,null,4300]
[4300,"A","Metro","Metro","310 QLD Metro - Ipswich","Metro","A Metro",1,null,55669,24,null,null,null,"Metro",93.333333333333329,null,3,3,3,3,2,3,3,null,null,null,null,null,4301]
[4301,"A","Metro","Metro","310 QLD Metro - Ipswich","Metro","A Metro",1,null,28240,25.7,null,null,null,"Metro",90,null,3,3,3,3,2,2,3,null,null,null,null,null,4303]
[4303,"A","Metro","Metro","310 QLD Metro - Ipswich","Metro","A Metro",1,null,3946,23.3,null,null,null,"Metro",80,null,3,3,3,3,0,3,3,null,null,null,null,null,4304]
[4304,"A","Metro","Metro","310 QLD Metro - Ipswich","Metro","A Metro",1,null,17316,27.6,null,null,null,"Metro",90,null,3,3,3,3,2,2,3,null,null,null,null,null,4305]
[4305,"A","Metro","Metro","310 QLD Metro - Ipswich","Metro","A Metro",1,null,62549,31.7,null,null,null,"Metro",90,null,3,3,3,3,2,2,3,null,null,null,null,null,4306]
[4306,"A","Regional","Metro","310 QLD Metro - Ipswich","Metro","B Regional",1,null,35798,41.5,null,null,null,"Metro",83.333333333333329,null,3,3,2,3,2,2,3,null,null,null,null,null,4307]
[4307,"A","Other","Regional","310 QLD Metro - Ipswich","Nonmetro","E Pop > 500",null,null,1555,53.1,null,null,null,"Refer to Distribution Partner",26.666666666666668,null,3,2,0,0,0,1,3,null,null,null,null,null,4309]
[4309,"A","Other","Regional","310 QLD Metro - Ipswich","Nonmetro","D Pop > 2,000",null,null,3006,71.5,null,null,null,"Refer to Distribution Partner",33.333333333333329,null,3,2,1,0,0,1,3,null,null,null,null,null,4310]
[4310,"A","Other","Regional","310 QLD Metro - Ipswich","Nonmetro","D Pop > 2,000",null,null,5752,67.900000000000006,null,null,null,"Refer to Distribution Partner",40,null,3,2,1,0,1,1,3,null,null,null,null,null,4311]
[4311,"A","Other","Regional","310 QLD Metro - Ipswich","Nonmetro","C Pop > 7,000",null,null,10599,49.4,null,null,null,"Regional",49.999999999999993,null,3,2,1,0,2,2,3,null,null,null,null,null,4312]
[4312,"A","Other","Regional","310 QLD Metro - Ipswich","Nonmetro","D Pop > 2,000",null,null,2672,64.7,null,null,null,"Refer to Distribution Partner",33.333333333333329,null,3,2,1,0,0,1,3,null,null,null,null,null,4313]
[4313,"A","Other","Regional","310 QLD Metro - Ipswich","Nonmetro","E Pop > 500",null,null,2323,76.599999999999994,null,null,null,"Refer to Distribution Partner",26.666666666666668,null,3,2,0,0,0,1,3,null,null,null,null,null,4340]
[4340,"A","Other","Regional","310 QLD Metro - Ipswich","Nonmetro","D Pop > 2,000",null,null,5451,50.4,null,null,null,"Refer to Distribution Partner",40,null,3,2,1,0,1,1,3,null,null,null,null,null,4341]
[4341,"A","Other","Regional","310 QLD Metro - Ipswich","Nonmetro","C Pop > 7,000",null,null,14592,61.9,null,null,null,"Regional",46.666666666666664,null,3,2,1,0,2,1,3,null,null,null,null,null,4342]
[4342,"A","Other","Regional","310 QLD Metro - Ipswich","Nonmetro","D Pop > 2,000",null,null,2618,62.7,null,null,null,"Refer to Distribution Partner",33.333333333333329,null,3,2,1,0,0,1,3,null,null,null,null,null,4343]
[4343,"A","Other","Regional","317 QLD Rural - Toowoomba","Nonmetro","C Pop > 7,000",3,null,11359,74.400000000000006,null,null,null,"Regional",51.666666666666671,null,2,2,1,1,2,1,3,null,null,null,null,null,4344]
[4344,"A","Other","Regional","317 QLD Rural - Toowoomba","Nonmetro","D Pop > 2,000",null,null,2622,92.5,null,null,null,"Refer to Distribution Partner",31.666666666666664,null,2,2,1,0,0,1,3,null,null,null,null,null,4345]
[4345,"A","Other","Regional","317 QLD Rural - Toowoomba","Nonmetro","F Pop <= 500",null,null,328,92.5,null,null,null,"Refer to Distribution Partner",25,null,2,2,0,0,0,1,3,null,null,null,null,null,4346]
[4346,"A","Other","Regional","310 QLD Metro - Ipswich","Nonmetro","E Pop > 500",null,null,873,44.2,null,null,null,"Refer to Distribution Partner",30,null,3,2,0,0,0,2,3,null,null,null,null,null,4347]
[4347,"A","Other","Regional","317 QLD Rural - Toowoomba","Nonmetro","E Pop > 500",null,null,1192,84.6,null,null,null,"Refer to Distribution Partner",25,null,2,2,0,0,0,1,3,null,null,null,null,null,4350]
[4350,"A","Regional","Regional","317 QLD Rural - Toowoomba","Nonmetro","B Regional",1,null,106745,107.8,null,null,null,"Non Metro",78.333333333333329,null,2,2,2,3,3,1,3,null,null,null,null,null,4352]
[4352,"A","Regional","Regional","317 QLD Rural - Toowoomba","Nonmetro","B Regional",2,null,28460,107.5,null,null,null,"Non Metro",65,null,2,2,2,2,2,1,3,null,null,null,null,null,4353]
[4353,"A","Other","Regional","307 QLD Rural - Darling Downs","Nonmetro","F Pop <= 500",null,null,294,107.5,null,null,null,"Refer to Distribution Partner",25,null,2,2,0,0,0,1,3,null,null,null,null,null,4354]
[4354,"A","Other","Regional","307 QLD Rural - Darling Downs","Nonmetro","E Pop > 500",null,null,1199,117.2,"Mining",null,null,"Refer to Distribution Partner",20,null,2,2,0,0,0,1,0,null,null,null,null,null,4355]
[4355,"A","Other","Regional","307 QLD Rural - Darling Downs","Nonmetro","D Pop > 2,000",null,null,2678,99.1,null,null,null,"Refer to Distribution Partner",31.666666666666664,null,2,2,1,0,0,1,3,null,null,null,null,null,4356]
[4356,"A","Other","Regional","307 QLD Rural - Darling Downs","Nonmetro","D Pop > 2,000",null,null,5179,140.19999999999999,null,null,"Regional","Regional",38.333333333333329,null,2,2,1,0,1,1,3,null,null,null,null,null,4357]
[4357,"A","Other","Regional","307 QLD Rural - Darling Downs","Nonmetro","D Pop > 2,000",null,null,2582,186.7,"Mining",null,null,"Refer to Distribution Partner",23.333333333333332,null,2,2,1,0,0,0,0,null,null,null,null,null,4358]
[4358,"A","Other","Regional","317 QLD Rural - Toowoomba","Nonmetro","E Pop > 500",null,null,2264,117.4,null,null,null,"Refer to Distribution Partner",25,null,2,2,0,0,0,1,3,null,null,null,null,null,4359]
[4359,"A","Other","Regional","307 QLD Rural - Darling Downs","Nonmetro","E Pop > 500",null,null,1243,114.8,null,null,null,"Refer to Distribution Partner",25,null,2,2,0,0,0,1,3,null,null,null,null,null,4360]
[4360,"A","Other","Regional","307 QLD Rural - Darling Downs","Nonmetro","F Pop <= 500",null,null,592,117.8,null,null,null,"Refer to Distribution Partner",25,null,2,2,0,0,0,1,3,null,null,null,null,null,4361]
[4361,"A","Other","Regional","307 QLD Rural - Darling Downs","Nonmetro","D Pop > 2,000",null,null,2653,121.3,null,null,null,"Refer to Distribution Partner",31.666666666666664,null,2,2,1,0,0,1,3,null,null,null,null,null,4362]
[4362,"A","Other","Regional","307 QLD Rural - Darling Downs","Nonmetro","D Pop > 2,000",null,null,2462,121.4,null,null,null,"Refer to Distribution Partner",31.666666666666664,null,2,2,1,0,0,1,3,null,null,null,null,null,4363]
[4363,"A","Other","Regional","307 QLD Rural - Darling Downs","Nonmetro","E Pop > 500",null,null,599,121.4,"Mining",null,null,"Refer to Distribution Partner",20,null,2,2,0,0,0,1,0,null,null,null,null,null,4364]
[4364,"A","Other","Regional","307 QLD Rural - Darling Downs","Nonmetro","F Pop <= 500",null,null,217,121.4,null,null,null,"Refer to Distribution Partner",25,null,2,2,0,0,0,1,3,null,null,null,null,null,4365]
[4365,"A","Other","Regional","307 QLD Rural - Darling Downs","Nonmetro","F Pop <= 500",null,null,508,153.9,null,null,null,"Refer to Distribution Partner",21.666666666666668,null,2,2,0,0,0,0,3,null,null,null,null,null,4370]
[4370,"A","Regional","Regional","307 QLD Rural - Darling Downs","Nonmetro","B Regional",2,null,18521,128.69999999999999,null,null,null,"Non Metro",65,null,2,2,2,2,2,1,3,null,null,null,null,null,4371]
[4371,"A","Other","Regional","307 QLD Rural - Darling Downs","Nonmetro","E Pop > 500",null,null,708,113.5,null,null,null,"Refer to Distribution Partner",25,null,2,2,0,0,0,1,3,null,null,null,null,null,4372]
[4372,"A","Other","Regional","307 QLD Rural - Darling Downs","Nonmetro","F Pop <= 500",null,null,161,113.5,null,null,null,"Refer to Distribution Partner",25,null,2,2,0,0,0,1,3,null,null,null,null,null,4373]
[4373,"A","Other","Regional","307 QLD Rural - Darling Downs","Nonmetro","E Pop > 500",null,null,1032,119.7,null,null,null,"Refer to Distribution Partner",25,null,2,2,0,0,0,1,3,null,null,null,null,null,4374]
[4374,"A","Other","Regional","307 QLD Rural - Darling Downs","Nonmetro","F Pop <= 500",null,null,355,119.7,null,null,null,"Refer to Distribution Partner",25,null,2,2,0,0,0,1,3,null,null,null,null,null,4375]
[4375,"A","Other","Regional","307 QLD Rural - Darling Downs","Nonmetro","F Pop <= 500",null,null,211,119.7,null,null,null,"Refer to Distribution Partner",25,null,2,2,0,0,0,1,3,null,null,null,null,null,4376]
[4376,"A","Other","Regional","307 QLD Rural - Darling Downs","Nonmetro","F Pop <= 500",null,null,319,119.7,null,null,null,"Refer to Distribution Partner",25,null,2,2,0,0,0,1,3,null,null,null,null,null,4377]
[4377,"A","Other","Regional","307 QLD Rural - Darling Downs","Nonmetro","F Pop <= 500",null,null,538,119.7,null,null,null,"Refer to Distribution Partner",25,null,2,2,0,0,0,1,3,null,null,null,null,null,4378]
[4378,"A","Other","Regional","307 QLD Rural - Darling Downs","Nonmetro","F Pop <= 500",null,null,511,119.7,null,null,null,"Refer to Distribution Partner",25,null,2,2,0,0,0,1,3,null,null,null,null,null,4380]
[4380,"A","Other","Regional","307 QLD Rural - Darling Downs","Nonmetro","C Pop > 7,000",null,null,7907,176.7,null,null,null,"Refer to Distribution Partner",35,null,2,2,1,0,1,0,3,null,null,null,null,null,4381]
[4381,"A","Other","Regional","307 QLD Rural - Darling Downs","Nonmetro","F Pop <= 500",null,null,594,181.3,null,null,null,"Refer to Distribution Partner",21.666666666666668,null,2,2,0,0,0,0,3,null,null,null,null,null,4382]
[4382,"A","Other","Regional","307 QLD Rural - Darling Downs","Nonmetro","F Pop <= 500",null,null,517,181.3,null,null,null,"Refer to Distribution Partner",21.666666666666668,null,2,2,0,0,0,0,3,null,null,null,null,null,4383]
[4383,"A","Other","Regional","307 QLD Rural - Darling Downs","Nonmetro","E Pop > 500",null,null,619,313.8,null,null,null,"Refer to Distribution Partner",21.666666666666668,null,2,2,0,0,0,0,3,null,null,null,null,null,4384]
[4384,"A","Other","Regional","307 QLD Rural - Darling Downs","Nonmetro","F Pop <= 500",null,null,64,313.8,null,null,null,"Refer to Distribution Partner",21.666666666666668,null,2,2,0,0,0,0,3,null,null,null,null,null,4385]
[4385,"A","Other","Regional","307 QLD Rural - Darling Downs","Nonmetro","E Pop > 500",null,null,1222,254.9,null,null,null,"Refer to Distribution Partner",21.666666666666668,null,2,2,0,0,0,0,3,null,null,null,null,null,4387]
[4387,"A","Other","Regional","307 QLD Rural - Darling Downs","Nonmetro","E Pop > 500",null,null,1280,217.7,null,null,null,"Refer to Distribution Partner",21.666666666666668,null,2,2,0,0,0,0,3,null,null,null,null,null,4388]
[4388,"A","Other","Regional","307 QLD Rural - Darling Downs","Nonmetro","F Pop <= 500",null,null,416,255,null,null,null,"Refer to Distribution Partner",21.666666666666668,null,2,2,0,0,0,0,3,null,null,null,null,null,4390]
[4390,"A","Other","Regional","307 QLD Rural - Darling Downs","Nonmetro","D Pop > 2,000",null,null,6878,292.60000000000002,null,null,null,"Refer to Distribution Partner",35,null,2,2,1,0,1,0,3,null,null,null,null,null,4400]
[4400,"A","Other","Regional","317 QLD Rural - Toowoomba","Nonmetro","E Pop > 500",null,null,1884,118.8,null,null,null,"Refer to Distribution Partner",25,null,2,2,0,0,0,1,3,null,null,null,null,null,4401]
[4401,"A","Other","Regional","307 QLD Rural - Darling Downs","Nonmetro","D Pop > 2,000",null,null,5719,129,null,null,"Regional","Regional",38.333333333333329,null,2,2,1,0,1,1,3,null,null,null,null,null,4402]
[4402,"A","Other","Regional","307 QLD Rural - Darling Downs","Nonmetro","F Pop <= 500",null,null,297,129,null,null,null,"Refer to Distribution Partner",25,null,2,2,0,0,0,1,3,null,null,null,null,null,4403]
[4403,"A","Other","Regional","307 QLD Rural - Darling Downs","Nonmetro","E Pop > 500",null,null,811,129,null,null,null,"Refer to Distribution Partner",25,null,2,2,0,0,0,1,3,null,null,null,null,null,4404]
[4404,"A","Other","Regional","307 QLD Rural - Darling Downs","Nonmetro","F Pop <= 500",null,null,539,129,null,null,null,"Refer to Distribution Partner",25,null,2,2,0,0,0,1,3,null,null,null,null,null,4405]
[4405,"A","Other","Regional","307 QLD Rural - Darling Downs","Nonmetro","C Pop > 7,000",3,null,14485,179.3,null,null,null,"Regional",48.333333333333336,null,2,2,1,1,2,0,3,null,null,null,null,null,4406]
[4406,"A","Other","Regional","307 QLD Rural - Darling Downs","Nonmetro","E Pop > 500",null,null,1467,179.3,null,null,null,"Refer to Distribution Partner",21.666666666666668,null,2,2,0,0,0,0,3,null,null,null,null,null,4407]
[4407,"A","Other","Regional","307 QLD Rural - Darling Downs","Nonmetro","E Pop > 500",null,null,526,179.3,null,null,null,"Refer to Distribution Partner",21.666666666666668,null,2,2,0,0,0,0,3,null,null,null,null,null,4408]
[4408,"A","Other","Regional","307 QLD Rural - Darling Downs","Nonmetro","E Pop > 500",null,null,631,179.3,null,null,null,"Refer to Distribution Partner",21.666666666666668,null,2,2,0,0,0,0,3,null,null,null,null,null,4410]
[4410,"A","Other","Regional","307 QLD Rural - Darling Downs","Nonmetro","E Pop > 500",null,null,1122,204.5,null,null,null,"Refer to Distribution Partner",21.666666666666668,null,2,2,0,0,0,0,3,null,null,null,null,null,4411]
[4411,"A","Other","Regional","307 QLD Rural - Darling Downs","Nonmetro","F Pop <= 500",null,null,287,204.5,null,null,null,{"$f":"IF(ISBLANK(N1564),IF(AND(H1564<>\"\",IF(I1564=\"High Density\",\"High Density\",IF(AND(P1564<=45,P1564>0),\"Refer to Distribution Partner\",IF(AND(P1564<=55,P1564>45),\"Regional\",IF(AND(P1564>55,P1564<=70),\"Non Metro\",IF(F1564=\"Nonmetro\",\"Non Metro\",IF(P1564>70,\"Metro\",\"\"))))))=\"Refer to Distribution Partner\"),\"Regional\",IF(I1564=\"High Density\",\"High Density\",IF(AND(P1564<=45,P1564>0),\"Refer to Distribution Partner\",IF(AND(P1564<=55,P1564>45),\"Regional\",IF(AND(P1564>55,P1564<=70),\"Non Metro\",IF(F1564=\"Nonmetro\",\"Non Metro\",IF(P1564>70,\"Metro\",\"\"))))))),N1564)","v":"Refer to Distribution Partner"},{"$f":"(R1564/$AB$3*$AA$3+S1564/$AB$4*$AA$4+T1564/$AB$5*$AA$5+U1564/$AB$6*$AA$6+V1564/$AB$7*$AA$7+W1564/$AB$8*$AA$8+X1564/$AB$9*$AA$9)*100","v":21.666666666666668},null,{"$f":"IF(ISNUMBER(SEARCH(\"Metro\",E1564)),3,IF(ISNUMBER(SEARCH(\"Rural\",E1564)),2,1))","v":2},{"$f":"IF(ISNUMBER(FIND(\"Metro\",F1564)),3,IF(ISNUMBER(FIND(\"Nonmetro\",F1564)),2,3))","v":2},{"$f":"IF(G1564=\"A Metro\",3,IF(G1564=\"B Regional\",2,IF(G1564=\"C Pop > 7,000\",1,IF(G1564=\"D Pop > 2,000\",1,0))))","v":0},{"$f":"IF(H1564=1,3,IF(H1564=2,2,IF(H1564=3,1,0)))","v":0},{"$f":"IF(J1564>=100000,3,IF(AND(J1564>=10000,J1564<100000),2,IF(AND(J1564>=5000,J1564<10000),1,0)))","v":0},{"$f":"IF(AND(K1564>=0.1,K1564<25),3,IF(AND(K1564>=25,K1564<50),2,IF(AND(K1564>=50,K1564<150),1,0)))","v":0},{"$f":"IF(L1564=\"\",3,0)","v":3},null,null,null,null,null,4412]
[4412,"A","Other","Regional","307 QLD Rural - Darling Downs","Nonmetro","F Pop <= 500",null,null,192,204.5,null,null,null,"Refer to Distribution Partner",21.666666666666668,null,2,2,0,0,0,0,3,null,null,null,null,null,4413]
[4413,"A","Other","Regional","307 QLD Rural - Darling Downs","Nonmetro","D Pop > 2,000",null,null,8024,250.7,null,null,null,"Refer to Distribution Partner",35,null,2,2,1,0,1,0,3,null,null,null,null,null,4415]
[4415,"A","Other","Regional","307 QLD Rural - Darling Downs","Nonmetro","E Pop > 500",null,null,1988,295.2,null,null,null,"Refer to Distribution Partner",21.666666666666668,null,2,2,0,0,0,0,3,null,null,null,null,null,4416]
[4416,"A","Other","Regional","307 QLD Rural - Darling Downs","Nonmetro","F Pop <= 500",null,null,498,295.2,null,null,null,"Refer to Distribution Partner",21.666666666666668,null,2,2,0,0,0,0,3,null,null,null,null,null,4417]
[4417,"A","Other","Regional","307 QLD Rural - Darling Downs","Nonmetro","E Pop > 500",null,null,669,295.2,null,null,null,"Refer to Distribution Partner",21.666666666666668,null,2,2,0,0,0,0,3,null,null,null,null,null,4418]
[4418,"A","Other","Regional","307 QLD Rural - Darling Downs","Nonmetro","F Pop <= 500",null,null,109,295.2,null,null,null,"Refer to Distribution Partner",21.666666666666668,null,2,2,0,0,0,0,3,null,null,null,null,null,4419]
[4419,"A","Other","Regional","307 QLD Rural - Darling Downs","Nonmetro","E Pop > 500",null,null,944,338.9,null,null,null,"Refer to Distribution Partner",21.666666666666668,null,2,2,0,0,0,0,3,null,null,null,null,null,4420]
[4420,"A","Other","Regional","308 QLD Rural - Rockhampton","Nonmetro","E Pop > 500",null,null,1178,338.9,null,null,null,"Refer to Distribution Partner",21.666666666666668,null,2,2,0,0,0,0,3,null,null,null,null,null,4421]
[4421,"A","Other","Regional","307 QLD Rural - Darling Downs","Nonmetro","D Pop > 2,000",null,null,2483,251.9,null,null,null,"Refer to Distribution Partner",28.333333333333332,null,2,2,1,0,0,0,3,null,null,null,null,null,4422]
[4422,"A","Other","Regional","307 QLD Rural - Darling Downs","Nonmetro","E Pop > 500",null,null,482,251.9,null,null,null,"Refer to Distribution Partner",21.666666666666668,null,2,2,0,0,0,0,3,null,null,null,null,null,4423]
[4423,"A","Other","Regional","307 QLD Rural - Darling Downs","Nonmetro","F Pop <= 500",null,null,200,251.9,null,null,null,"Refer to Distribution Partner",21.666666666666668,null,2,2,0,0,0,0,3,null,null,null,null,null,4424]
[4424,"A","Other","Regional","307 QLD Rural - Darling Downs","Nonmetro","F Pop <= 500",null,null,238,251.9,null,null,null,"Refer to Distribution Partner",21.666666666666668,null,2,2,0,0,0,0,3,null,null,null,null,null,4425]
[4425,"A","Other","Regional","307 QLD Rural - Darling Downs","Nonmetro","F Pop <= 500",null,null,219,251.9,null,null,null,"Refer to Distribution Partner",21.666666666666668,null,2,2,0,0,0,0,3,null,null,null,null,null,4426]
[4426,"A","Other","Regional","307 QLD Rural - Darling Downs","Nonmetro","F Pop <= 500",null,null,124,251.9,null,null,null,"Refer to Distribution Partner",21.666666666666668,null,2,2,0,0,0,0,3,null,null,null,null,null,4427]
[4427,"A","Other","Regional","307 QLD Rural - Darling Downs","Nonmetro","F Pop <= 500",null,null,351,251.9,null,null,null,"Refer to Distribution Partner",21.666666666666668,null,2,2,0,0,0,0,3,null,null,null,null,null,4428]
[4428,"A","Other","Regional","307 QLD Rural - Darling Downs","Nonmetro","E Pop > 500",null,null,666,251.9,null,null,null,"Refer to Distribution Partner",21.666666666666668,null,2,2,0,0,0,0,3,null,null,null,null,null,4454]
[4454,"A","Other","Regional","307 QLD Rural - Darling Downs","Nonmetro","E Pop > 500",null,null,706,478.7,null,null,null,"Refer to Distribution Partner",21.666666666666668,null,2,2,0,0,0,0,3,null,null,null,null,null,4455]
[4455,"A","Other","Regional","307 QLD Rural - Darling Downs","Nonmetro","C Pop > 7,000",null,null,8486,432.4,null,null,null,"Refer to Distribution Partner",35,null,2,2,1,0,1,0,3,null,null,null,null,null,4461]
[4461,"A","Other","Regional","307 QLD Rural - Darling Downs","Nonmetro","F Pop <= 500",null,null,58,432.4,null,null,null,"Refer to Distribution Partner",21.666666666666668,null,2,2,0,0,0,0,3,null,null,null,null,null,4462]
[4462,"A","Other","Regional","307 QLD Rural - Darling Downs","Nonmetro","F Pop <= 500",null,null,110,432.4,null,null,null,"Refer to Distribution Partner",21.666666666666668,null,2,2,0,0,0,0,3,null,null,null,null,null,4465]
[4465,"A","Other","Regional","307 QLD Rural - Darling Downs","Nonmetro","E Pop > 500",null,null,1230,512.4,null,null,null,"Refer to Distribution Partner",21.666666666666668,null,2,2,0,0,0,0,3,null,null,null,null,null,4467]
[4467,"A","Other","Regional","307 QLD Rural - Darling Downs","Nonmetro","E Pop > 500",null,null,197,512.4,null,null,null,"Refer to Distribution Partner",21.666666666666668,null,2,2,0,0,0,0,3,null,null,null,null,null,4468]
[4468,"A","Other","Regional","315 QLD Rural - Outback","Nonmetro","F Pop <= 500",null,null,255,512.4,null,null,null,"Refer to Distribution Partner",21.666666666666668,null,2,2,0,0,0,0,3,null,null,null,null,null,4470]
[4470,"A","Other","Regional","315 QLD Rural - Outback","Nonmetro","D Pop > 2,000",null,null,3574,682.6,null,null,null,"Refer to Distribution Partner",28.333333333333332,null,2,2,1,0,0,0,3,null,null,null,null,null,4471]
[4471,"A","Other","Regional","315 QLD Rural - Outback","Nonmetro","F Pop <= 500",null,null,0,682.6,null,null,null,"Refer to Distribution Partner",21.666666666666668,null,2,2,0,0,0,0,3,null,"Origin",null,null,null,4472]
[4472,"A","Other","Regional","315 QLD Rural - Outback","Nonmetro","E Pop > 500",null,null,1426,828.3,null,null,null,"Refer to Distribution Partner",21.666666666666668,null,2,2,0,0,0,0,3,null,null,null,null,null,4474]
[4474,"A","Other","Regional","315 QLD Rural - Outback","Nonmetro","F Pop <= 500",null,null,93,828.3,null,null,null,"Refer to Distribution Partner",21.666666666666668,null,2,2,0,0,0,0,3,null,null,null,null,null,4475]
[4475,"A","Other","Regional","315 QLD Rural - Outback","Nonmetro","F Pop <= 500",null,null,0,828.3,null,null,null,"Refer to Distribution Partner",21.666666666666668,null,2,2,0,0,0,0,3,null,"Population ABS 2016",null,null,null,4477]
[4477,"A","Other","Regional","315 QLD Rural - Outback","Nonmetro","E Pop > 500",null,null,468,666.8,null,null,null,"Refer to Distribution Partner",21.666666666666668,null,2,2,0,0,0,0,3,null,null,null,null,null,4478]
[4478,"A","Other","Regional","315 QLD Rural - Outback","Nonmetro","E Pop > 500",null,null,476,666.8,null,null,null,"Refer to Distribution Partner",21.666666666666668,null,2,2,0,0,0,0,3,null,null,null,null,null,4479]
[4479,"A","Other","Regional","315 QLD Rural - Outback","Nonmetro","F Pop <= 500",null,null,16,666.8,null,null,null,"Refer to Distribution Partner",21.666666666666668,null,2,2,0,0,0,0,3,null,null,null,null,null,4480]
[4480,"A","Other","Regional","315 QLD Rural - Outback","Nonmetro","E Pop > 500",null,null,751,879.5,null,null,null,"Refer to Distribution Partner",21.666666666666668,null,2,2,0,0,0,0,3,null,null,null,null,null,4481]
[4481,"A","Other","Regional","315 QLD Rural - Outback","Nonmetro","F Pop <= 500",null,null,121,879.5,null,null,null,"Refer to Distribution Partner",21.666666666666668,null,2,2,0,0,0,0,3,null,null,null,null,null,4482]
[4482,"A","Other","Regional","315 QLD Rural - Outback","Nonmetro","F Pop <= 500",null,null,140,879.5,null,null,null,"Refer to Distribution Partner",21.666666666666668,null,2,2,0,0,0,0,3,null,null,null,null,null,4486]
[4486,"A","Other","Regional","307 QLD Rural - Darling Downs","Nonmetro","E Pop > 500",null,null,703,879.5,null,null,null,"Refer to Distribution Partner",21.666666666666668,null,2,2,0,0,0,0,3,null,null,null,null,null,4487]
[4487,"A","Other","Regional","307 QLD Rural - Darling Downs","Nonmetro","D Pop > 2,000",null,null,3098,441.5,null,null,null,"Refer to Distribution Partner",28.333333333333332,null,2,2,1,0,0,0,3,null,null,null,null,null,4488]
[4488,"A","Other","Regional","307 QLD Rural - Darling Downs","Nonmetro","F Pop <= 500",null,null,250,441.5,null,null,null,"Refer to Distribution Partner",21.666666666666668,null,2,2,0,0,0,0,3,null,null,null,null,null,4489]
[4489,"A","Other","Regional","315 QLD Rural - Outback","Nonmetro","F Pop <= 500",null,null,99,441.5,null,null,null,"Refer to Distribution Partner",21.666666666666668,null,2,2,0,0,0,0,3,null,null,null,null,null,4490]
[4490,"A","Other","Regional","315 QLD Rural - Outback","Nonmetro","E Pop > 500",null,null,1422,750.9,null,null,null,"Refer to Distribution Partner",21.666666666666668,null,2,2,0,0,0,0,3,null,null,null,null,null,4491]
[4491,"A","Other","Regional","315 QLD Rural - Outback","Nonmetro","F Pop <= 500",null,null,95,750.9,null,null,null,"Refer to Distribution Partner",21.666666666666668,null,2,2,0,0,0,0,3,null,null,null,null,null,4492]
[4492,"A","Other","Regional","315 QLD Rural - Outback","Nonmetro","F Pop <= 500",null,null,306,750.9,null,null,null,"Refer to Distribution Partner",21.666666666666668,null,2,2,0,0,0,0,3,null,null,null,null,null,4493]
[4493,"A","Other","Regional","315 QLD Rural - Outback","Nonmetro","F Pop <= 500",null,null,23,750.9,null,null,null,"Refer to Distribution Partner",21.666666666666668,null,2,2,0,0,0,0,3,null,null,null,null,null,4494]
[4494,"A","Other","Regional","307 QLD Rural - Darling Downs","Nonmetro","F Pop <= 500",null,null,151,750.9,null,null,null,"Refer to Distribution Partner",21.666666666666668,null,2,2,0,0,0,0,3,null,null,null,null,null,4496]
[4496,"A","Other","Regional","307 QLD Rural - Darling Downs","Nonmetro","F Pop <= 500",null,null,266,750.9,null,null,null,"Refer to Distribution Partner",21.666666666666668,null,2,2,0,0,0,0,3,null,null,null,null,null,4497]
[4497,"A","Other","Regional","307 QLD Rural - Darling Downs","Nonmetro","F Pop <= 500",null,null,327,750.9,null,null,null,"Refer to Distribution Partner",21.666666666666668,null,2,2,0,0,0,0,3,null,null,null,null,null,4498]
[4498,"A","Other","Regional","307 QLD Rural - Darling Downs","Nonmetro","F Pop <= 500",null,null,217,750.9,null,null,null,"Refer to Distribution Partner",21.666666666666668,null,2,2,0,0,0,0,3,null,null,null,null,null,4500]
[4500,"A","Metro","Metro","314 QLD Metro - Strathpine","Metro","A Metro",1,null,42401,20,null,null,null,"Metro",93.333333333333329,null,3,3,3,3,2,3,3,null,null,null,null,null,4501]
[4501,"A","Metro","Metro","314 QLD Metro - Strathpine","Metro","A Metro",1,null,5658,21.6,null,null,null,"Metro",86.666666666666671,null,3,3,3,3,1,3,3,null,null,null,null,null,4502]
[4502,"A","Metro","Metro","314 QLD Metro - Strathpine","Metro","A Metro",1,null,8674,23.7,null,null,null,"Metro",86.666666666666671,null,3,3,3,3,1,3,3,null,null,null,null,null,4503]
[4503,"A","Metro","Metro","314 QLD Metro - Strathpine","Metro","A Metro",null,null,43651,24.2,null,null,null,"Metro",73.333333333333343,null,3,3,3,0,2,3,3,null,null,null,null,null,4504]
[4504,"A","Metro","Metro","313 QLD Metro - Caboolture","Metro","A Metro",1,null,18573,32.700000000000003,null,null,null,"Metro",90,null,3,3,3,3,2,2,3,null,null,null,null,null,4505]
[4505,"A","Metro","Metro","313 QLD Metro - Caboolture","Metro","A Metro",1,null,20452,36.6,null,null,null,"Metro",90,null,3,3,3,3,2,2,3,null,null,null,null,null,4506]
[4506,"A","Metro","Metro","313 QLD Metro - Caboolture","Metro","A Metro",1,null,21810,40.700000000000003,null,null,null,"Metro",90,null,3,3,3,3,2,2,3,null,null,null,null,null,4507]
[4507,"A","Metro","Metro","313 QLD Metro - Caboolture","Metro","A Metro",1,null,18142,47.4,null,null,null,"Metro",90,null,3,3,3,3,2,2,3,null,null,null,null,null,4508]
[4508,"A","Metro","Metro","313 QLD Metro - Caboolture","Metro","A Metro",1,null,19850,31,null,null,null,"Metro",90,null,3,3,3,3,2,2,3,null,null,null,null,null,4509]
[4509,"A","Metro","Metro","314 QLD Metro - Strathpine","Metro","A Metro",null,null,30105,27.1,null,null,null,"Non Metro",70,null,3,3,3,0,2,2,3,null,null,null,null,null,4510]
[4510,"A","Metro","Metro","313 QLD Metro - Caboolture","Metro","A Metro",1,null,48304,43.5,null,null,null,"Metro",90,null,3,3,3,3,2,2,3,null,null,null,null,null,4511]
[4511,"A","Metro","Metro","313 QLD Metro - Caboolture","Metro","A Metro",1,null,9095,45,null,null,null,"Metro",83.333333333333343,null,3,3,3,3,1,2,3,null,null,null,null,null,4512]
[4512,"A","Metro","Metro","313 QLD Metro - Caboolture","Metro","A Metro",1,null,3442,50,null,null,null,"Metro",73.333333333333343,null,3,3,3,3,0,1,3,null,null,null,null,null,4514]
[4514,"A","Regional","Metro","313 QLD Metro - Caboolture","Metro","B Regional",2,null,7404,61.9,null,null,null,"Non Metro",66.666666666666657,null,3,3,2,2,1,1,3,null,null,null,null,null,4515]
[4515,"A","Regional","Metro","313 QLD Metro - Caboolture","Metro","B Regional",null,null,4064,75.900000000000006,null,null,null,"Regional",46.666666666666664,null,3,3,2,0,0,1,3,null,null,null,null,null,4516]
[4516,"A","Metro","Metro","313 QLD Metro - Caboolture","Metro","A Metro",1,null,3963,49.5,null,null,null,"Metro",76.666666666666671,null,3,3,3,3,0,2,3,null,null,null,null,null,4517]
[4517,"A","Regional","Metro","316 QLD Rural - Sunshine Coast","Metro","B Regional",1,null,763,57.1,null,null,null,"Non Metro",65,null,2,3,2,3,0,1,3,null,null,null,null,null,4518]
[4518,"A","Regional","Metro","316 QLD Rural - Sunshine Coast","Metro","B Regional",1,null,5065,63.3,null,null,null,{"$f":"IF(ISBLANK(N1628),IF(AND(H1628<>\"\",IF(I1628=\"High Density\",\"High Density\",IF(AND(P1628<=45,P1628>0),\"Refer to Distribution Partner\",IF(AND(P1628<=55,P1628>45),\"Regional\",IF(AND(P1628>55,P1628<=70),\"Non Metro\",IF(F1628=\"Nonmetro\",\"Non Metro\",IF(P1628>70,\"Metro\",\"\"))))))=\"Refer to Distribution Partner\"),\"Regional\",IF(I1628=\"High Density\",\"High Density\",IF(AND(P1628<=45,P1628>0),\"Refer to Distribution Partner\",IF(AND(P1628<=55,P1628>45),\"Regional\",IF(AND(P1628>55,P1628<=70),\"Non Metro\",IF(F1628=\"Nonmetro\",\"Non Metro\",IF(P1628>70,\"Metro\",\"\"))))))),N1628)","v":"Metro"},{"$f":"(R1628/$AB$3*$AA$3+S1628/$AB$4*$AA$4+T1628/$AB$5*$AA$5+U1628/$AB$6*$AA$6+V1628/$AB$7*$AA$7+W1628/$AB$8*$AA$8+X1628/$AB$9*$AA$9)*100","v":71.666666666666671},null,{"$f":"IF(ISNUMBER(SEARCH(\"Metro\",E1628)),3,IF(ISNUMBER(SEARCH(\"Rural\",E1628)),2,1))","v":2},{"$f":"IF(ISNUMBER(FIND(\"Metro\",F1628)),3,IF(ISNUMBER(FIND(\"Nonmetro\",F1628)),2,3))","v":3},{"$f":"IF(G1628=\"A Metro\",3,IF(G1628=\"B Regional\",2,IF(G1628=\"C Pop > 7,000\",1,IF(G1628=\"D Pop > 2,000\",1,0))))","v":2},{"$f":"IF(H1628=1,3,IF(H1628=2,2,IF(H1628=3,1,0)))","v":3},{"$f":"IF(J1628>=100000,3,IF(AND(J1628>=10000,J1628<100000),2,IF(AND(J1628>=5000,J1628<10000),1,0)))","v":1},{"$f":"IF(AND(K1628>=0.1,K1628<25),3,IF(AND(K1628>=25,K1628<50),2,IF(AND(K1628>=50,K1628<150),1,0)))","v":1},{"$f":"IF(L1628=\"\",3,0)","v":3},null,null,null,null,null,4519]
[4519,"A","Regional","Metro","316 QLD Rural - Sunshine Coast","Metro","B Regional",1,null,8426,68.900000000000006,null,null,null,"Metro",71.666666666666671,null,2,3,2,3,1,1,3,null,null,null,null,null,4520]
[4520,"A","Metro","Metro","314 QLD Metro - Strathpine","Metro","A Metro",1,null,13196,22.8,null,null,null,"Metro",93.333333333333329,null,3,3,3,3,2,3,3,null,null,null,null,null,4521]
[4521,"A","Metro","Metro","314 QLD Metro - Strathpine","Metro","A Metro",2,null,4730,39.5,null,null,null,"Non Metro",70,null,3,3,3,2,0,2,3,null,null,null,null,null,4550]
[4550,"A","Regional","Regional","316 QLD Rural - Sunshine Coast","Nonmetro","B Regional",1,null,4257,73.900000000000006,null,null,null,"Non Metro",58.333333333333336,null,2,2,2,3,0,1,3,null,null,null,null,null,4551]
[4551,"A","Metro","Regional","316 QLD Rural - Sunshine Coast","Nonmetro","A Metro",1,null,56733,74.8,null,null,null,"Non Metro",78.333333333333329,null,2,2,3,3,2,1,3,null,null,null,null,null,4552]
[4552,"A","Regional","Regional","316 QLD Rural - Sunshine Coast","Nonmetro","B Regional",1,null,8432,82.1,null,null,null,"Non Metro",65,null,2,2,2,3,1,1,3,null,null,null,null,null,4553]
[4553,"A","Metro","Regional","316 QLD Rural - Sunshine Coast","Nonmetro","A Metro",1,null,5891,79.900000000000006,null,null,null,"Non Metro",71.666666666666671,null,2,2,3,3,1,1,3,null,null,null,null,null,4554]
[4554,"A","Other","Regional","316 QLD Rural - Sunshine Coast","Nonmetro","E Pop > 500",1,null,1947,82.6,null,null,null,"Regional",45,null,2,2,0,3,0,1,3,null,null,null,null,null,4555]
[4555,"A","Metro","Regional","316 QLD Rural - Sunshine Coast","Nonmetro","A Metro",1,null,6925,86.6,null,null,null,"Non Metro",71.666666666666671,null,2,2,3,3,1,1,3,null,null,null,null,null,4556]
[4556,"A","Metro","Regional","316 QLD Rural - Sunshine Coast","Nonmetro","A Metro",1,null,43340,86.1,null,null,null,"Non Metro",78.333333333333329,null,2,2,3,3,2,1,3,null,null,null,null,null,4557]
[4557,"A","Metro","Regional","316 QLD Rural - Sunshine Coast","Nonmetro","A Metro",1,null,18985,87.5,null,null,null,"Non Metro",78.333333333333329,null,2,2,3,3,2,1,3,null,null,null,null,null,4558]
[4558,"A","Metro","Regional","316 QLD Rural - Sunshine Coast","Nonmetro","A Metro",1,null,19163,90.7,null,null,null,"Non Metro",78.333333333333329,null,2,2,3,3,2,1,3,null,null,null,null,null,4559]
[4559,"A","Regional","Regional","316 QLD Rural - Sunshine Coast","Nonmetro","B Regional",1,null,6321,90.3,null,null,null,"Non Metro",65,null,2,2,2,3,1,1,3,null,null,null,null,null,4560]
[4560,"A","Metro","Regional","316 QLD Rural - Sunshine Coast","Nonmetro","A Metro",1,null,31710,93.9,null,null,null,"Non Metro",78.333333333333329,null,2,2,3,3,2,1,3,null,null,null,null,null,4561]
[4561,"A","Regional","Regional","316 QLD Rural - Sunshine Coast","Nonmetro","B Regional",1,null,7212,102.2,null,null,null,"Non Metro",65,null,2,2,2,3,1,1,3,null,null,null,null,null,4562]
[4562,"A","Regional","Regional","316 QLD Rural - Sunshine Coast","Nonmetro","B Regional",1,null,8035,112.1,null,null,null,"Non Metro",65,null,2,2,2,3,1,1,3,null,null,null,null,null,4563]
[4563,"A","Regional","Regional","316 QLD Rural - Sunshine Coast","Nonmetro","B Regional",1,null,8478,117.8,null,null,null,"Non Metro",65,null,2,2,2,3,1,1,3,null,null,null,null,null,4564]
[4564,"A","Metro","Regional","316 QLD Rural - Sunshine Coast","Nonmetro","A Metro",1,null,10591,95.9,null,null,null,"Non Metro",78.333333333333329,null,2,2,3,3,2,1,3,null,null,null,null,null,4565]
[4565,"A","Metro","Regional","316 QLD Rural - Sunshine Coast","Nonmetro","A Metro",1,null,14500,121.7,null,null,null,"Non Metro",78.333333333333329,null,2,2,3,3,2,1,3,null,null,null,null,null,4566]
[4566,"A","Metro","Regional","316 QLD Rural - Sunshine Coast","Nonmetro","A Metro",1,null,8124,118.9,null,null,null,"Non Metro",71.666666666666671,null,2,2,3,3,1,1,3,null,null,null,null,null,4567]
[4567,"A","Metro","Regional","316 QLD Rural - Sunshine Coast","Nonmetro","A Metro",1,null,11016,119,null,null,null,"Non Metro",78.333333333333329,null,2,2,3,3,2,1,3,null,null,null,null,null,4568]
[4568,"A","Regional","Regional","316 QLD Rural - Sunshine Coast","Nonmetro","B Regional",2,null,3554,123.8,null,null,null,"Regional",51.666666666666671,null,2,2,2,2,0,1,3,null,null,null,null,null,4569]
[4569,"A","Other","Regional","316 QLD Rural - Sunshine Coast","Nonmetro","E Pop > 500",null,null,1624,127.2,null,null,null,"Refer to Distribution Partner",25,null,2,2,0,0,0,1,3,null,null,null,null,null,4570]
[4570,"A","Regional","Regional","319 QLD Rural - Wide Bay Burnett","Nonmetro","B Regional",2,null,42420,148.4,null,null,null,"Non Metro",65,null,2,2,2,2,2,1,3,null,null,null,null,null,4571]
[4571,"A","Other","Regional","316 QLD Rural - Sunshine Coast","Nonmetro","E Pop > 500",null,null,809,135.4,null,null,null,"Refer to Distribution Partner",25,null,2,2,0,0,0,1,3,null,null,null,null,null,4572]
[4572,"A","Metro","Regional","316 QLD Rural - Sunshine Coast","Nonmetro","A Metro",1,null,3958,89.1,null,null,null,"Non Metro",65,null,2,2,3,3,0,1,3,null,null,null,null,null,4573]
[4573,"A","Metro","Regional","316 QLD Rural - Sunshine Coast","Nonmetro","A Metro",1,null,26275,106.3,null,null,null,"Non Metro",78.333333333333329,null,2,2,3,3,2,1,3,null,null,null,null,null,4574]
[4574,"A","Other","Regional","316 QLD Rural - Sunshine Coast","Nonmetro","E Pop > 500",null,null,1298,101,null,null,null,"Refer to Distribution Partner",25,null,2,2,0,0,0,1,3,null,null,null,null,null,4575]
[4575,"A","Metro","Regional","316 QLD Rural - Sunshine Coast","Nonmetro","A Metro",1,null,23777,83.1,null,null,null,"Non Metro",78.333333333333329,null,2,2,3,3,2,1,3,null,null,null,null,null,4580]
[4580,"A","Other","Regional","319 QLD Rural - Wide Bay Burnett","Nonmetro","D Pop > 2,000",null,null,4879,172.4,null,null,null,"Refer to Distribution Partner",28.333333333333332,null,2,2,1,0,0,0,3,null,null,null,null,null,4581]
[4581,"A","Other","Regional","319 QLD Rural - Wide Bay Burnett","Nonmetro","E Pop > 500",null,null,1525,189.3,null,null,null,"Refer to Distribution Partner",21.666666666666668,null,2,2,0,0,0,0,3,null,null,null,null,null,4600]
[4600,"A","Other","Regional","319 QLD Rural - Wide Bay Burnett","Nonmetro","E Pop > 500",null,null,893,171.7,null,null,null,"Refer to Distribution Partner",21.666666666666668,null,2,2,0,0,0,0,3,null,null,null,null,null,4601]
[4601,"A","Other","Regional","319 QLD Rural - Wide Bay Burnett","Nonmetro","E Pop > 500",null,null,1167,171.8,null,null,null,"Refer to Distribution Partner",21.666666666666668,null,2,2,0,0,0,0,3,null,null,null,null,null,4605]
[4605,"A","Other","Regional","319 QLD Rural - Wide Bay Burnett","Nonmetro","D Pop > 2,000",null,null,4843,174.5,null,null,null,"Refer to Distribution Partner",28.333333333333332,null,2,2,1,0,0,0,3,null,null,null,null,null,4606]
[4606,"A","Other","Regional","319 QLD Rural - Wide Bay Burnett","Nonmetro","D Pop > 2,000",null,null,2446,171.8,null,null,null,"Refer to Distribution Partner",28.333333333333332,null,2,2,1,0,0,0,3,null,null,null,null,null,4608]
[4608,"A","Other","Regional","319 QLD Rural - Wide Bay Burnett","Nonmetro","E Pop > 500",null,null,909,171.4,null,null,null,"Refer to Distribution Partner",21.666666666666668,null,2,2,0,0,0,0,3,null,null,null,null,null,4610]
[4610,"A","Regional","Regional","319 QLD Rural - Wide Bay Burnett","Nonmetro","B Regional",3,null,14840,158.30000000000001,null,null,null,"Regional",55.000000000000007,null,2,2,2,1,2,0,3,null,null,null,null,null,4611]
[4611,"A","Other","Regional","319 QLD Rural - Wide Bay Burnett","Nonmetro","F Pop <= 500",null,null,118,0,null,null,null,"Refer to Distribution Partner",21.666666666666668,null,2,2,0,0,0,0,3,null,null,null,null,null,4612]
[4612,"A","Other","Regional","319 QLD Rural - Wide Bay Burnett","Nonmetro","F Pop <= 500",null,null,257,0,null,null,null,"Refer to Distribution Partner",21.666666666666668,null,2,2,0,0,0,0,3,null,null,null,null,null,4613]
[4613,"A","Other","Regional","319 QLD Rural - Wide Bay Burnett","Nonmetro","F Pop <= 500",null,null,861,203.3,null,null,null,"Refer to Distribution Partner",21.666666666666668,null,2,2,0,0,0,0,3,null,null,null,null,null,4614]
[4614,"A","Other","Regional","307 QLD Rural - Darling Downs","Nonmetro","E Pop > 500",null,null,1182,124.9,null,null,null,"Refer to Distribution Partner",25,null,2,2,0,0,0,1,3,null,null,null,null,null,4615]
[4615,"A","Other","Regional","319 QLD Rural - Wide Bay Burnett","Nonmetro","D Pop > 2,000",null,null,7052,136.4,null,null,"Regional","Regional",38.333333333333329,null,2,2,1,0,1,1,3,null,null,null,null,null,4620]
[4620,"A","Other","Regional","319 QLD Rural - Wide Bay Burnett","Nonmetro","E Pop > 500",null,null,400,220,null,null,null,"Refer to Distribution Partner",21.666666666666668,null,2,2,0,0,0,0,3,null,null,null,null,null,4621]
[4621,"A","Other","Regional","319 QLD Rural - Wide Bay Burnett","Nonmetro","E Pop > 500",null,null,1783,242.6,null,null,null,"Refer to Distribution Partner",21.666666666666668,null,2,2,0,0,0,0,3,null,null,null,null,null,4625]
[4625,"A","Other","Regional","319 QLD Rural - Wide Bay Burnett","Nonmetro","D Pop > 2,000",null,null,2760,248.8,null,null,null,"Refer to Distribution Partner",28.333333333333332,null,2,2,1,0,0,0,3,null,null,null,null,null,4626]
[4626,"A","Other","Regional","319 QLD Rural - Wide Bay Burnett","Nonmetro","D Pop > 2,000",null,null,2208,271.3,null,null,null,"Refer to Distribution Partner",28.333333333333332,null,2,2,1,0,0,0,3,null,null,null,null,null,4627]
[4627,"A","Other","Regional","319 QLD Rural - Wide Bay Burnett","Nonmetro","E Pop > 500",null,null,877,0,null,null,null,"Refer to Distribution Partner",21.666666666666668,null,2,2,0,0,0,0,3,null,null,null,null,null,4630]
[4630,"A","Other","Regional","319 QLD Rural - Wide Bay Burnett","Nonmetro","D Pop > 2,000",null,null,2401,346.4,null,null,null,"Refer to Distribution Partner",28.333333333333332,null,2,2,1,0,0,0,3,null,null,null,null,null,4650]
[4650,"A","Regional","Regional","319 QLD Rural - Wide Bay Burnett","Nonmetro","B Regional",3,null,33891,216.8,null,null,null,"Regional",55.000000000000007,null,2,2,2,1,2,0,3,null,null,null,null,null,4655]
[4655,"A","Regional","Regional","319 QLD Rural - Wide Bay Burnett","Nonmetro","B Regional",2,null,59539,243,null,null,null,"Non Metro",61.666666666666671,null,2,2,2,2,2,0,3,null,null,null,null,null,4659]
[4659,"A","Regional","Regional","319 QLD Rural - Wide Bay Burnett","Nonmetro","B Regional",null,null,4794,251.9,null,null,"Regional","Regional",35,null,2,2,2,0,0,0,3,null,null,null,null,null,4660]
[4660,"A","Other","Regional","319 QLD Rural - Wide Bay Burnett","Nonmetro","D Pop > 2,000",null,null,7145,265.60000000000002,null,null,null,"Refer to Distribution Partner",35,null,2,2,1,0,1,0,3,null,null,null,null,null,4662]
[4662,"A","Other","Regional","319 QLD Rural - Wide Bay Burnett","Nonmetro","E Pop > 500",null,null,791,240.2,null,null,null,"Refer to Distribution Partner",21.666666666666668,null,2,2,0,0,0,0,3,null,null,null,null,null,4670]
[4670,"A","Regional","Regional","319 QLD Rural - Wide Bay Burnett","Nonmetro","B Regional",2,null,79606,298.2,null,null,null,"Non Metro",61.666666666666671,null,2,2,2,2,2,0,3,null,null,null,null,null,4671]
[4671,"A","Other","Regional","319 QLD Rural - Wide Bay Burnett","Nonmetro","D Pop > 2,000",null,null,6061,293.89999999999998,"Mining",null,null,"Refer to Distribution Partner",30,null,2,2,1,0,1,0,0,null,null,null,null,null,4673]
[4673,"A","Other","Regional","319 QLD Rural - Wide Bay Burnett","Nonmetro","F Pop <= 500",null,null,652,319.39999999999998,"Mining",null,null,"Refer to Distribution Partner",16.666666666666664,null,2,2,0,0,0,0,0,null,null,null,null,null,4674]
[4674,"A","Other","Regional","308 QLD Rural - Rockhampton","Nonmetro","E Pop > 500",null,null,1451,347.1,null,null,null,"Refer to Distribution Partner",21.666666666666668,null,2,2,0,0,0,0,3,null,null,null,null,null,4676]
[4676,"A","Other","Regional","308 QLD Rural - Rockhampton","Nonmetro","F Pop <= 500",null,null,160,0,null,null,null,"Refer to Distribution Partner",21.666666666666668,null,2,2,0,0,0,0,3,null,null,null,null,null,4677]
[4677,"A","Regional","Regional","308 QLD Rural - Rockhampton","Nonmetro","B Regional",null,null,3549,378.9,null,null,null,"Refer to Distribution Partner",35,null,2,2,2,0,0,0,3,null,null,null,null,null,4678]
[4678,"A","Other","Regional","308 QLD Rural - Rockhampton","Nonmetro","E Pop > 500",null,null,856,396.6,null,null,null,"Refer to Distribution Partner",21.666666666666668,null,2,2,0,0,0,0,3,null,null,null,null,null,4680]
[4680,"A","Regional","Regional","308 QLD Rural - Rockhampton","Nonmetro","B Regional",2,null,54166,436.6,null,null,null,"Non Metro",61.666666666666671,null,2,2,2,2,2,0,3,null,null,null,null,null,4694]
[4694,"A","Other","Regional","308 QLD Rural - Rockhampton","Nonmetro","F Pop <= 500",null,null,189,0,"Mining",null,null,"Refer to Distribution Partner",16.666666666666664,null,2,2,0,0,0,0,0,null,null,null,null,null,4695]
[4695,"A","Other","Regional","308 QLD Rural - Rockhampton","Nonmetro","E Pop > 500",null,null,1121,456.8,null,null,null,"Refer to Distribution Partner",21.666666666666668,null,2,2,0,0,0,0,3,null,null,null,null,null,4697]
[4697,"A","Other","Regional","308 QLD Rural - Rockhampton","Nonmetro","F Pop <= 500",null,null,146,0,"Mining",null,null,{"$f":"IF(ISBLANK(N1692),IF(AND(H1692<>\"\",IF(I1692=\"High Density\",\"High Density\",IF(AND(P1692<=45,P1692>0),\"Refer to Distribution Partner\",IF(AND(P1692<=55,P1692>45),\"Regional\",IF(AND(P1692>55,P1692<=70),\"Non Metro\",IF(F1692=\"Nonmetro\",\"Non Metro\",IF(P1692>70,\"Metro\",\"\"))))))=\"Refer to Distribution Partner\"),\"Regional\",IF(I1692=\"High Density\",\"High Density\",IF(AND(P1692<=45,P1692>0),\"Refer to Distribution Partner\",IF(AND(P1692<=55,P1692>45),\"Regional\",IF(AND(P1692>55,P1692<=70),\"Non Metro\",IF(F1692=\"Nonmetro\",\"Non Metro\",IF(P1692>70,\"Metro\",\"\"))))))),N1692)","v":"Refer to Distribution Partner"},{"$f":"(R1692/$AB$3*$AA$3+S1692/$AB$4*$AA$4+T1692/$AB$5*$AA$5+U1692/$AB$6*$AA$6+V1692/$AB$7*$AA$7+W1692/$AB$8*$AA$8+X1692/$AB$9*$AA$9)*100","v":16.666666666666664},null,{"$f":"IF(ISNUMBER(SEARCH(\"Metro\",E1692)),3,IF(ISNUMBER(SEARCH(\"Rural\",E1692)),2,1))","v":2},{"$f":"IF(ISNUMBER(FIND(\"Metro\",F1692)),3,IF(ISNUMBER(FIND(\"Nonmetro\",F1692)),2,3))","v":2},{"$f":"IF(G1692=\"A Metro\",3,IF(G1692=\"B Regional\",2,IF(G1692=\"C Pop > 7,000\",1,IF(G1692=\"D Pop > 2,000\",1,0))))","v":0},{"$f":"IF(H1692=1,3,IF(H1692=2,2,IF(H1692=3,1,0)))","v":0},{"$f":"IF(J1692>=100000,3,IF(AND(J1692>=10000,J1692<100000),2,IF(AND(J1692>=5000,J1692<10000),1,0)))","v":0},{"$f":"IF(AND(K1692>=0.1,K1692<25),3,IF(AND(K1692>=25,K1692<50),2,IF(AND(K1692>=50,K1692<150),1,0)))","v":0},{"$f":"IF(L1692=\"\",3,0)","v":0},null,null,null,null,null,4699]
[4699,"A","Other","Regional","308 QLD Rural - Rockhampton","Nonmetro","E Pop > 500",null,null,455,0,"Mining",null,null,"Refer to Distribution Partner",16.666666666666664,null,2,2,0,0,0,0,0,null,null,null,null,null,4700]
[4700,"A","Regional","Regional","308 QLD Rural - Rockhampton","Nonmetro","B Regional",1,null,17437,520.29999999999995,"Mining",null,null,"Non Metro",63.333333333333329,null,2,2,2,3,2,0,0,null,null,null,null,null,4701]
[4701,"A","Regional","Regional","308 QLD Rural - Rockhampton","Nonmetro","B Regional",1,null,42762,522.4,"Mining",null,null,"Non Metro",63.333333333333329,null,2,2,2,3,2,0,0,null,null,null,null,null,4702]
[4702,"A","Regional","Regional","308 QLD Rural - Rockhampton","Nonmetro","B Regional",null,null,28609,528.20000000000005,"Mining",null,"Regional","Regional",43.333333333333336,null,2,2,2,0,2,0,0,null,null,null,null,null,4703]
[4703,"A","Regional","Regional","308 QLD Rural - Rockhampton","Nonmetro","B Regional",2,null,22530,533.4,"Mining",null,null,"Non Metro",56.666666666666664,null,2,2,2,2,2,0,0,null,null,null,null,null,4704]
[4704,"A","Other","Regional","308 QLD Rural - Rockhampton","Nonmetro","F Pop <= 500",null,null,132,0,"Mining",null,null,"Refer to Distribution Partner",16.666666666666664,null,2,2,0,0,0,0,0,null,null,null,null,null,4705]
[4705,"A","Other","Regional","312 QLD Rural - Mackay","Nonmetro","F Pop <= 500",null,null,354,0,"Mining",null,null,"Refer to Distribution Partner",16.666666666666664,null,2,2,0,0,0,0,0,null,null,null,null,null,4706]
[4706,"A","Other","Regional","308 QLD Rural - Rockhampton","Nonmetro","F Pop <= 500",null,null,105,0,null,null,null,"Refer to Distribution Partner",21.666666666666668,null,2,2,0,0,0,0,3,null,null,null,null,null,4707]
[4707,"A","Other","Regional","312 QLD Rural - Mackay","Nonmetro","F Pop <= 500",null,null,245,0,"Mining",null,null,"Refer to Distribution Partner",16.666666666666664,null,2,2,0,0,0,0,0,null,null,null,null,null,4709]
[4709,"A","Other","Regional","308 QLD Rural - Rockhampton","Nonmetro","E Pop > 500",null,null,1129,0,"Mining",null,null,"Refer to Distribution Partner",16.666666666666664,null,2,2,0,0,0,0,0,null,null,null,null,null,4710]
[4710,"A","Regional","Regional","308 QLD Rural - Rockhampton","Nonmetro","B Regional",2,null,4846,517,"Mining",null,null,"Regional",43.333333333333336,null,2,2,2,2,0,0,0,null,null,null,null,null,4711]
[4711,"A","Other","Regional","308 QLD Rural - Rockhampton","Nonmetro","E Pop > 500",1,null,1851,532.4,"Mining",null,"Non Metro","Non Metro",36.666666666666671,null,2,2,0,3,0,0,0,null,null,null,null,null,4712]
[4712,"A","Other","Regional","308 QLD Rural - Rockhampton","Nonmetro","F Pop <= 500",null,null,278,0,"Mining",null,null,"Refer to Distribution Partner",16.666666666666664,null,2,2,0,0,0,0,0,null,null,null,null,null,4713]
[4713,"A","Other","Regional","308 QLD Rural - Rockhampton","Nonmetro","E Pop > 500",null,null,962,0,null,null,null,"Refer to Distribution Partner",21.666666666666668,null,2,2,0,0,0,0,3,null,null,null,null,null,4714]
[4714,"A","Other","Regional","308 QLD Rural - Rockhampton","Nonmetro","D Pop > 2,000",null,null,2941,500.7,"Mining",null,null,"Refer to Distribution Partner",23.333333333333332,null,2,2,1,0,0,0,0,null,null,null,null,null,4715]
[4715,"A","Other","Regional","308 QLD Rural - Rockhampton","Nonmetro","C Pop > 7,000",null,null,7127,423.8,"Mining",null,null,"Refer to Distribution Partner",30,null,2,2,1,0,1,0,0,null,null,null,null,null,4716]
[4716,"A","Other","Regional","308 QLD Rural - Rockhampton","Nonmetro","E Pop > 500",null,null,887,0,"Mining",null,null,"Refer to Distribution Partner",16.666666666666664,null,2,2,0,0,0,0,0,null,null,null,null,null,4717]
[4717,"A","Other","Regional","308 QLD Rural - Rockhampton","Nonmetro","D Pop > 2,000",null,null,4749,600.1,"Mining",null,null,"Refer to Distribution Partner",23.333333333333332,null,2,2,1,0,0,0,0,null,null,null,null,null,4718]
[4718,"A","Other","Regional","308 QLD Rural - Rockhampton","Nonmetro","D Pop > 2,000",null,null,2375,443.2,"Mining",null,null,"Refer to Distribution Partner",23.333333333333332,null,2,2,1,0,0,0,0,null,null,null,null,null,4719]
[4719,"A","Other","Regional","308 QLD Rural - Rockhampton","Nonmetro","E Pop > 500",null,null,1007,395.6,"Mining",null,null,"Refer to Distribution Partner",16.666666666666664,null,2,2,0,0,0,0,0,null,null,null,null,null,4720]
[4720,"A","Regional","Regional","308 QLD Rural - Rockhampton","Nonmetro","B Regional",2,null,14394,655.5,"Mining",null,null,"Non Metro",56.666666666666664,null,2,2,2,2,2,0,0,null,null,null,null,null,4721]
[4721,"A","Other","Regional","312 QLD Rural - Mackay","Nonmetro","D Pop > 2,000",null,null,3717,748.6,"Mining",null,null,"Refer to Distribution Partner",23.333333333333332,null,2,2,1,0,0,0,0,null,null,null,null,null,4722]
[4722,"A","Other","Regional","308 QLD Rural - Rockhampton","Nonmetro","E Pop > 500",null,null,1816,618.6,"Mining",null,null,"Refer to Distribution Partner",16.666666666666664,null,2,2,0,0,0,0,0,null,null,null,null,null,4723]
[4723,"A","Other","Regional","308 QLD Rural - Rockhampton","Nonmetro","E Pop > 500",null,null,1424,0,"Mining",null,null,"Refer to Distribution Partner",16.666666666666664,null,2,2,0,0,0,0,0,null,null,null,null,null,4724]
[4724,"A","Other","Regional","315 QLD Rural - Outback","Nonmetro","E Pop > 500",null,null,579,0,null,null,null,"Refer to Distribution Partner",21.666666666666668,null,2,2,0,0,0,0,3,null,null,null,null,null,4725]
[4725,"A","Other","Regional","315 QLD Rural - Outback","Nonmetro","E Pop > 500",null,null,1539,889.8,null,null,null,"Refer to Distribution Partner",21.666666666666668,null,2,2,0,0,0,0,3,null,null,null,null,null,4726]
[4726,"A","Other","Regional","315 QLD Rural - Outback","Nonmetro","E Pop > 500",null,null,411,928.7,null,null,null,"Refer to Distribution Partner",21.666666666666668,null,2,2,0,0,0,0,3,null,null,null,null,null,4727]
[4727,"A","Other","Regional","315 QLD Rural - Outback","Nonmetro","F Pop <= 500",null,null,259,928.7,null,null,null,"Refer to Distribution Partner",21.666666666666668,null,2,2,0,0,0,0,3,null,null,null,null,null,4728]
[4728,"A","Other","Regional","315 QLD Rural - Outback","Nonmetro","F Pop <= 500",null,null,201,928.7,null,null,null,"Refer to Distribution Partner",21.666666666666668,null,2,2,0,0,0,0,3,null,null,null,null,null,4730]
[4730,"A","Other","Regional","315 QLD Rural - Outback","Nonmetro","D Pop > 2,000",null,null,3230,987.6,null,null,null,"Refer to Distribution Partner",28.333333333333332,null,2,2,1,0,0,0,3,null,null,null,null,null,4731]
[4731,"A","Other","Regional","315 QLD Rural - Outback","Nonmetro","F Pop <= 500",null,null,218,987.6,null,null,null,"Refer to Distribution Partner",21.666666666666668,null,2,2,0,0,0,0,3,null,null,null,null,null,4732]
[4732,"A","Other","Regional","315 QLD Rural - Outback","Nonmetro","F Pop <= 500",null,null,134,987.6,null,null,null,"Refer to Distribution Partner",21.666666666666668,null,2,2,0,0,0,0,3,null,null,null,null,null,4733]
[4733,"A","Other","Regional","315 QLD Rural - Outback","Nonmetro","F Pop <= 500",null,null,183,987.6,null,null,null,"Refer to Distribution Partner",21.666666666666668,null,2,2,0,0,0,0,3,null,null,null,null,null,4735]
[4735,"A","Other","Regional","315 QLD Rural - Outback","Nonmetro","E Pop > 500",null,null,967,1154.2,null,null,null,"Refer to Distribution Partner",21.666666666666668,null,2,2,0,0,0,0,3,null,null,null,null,null,4736]
[4736,"A","Other","Regional","315 QLD Rural - Outback","Nonmetro","F Pop <= 500",null,null,106,1154.2,null,null,null,"Refer to Distribution Partner",21.666666666666668,null,2,2,0,0,0,0,3,null,null,null,null,null,4737]
[4737,"A","Regional","Regional","312 QLD Rural - Mackay","Nonmetro","B Regional",3,null,8137,773.8,"Mining",null,null,"Regional",43.333333333333329,null,2,2,2,1,1,0,0,null,null,null,null,null,4738]
[4738,"A","Other","Regional","312 QLD Rural - Mackay","Nonmetro","E Pop > 500",null,null,1180,748.9,"Mining",null,null,"Refer to Distribution Partner",16.666666666666664,null,2,2,0,0,0,0,0,null,null,null,null,null,4739]
[4739,"A","Other","Regional","312 QLD Rural - Mackay","Nonmetro","F Pop <= 500",null,null,333,748.9,"Mining",null,null,"Refer to Distribution Partner",16.666666666666664,null,2,2,0,0,0,0,0,null,null,null,null,null,4740]
[4740,"A","Regional","Regional","312 QLD Rural - Mackay","Nonmetro","B Regional",1,null,80089,806.5,"Mining",null,null,"Non Metro",63.333333333333329,null,2,2,2,3,2,0,0,null,null,null,null,null,4741]
[4741,"A","Other","Regional","312 QLD Rural - Mackay","Nonmetro","C Pop > 7,000",null,null,7079,814.7,"Mining",null,null,"Refer to Distribution Partner",30,null,2,2,1,0,1,0,0,null,null,null,null,null,4742]
[4742,"A","Other","Regional","312 QLD Rural - Mackay","Nonmetro","E Pop > 500",null,null,1140,777.8,"Mining",null,null,"Refer to Distribution Partner",16.666666666666664,null,2,2,0,0,0,0,0,null,null,null,null,null,4743]
[4743,"A","Other","Regional","312 QLD Rural - Mackay","Nonmetro","E Pop > 500",null,null,620,777.8,"Mining",null,null,"Refer to Distribution Partner",16.666666666666664,null,2,2,0,0,0,0,0,null,null,null,null,null,4744]
[4744,"A","Other","Regional","312 QLD Rural - Mackay","Nonmetro","C Pop > 7,000",null,null,8735,787.8,"Mining",null,null,"Refer to Distribution Partner",30,null,2,2,1,0,1,0,0,null,null,null,null,null,4745]
[4745,"A","Other","Regional","312 QLD Rural - Mackay","Nonmetro","D Pop > 2,000",null,null,2991,718.7,"Mining",null,null,"Refer to Distribution Partner",23.333333333333332,null,2,2,1,0,0,0,0,null,null,null,null,null,4746]
[4746,"A","Other","Regional","312 QLD Rural - Mackay","Nonmetro","E Pop > 500",null,null,1935,718.7,"Mining",null,null,"Refer to Distribution Partner",16.666666666666664,null,2,2,0,0,0,0,0,null,null,null,null,null,4750]
[4750,"A","Regional","Regional","312 QLD Rural - Mackay","Nonmetro","B Regional",1,null,5747,816.8,"Mining",null,null,"Non Metro",56.666666666666664,null,2,2,2,3,1,0,0,null,null,null,null,null,4751]
[4751,"A","Regional","Regional","312 QLD Rural - Mackay","Nonmetro","B Regional",1,null,4501,807.8,"Mining",null,null,"Regional",50,null,2,2,2,3,0,0,0,null,null,null,null,null,4753]
[4753,"A","Other","Regional","312 QLD Rural - Mackay","Nonmetro","D Pop > 2,000",2,null,4282,814.4,"Mining",null,"Regional","Regional",36.666666666666671,null,2,2,1,2,0,0,0,null,null,null,null,null,4754]
[4754,"A","Other","Regional","312 QLD Rural - Mackay","Nonmetro","E Pop > 500",null,null,2246,818.5,"Mining",null,null,"Refer to Distribution Partner",16.666666666666664,null,2,2,0,0,0,0,0,null,null,null,null,null,4756]
[4756,"A","Other","Regional","312 QLD Rural - Mackay","Nonmetro","E Pop > 500",null,null,609,833.4,"Mining",null,null,"Refer to Distribution Partner",16.666666666666664,null,2,2,0,0,0,0,0,null,null,null,null,null,4757]
[4757,"A","Other","Regional","312 QLD Rural - Mackay","Nonmetro","F Pop <= 500",null,null,347,833.4,"Mining",null,null,"Refer to Distribution Partner",16.666666666666664,null,2,2,0,0,0,0,0,null,null,null,null,null,4798]
[4798,"A","Other","Regional","312 QLD Rural - Mackay","Nonmetro","E Pop > 500",null,null,688,851.2,"Mining",null,null,"Refer to Distribution Partner",16.666666666666664,null,2,2,0,0,0,0,0,null,null,null,null,null,4799]
[4799,"A","Other","Regional","312 QLD Rural - Mackay","Nonmetro","E Pop > 500",null,null,1058,877.9,"Mining",null,null,"Refer to Distribution Partner",16.666666666666664,null,2,2,0,0,0,0,0,null,null,null,null,null,4800]
[4800,"A","Other","Regional","312 QLD Rural - Mackay","Nonmetro","C Pop > 7,000",3,null,9324,911.2,"Mining",null,null,"Regional",36.666666666666664,null,2,2,1,1,1,0,0,null,null,null,null,null,4801]
[4801,"A","Other","Regional","312 QLD Rural - Mackay","Nonmetro","F Pop <= 500",null,null,264,911.2,null,null,null,"Refer to Distribution Partner",21.666666666666668,null,2,2,0,0,0,0,3,null,null,null,null,null,4802]
[4802,"A","Regional","Regional","312 QLD Rural - Mackay","Nonmetro","B Regional",2,null,9832,912.2,"Mining",null,null,"Regional",50,null,2,2,2,2,1,0,0,null,null,null,null,null,4803]
[4803,"A","Other","Regional","312 QLD Rural - Mackay","Nonmetro","E Pop > 500",null,null,1867,912.2,null,null,null,"Refer to Distribution Partner",21.666666666666668,null,2,2,0,0,0,0,3,null,null,null,null,null,4804]
[4804,"A","Other","Regional","312 QLD Rural - Mackay","Nonmetro","D Pop > 2,000",null,null,1730,930.5,"Mining",null,null,"Refer to Distribution Partner",23.333333333333332,null,2,2,1,0,0,0,0,null,null,null,null,null,4805]
[4805,"A","Regional","Regional","312 QLD Rural - Mackay","Nonmetro","B Regional",3,null,10828,962.4,"Mining",null,null,"Regional",50,null,2,2,2,1,2,0,0,null,null,null,null,null,4806]
[4806,"A","Other","Regional","318 QLD Rural - Townsville","Nonmetro","D Pop > 2,000",null,null,3874,1037.8,null,null,null,"Refer to Distribution Partner",28.333333333333332,null,2,2,1,0,0,0,3,null,null,null,null,null,4807]
[4807,"A","Other","Regional","318 QLD Rural - Townsville","Nonmetro","C Pop > 7,000",3,null,11038,1048.0999999999999,null,null,null,"Regional",48.333333333333336,null,2,2,1,1,2,0,3,null,null,null,null,null,4808]
[4808,"A","Other","Regional","318 QLD Rural - Townsville","Nonmetro","E Pop > 500",3,null,1113,1053.4000000000001,null,null,"Regional","Regional",28.333333333333332,null,2,2,0,1,0,0,3,null,null,null,null,null,4809]
[4809,"A","Other","Regional","318 QLD Rural - Townsville","Nonmetro","E Pop > 500",null,null,1001,1069.5,null,null,null,"Refer to Distribution Partner",21.666666666666668,null,2,2,0,0,0,0,3,null,null,null,null,null,4810]
[4810,"A","Regional","Regional","318 QLD Rural - Townsville","Nonmetro","B Regional",1,null,21836,1111.7,null,null,null,{"$f":"IF(ISBLANK(N1756),IF(AND(H1756<>\"\",IF(I1756=\"High Density\",\"High Density\",IF(AND(P1756<=45,P1756>0),\"Refer to Distribution Partner\",IF(AND(P1756<=55,P1756>45),\"Regional\",IF(AND(P1756>55,P1756<=70),\"Non Metro\",IF(F1756=\"Nonmetro\",\"Non Metro\",IF(P1756>70,\"Metro\",\"\"))))))=\"Refer to Distribution Partner\"),\"Regional\",IF(I1756=\"High Density\",\"High Density\",IF(AND(P1756<=45,P1756>0),\"Refer to Distribution Partner\",IF(AND(P1756<=55,P1756>45),\"Regional\",IF(AND(P1756>55,P1756<=70),\"Non Metro\",IF(F1756=\"Nonmetro\",\"Non Metro\",IF(P1756>70,\"Metro\",\"\"))))))),N1756)","v":"Non Metro"},{"$f":"(R1756/$AB$3*$AA$3+S1756/$AB$4*$AA$4+T1756/$AB$5*$AA$5+U1756/$AB$6*$AA$6+V1756/$AB$7*$AA$7+W1756/$AB$8*$AA$8+X1756/$AB$9*$AA$9)*100","v":68.333333333333329},null,{"$f":"IF(ISNUMBER(SEARCH(\"Metro\",E1756)),3,IF(ISNUMBER(SEARCH(\"Rural\",E1756)),2,1))","v":2},{"$f":"IF(ISNUMBER(FIND(\"Metro\",F1756)),3,IF(ISNUMBER(FIND(\"Nonmetro\",F1756)),2,3))","v":2},{"$f":"IF(G1756=\"A Metro\",3,IF(G1756=\"B Regional\",2,IF(G1756=\"C Pop > 7,000\",1,IF(G1756=\"D Pop > 2,000\",1,0))))","v":2},{"$f":"IF(H1756=1,3,IF(H1756=2,2,IF(H1756=3,1,0)))","v":3},{"$f":"IF(J1756>=100000,3,IF(AND(J1756>=10000,J1756<100000),2,IF(AND(J1756>=5000,J1756<10000),1,0)))","v":2},{"$f":"IF(AND(K1756>=0.1,K1756<25),3,IF(AND(K1756>=25,K1756<50),2,IF(AND(K1756>=50,K1756<150),1,0)))","v":0},{"$f":"IF(L1756=\"\",3,0)","v":3},null,null,null,null,null,4811]
[4811,"A","Regional","Regional","318 QLD Rural - Townsville","Nonmetro","B Regional",1,null,13142,1107.0999999999999,null,null,null,"Non Metro",68.333333333333329,null,2,2,2,3,2,0,3,null,null,null,null,null,4812]
[4812,"A","Regional","Regional","318 QLD Rural - Townsville","Nonmetro","B Regional",1,null,18804,1110.0999999999999,null,null,null,"Non Metro",68.333333333333329,null,2,2,2,3,2,0,3,null,null,null,null,null,4814]
[4814,"A","Regional","Regional","318 QLD Rural - Townsville","Nonmetro","B Regional",1,null,46124,1110.9000000000001,null,null,null,"Non Metro",68.333333333333329,null,2,2,2,3,2,0,3,null,null,null,null,null,4815]
[4815,"A","Regional","Regional","318 QLD Rural - Townsville","Nonmetro","B Regional",1,null,21032,1106.5999999999999,null,null,null,"Non Metro",68.333333333333329,null,2,2,2,3,2,0,3,null,null,null,null,null,4816]
[4816,"A","Other","Regional","318 QLD Rural - Townsville","Nonmetro","C Pop > 7,000",3,null,9270,1118.5999999999999,null,null,null,"Regional",41.666666666666664,null,2,2,1,1,1,0,3,null,null,null,null,null,4817]
[4817,"A","Regional","Regional","318 QLD Rural - Townsville","Nonmetro","B Regional",1,null,30413,1113,null,null,null,"Non Metro",68.333333333333329,null,2,2,2,3,2,0,3,null,null,null,null,null,4818]
[4818,"A","Regional","Regional","318 QLD Rural - Townsville","Nonmetro","B Regional",1,null,28218,1123.0999999999999,null,null,null,"Non Metro",68.333333333333329,null,2,2,2,3,2,0,3,null,null,null,null,null,4819]
[4819,"A","Regional","Regional","318 QLD Rural - Townsville","Nonmetro","B Regional",1,null,2335,1119.0999999999999,null,null,null,"Regional",55.000000000000007,null,2,2,2,3,0,0,3,null,null,null,null,null,4820]
[4820,"A","Other","Regional","318 QLD Rural - Townsville","Nonmetro","C Pop > 7,000",3,null,10843,1071.5999999999999,"Mining",null,null,"Regional",43.333333333333336,null,2,2,1,1,2,0,0,null,null,null,null,null,4821]
[4821,"A","Other","Regional","315 QLD Rural - Outback","Nonmetro","E Pop > 500",3,null,1320,1159.2,null,null,"Regional","Regional",28.333333333333332,null,2,2,0,1,0,0,3,null,null,null,null,null,4822]
[4822,"A","Other","Regional","315 QLD Rural - Outback","Nonmetro","E Pop > 500",null,null,791,1251.3,null,null,null,"Refer to Distribution Partner",21.666666666666668,null,2,2,0,0,0,0,3,null,null,null,null,null,4823]
[4823,"A","Other","Regional","315 QLD Rural - Outback","Nonmetro","E Pop > 500",3,null,925,1251.3,"Mining",null,"Regional","Regional",23.333333333333332,null,2,2,0,1,0,0,0,null,null,null,null,null,4824]
[4824,"A","Other","Regional","315 QLD Rural - Outback","Nonmetro","D Pop > 2,000",null,null,2769,1476.6,"Mining",null,null,"Refer to Distribution Partner",23.333333333333332,null,2,2,1,0,0,0,0,null,null,null,null,null,4825]
[4825,"A","Regional","Regional","315 QLD Rural - Outback","Nonmetro","B Regional",3,null,19246,1563.3,"Mining",null,null,"Regional",50,null,2,2,2,1,2,0,0,null,null,null,null,null,4828]
[4828,"A","Other","Regional","315 QLD Rural - Outback","Nonmetro","F Pop <= 500",null,null,208,0,null,null,null,"Refer to Distribution Partner",21.666666666666668,null,2,2,0,0,0,0,3,null,null,null,null,null,4829]
[4829,"A","Other","Regional","315 QLD Rural - Outback","Nonmetro","E Pop > 500",null,null,465,0,null,null,null,"Refer to Distribution Partner",21.666666666666668,null,2,2,0,0,0,0,3,null,null,null,null,null,4830]
[4830,"A","Other","Regional","315 QLD Rural - Outback","Nonmetro","E Pop > 500",null,null,1714,0,null,null,null,"Refer to Distribution Partner",21.666666666666668,null,2,2,0,0,0,0,3,null,null,null,null,null,4849]
[4849,"A","Other","Regional","306 QLD Rural - Cairns","Nonmetro","E Pop > 500",null,null,1372,1249.0999999999999,null,null,null,"Refer to Distribution Partner",21.666666666666668,null,2,2,0,0,0,0,3,null,null,null,null,null,4850]
[4850,"A","Other","Regional","318 QLD Rural - Townsville","Nonmetro","C Pop > 7,000",3,null,10918,1202.9000000000001,null,null,null,"Regional",48.333333333333336,null,2,2,1,1,2,0,3,null,null,null,null,null,4852]
[4852,"A","Other","Regional","306 QLD Rural - Cairns","Nonmetro","D Pop > 2,000",null,null,3686,1279.4000000000001,null,null,null,"Refer to Distribution Partner",28.333333333333332,null,2,2,1,0,0,0,3,null,null,null,null,null,4854]
[4854,"A","Other","Regional","306 QLD Rural - Cairns","Nonmetro","D Pop > 2,000",null,null,5481,1283.5,null,null,null,"Refer to Distribution Partner",35,null,2,2,1,0,1,0,3,null,null,null,null,null,4855]
[4855,"A","Other","Regional","306 QLD Rural - Cairns","Nonmetro","E Pop > 500",null,null,766,1292.0999999999999,null,null,null,"Refer to Distribution Partner",21.666666666666668,null,2,2,0,0,0,0,3,null,null,null,null,null,4856]
[4856,"A","Other","Regional","306 QLD Rural - Cairns","Nonmetro","E Pop > 500",null,null,706,1299.5,null,null,null,"Refer to Distribution Partner",21.666666666666668,null,2,2,0,0,0,0,3,null,null,null,null,null,4858]
[4858,"A","Other","Regional","306 QLD Rural - Cairns","Nonmetro","E Pop > 500",null,null,1487,1309.7,null,null,null,"Refer to Distribution Partner",21.666666666666668,null,2,2,0,0,0,0,3,null,null,null,null,null,4859]
[4859,"A","Other","Regional","306 QLD Rural - Cairns","Nonmetro","F Pop <= 500",null,null,463,0,null,null,null,"Refer to Distribution Partner",21.666666666666668,null,2,2,0,0,0,0,3,null,null,null,null,null,4860]
[4860,"A","Other","Regional","306 QLD Rural - Cairns","Nonmetro","C Pop > 7,000",3,null,11296,1318.7,null,null,null,"Regional",48.333333333333336,null,2,2,1,1,2,0,3,null,null,null,null,null,4861]
[4861,"A","Other","Regional","306 QLD Rural - Cairns","Nonmetro","E Pop > 500",null,null,1453,1340.4,null,null,null,"Refer to Distribution Partner",21.666666666666668,null,2,2,0,0,0,0,3,null,null,null,null,null,4865]
[4865,"A","Regional","Regional","306 QLD Rural - Cairns","Nonmetro","B Regional",1,null,8119,1372.7,null,null,null,"Non Metro",61.666666666666671,null,2,2,2,3,1,0,3,null,null,null,null,null,4868]
[4868,"A","Regional","Regional","306 QLD Rural - Cairns","Nonmetro","B Regional",1,null,22063,1387,null,null,null,"Non Metro",68.333333333333329,null,2,2,2,3,2,0,3,null,null,null,null,null,4869]
[4869,"A","Regional","Regional","306 QLD Rural - Cairns","Nonmetro","B Regional",1,null,19010,1382.6,null,null,null,"Non Metro",68.333333333333329,null,2,2,2,3,2,0,3,null,null,null,null,null,4870]
[4870,"A","Regional","Regional","306 QLD Rural - Cairns","Nonmetro","B Regional",1,null,71009,1393,null,null,null,"Non Metro",68.333333333333329,null,2,2,2,3,2,0,3,null,null,null,null,null,4871]
[4871,"A","Other","Regional","315 QLD Rural - Outback","Nonmetro","C Pop > 7,000",null,null,10978,1372.5,null,null,null,"Refer to Distribution Partner",41.666666666666671,null,2,2,1,0,2,0,3,null,null,null,null,null,4872]
[4872,"A","Other","Regional","306 QLD Rural - Cairns","Nonmetro","D Pop > 2,000",null,null,3902,1375.4,null,null,null,"Refer to Distribution Partner",28.333333333333332,null,2,2,1,0,0,0,3,null,null,null,null,null,4873]
[4873,"A","Other","Regional","306 QLD Rural - Cairns","Nonmetro","D Pop > 2,000",null,null,6458,1461.9,null,null,null,"Refer to Distribution Partner",35,null,2,2,1,0,1,0,3,null,null,null,null,null,4874]
[4874,"A","Other","Regional","315 QLD Rural - Outback","Nonmetro","D Pop > 2,000",null,null,5240,2016.6,"Mining",null,null,"Refer to Distribution Partner",30,null,2,2,1,0,1,0,0,null,null,null,null,null,4875]
[4875,"A","Other","Regional","315 QLD Rural - Outback","Nonmetro","C Pop > 7,000",null,null,8101,0,null,null,null,"Refer to Distribution Partner",35,null,2,2,1,0,1,0,3,null,null,null,null,null,4876]
[4876,"A","Other","Regional","315 QLD Rural - Outback","Nonmetro","D Pop > 2,000",null,null,2827,0,null,null,null,"Refer to Distribution Partner",28.333333333333332,null,2,2,1,0,0,0,3,null,null,null,null,null,4877]
[4877,"A","Metro","Regional","306 QLD Rural - Cairns","Nonmetro","A Metro",2,null,5141,1446.1,null,null,null,"Non Metro",61.666666666666671,null,2,2,3,2,1,0,3,null,null,null,null,null,4878]
[4878,"A","Regional","Regional","306 QLD Rural - Cairns","Nonmetro","B Regional",1,null,13486,1402.1,null,null,null,"Non Metro",68.333333333333329,null,2,2,2,3,2,0,3,null,null,null,null,null,4879]
[4879,"A","Regional","Regional","306 QLD Rural - Cairns","Nonmetro","B Regional",1,null,19447,1409.3,null,null,null,"Non Metro",68.333333333333329,null,2,2,2,3,2,0,3,null,null,null,null,null,4880]
[4880,"A","Other","Regional","306 QLD Rural - Cairns","Nonmetro","C Pop > 7,000",3,null,13295,1401.6,null,null,null,"Regional",48.333333333333336,null,2,2,1,1,2,0,3,null,null,null,null,null,4881]
[4881,"A","Regional","Regional","306 QLD Rural - Cairns","Nonmetro","B Regional",2,null,4496,1406.6,null,null,null,"Regional",48.333333333333336,null,2,2,2,2,0,0,3,null,null,null,null,null,4882]
[4882,"A","Other","Regional","306 QLD Rural - Cairns","Nonmetro","D Pop > 2,000",null,null,2718,1379.7,null,null,null,"Refer to Distribution Partner",28.333333333333332,null,2,2,1,0,0,0,3,null,null,null,null,null,4883]
[4883,"A","Regional","Regional","306 QLD Rural - Cairns","Nonmetro","B Regional",2,null,8428,1374,null,null,null,"Regional",55.000000000000007,null,2,2,2,2,1,0,3,null,null,null,null,null,4884]
[4884,"A","Other","Regional","306 QLD Rural - Cairns","Nonmetro","E Pop > 500",null,null,1870,1365.9,null,null,null,"Refer to Distribution Partner",21.666666666666668,null,2,2,0,0,0,0,3,null,null,null,null,null,4885]
[4885,"A","Other","Regional","306 QLD Rural - Cairns","Nonmetro","D Pop > 2,000",null,null,3803,1357.2,null,null,null,"Refer to Distribution Partner",28.333333333333332,null,2,2,1,0,0,0,3,null,null,null,null,null,4886]
[4886,"A","Other","Regional","306 QLD Rural - Cairns","Nonmetro","E Pop > 500",null,null,846,1343,null,null,null,"Refer to Distribution Partner",21.666666666666668,null,2,2,0,0,0,0,3,null,null,null,null,null,4887]
[4887,"A","Other","Regional","306 QLD Rural - Cairns","Nonmetro","D Pop > 2,000",null,null,2038,1367.3,null,null,null,"Refer to Distribution Partner",28.333333333333332,null,2,2,1,0,0,0,3,null,null,null,null,null,4888]
[4888,"A","Other","Regional","306 QLD Rural - Cairns","Nonmetro","D Pop > 2,000",null,null,3097,1340.7,null,null,null,"Refer to Distribution Partner",28.333333333333332,null,2,2,1,0,0,0,3,null,null,null,null,null,4890]
[4890,"A","Other","Regional","315 QLD Rural - Outback","Nonmetro","E Pop > 500",null,null,1282,0,null,null,null,"Refer to Distribution Partner",21.666666666666668,null,2,2,0,0,0,0,3,null,null,null,null,null,4891]
[4891,"A","Other","Regional","315 QLD Rural - Outback","Nonmetro","E Pop > 500",null,null,531,0,null,null,null,"Refer to Distribution Partner",21.666666666666668,null,2,2,0,0,0,0,3,null,null,null,null,null,4892]
[4892,"A","Other","Regional","Unknown","Nonmetro","D Pop > 2,000",null,null,5614,0,null,null,null,"Refer to Distribution Partner",33.333333333333329,null,1,2,1,0,1,0,3,null,null,null,null,null,4895]
[4895,"A","Other","Regional","315 QLD Rural - Outback","Nonmetro","D Pop > 2,000",null,null,4453,1557.2,null,null,null,"Refer to Distribution Partner",28.333333333333332,null,2,2,1,0,0,0,3,null,null,null,null,null,5000]
[5000,"A","Metro","Inner City","401 SA  Metro - CBD & Adelaide Hills","Metro","A Metro",1,null,15115,1.1000000000000001,null,null,null,"Metro",93.333333333333329,null,3,3,3,3,2,3,3,null,null,null,null,null,5006]
[5006,"A","Metro","Metro","401 SA  Metro - CBD & Adelaide Hills","Metro","A Metro",1,null,6950,2.4,null,null,null,"Metro",86.666666666666671,null,3,3,3,3,1,3,3,null,null,null,null,null,5007]
[5007,"A","Metro","Metro","404 SA  Metro - Port Adelaide","Metro","A Metro",1,null,7084,3.9,null,null,null,"Metro",86.666666666666671,null,3,3,3,3,1,3,3,null,null,null,null,null,5008]
[5008,"A","Metro","Metro","404 SA  Metro - Port Adelaide","Metro","A Metro",1,null,13681,5.3,null,null,null,"Metro",93.333333333333329,null,3,3,3,3,2,3,3,null,null,null,null,null,5009]
[5009,"A","Metro","Metro","404 SA  Metro - Port Adelaide","Metro","A Metro",1,null,5030,5.8,null,null,null,"Metro",86.666666666666671,null,3,3,3,3,1,3,3,null,null,null,null,null,5010]
[5010,"A","Metro","Metro","404 SA  Metro - Port Adelaide","Metro","A Metro",1,null,5853,7.5,null,null,null,"Metro",86.666666666666671,null,3,3,3,3,1,3,3,null,null,null,null,null,5011]
[5011,"A","Metro","Metro","404 SA  Metro - Port Adelaide","Metro","A Metro",1,null,11712,7.9,null,null,null,"Metro",93.333333333333329,null,3,3,3,3,2,3,3,null,null,null,null,null,5012]
[5012,"A","Metro","Metro","404 SA  Metro - Port Adelaide","Metro","A Metro",1,null,11170,8.6,null,null,null,"Metro",93.333333333333329,null,3,3,3,3,2,3,3,null,null,null,null,null,5013]
[5013,"A","Metro","Metro","404 SA  Metro - Port Adelaide","Metro","A Metro",1,null,9985,10.7,null,null,null,"Metro",86.666666666666671,null,3,3,3,3,1,3,3,null,null,null,null,null,5014]
[5014,"A","Metro","Metro","404 SA  Metro - Port Adelaide","Metro","A Metro",1,null,11767,10.1,null,null,null,"Metro",93.333333333333329,null,3,3,3,3,2,3,3,null,null,null,null,null,5015]
[5015,"A","Metro","Metro","404 SA  Metro - Port Adelaide","Metro","A Metro",1,null,5697,13,null,null,null,{"$f":"IF(ISBLANK(N1820),IF(AND(H1820<>\"\",IF(I1820=\"High Density\",\"High Density\",IF(AND(P1820<=45,P1820>0),\"Refer to Distribution Partner\",IF(AND(P1820<=55,P1820>45),\"Regional\",IF(AND(P1820>55,P1820<=70),\"Non Metro\",IF(F1820=\"Nonmetro\",\"Non Metro\",IF(P1820>70,\"Metro\",\"\"))))))=\"Refer to Distribution Partner\"),\"Regional\",IF(I1820=\"High Density\",\"High Density\",IF(AND(P1820<=45,P1820>0),\"Refer to Distribution Partner\",IF(AND(P1820<=55,P1820>45),\"Regional\",IF(AND(P1820>55,P1820<=70),\"Non Metro\",IF(F1820=\"Nonmetro\",\"Non Metro\",IF(P1820>70,\"Metro\",\"\"))))))),N1820)","v":"Metro"},{"$f":"(R1820/$AB$3*$AA$3+S1820/$AB$4*$AA$4+T1820/$AB$5*$AA$5+U1820/$AB$6*$AA$6+V1820/$AB$7*$AA$7+W1820/$AB$8*$AA$8+X1820/$AB$9*$AA$9)*100","v":86.666666666666671},null,{"$f":"IF(ISNUMBER(SEARCH(\"Metro\",E1820)),3,IF(ISNUMBER(SEARCH(\"Rural\",E1820)),2,1))","v":3},{"$f":"IF(ISNUMBER(FIND(\"Metro\",F1820)),3,IF(ISNUMBER(FIND(\"Nonmetro\",F1820)),2,3))","v":3},{"$f":"IF(G1820=\"A Metro\",3,IF(G1820=\"B Regional\",2,IF(G1820=\"C Pop > 7,000\",1,IF(G1820=\"D Pop > 2,000\",1,0))))","v":3},{"$f":"IF(H1820=1,3,IF(H1820=2,2,IF(H1820=3,1,0)))","v":3},{"$f":"IF(J1820>=100000,3,IF(AND(J1820>=10000,J1820<100000),2,IF(AND(J1820>=5000,J1820<10000),1,0)))","v":1},{"$f":"IF(AND(K1820>=0.1,K1820<25),3,IF(AND(K1820>=25,K1820<50),2,IF(AND(K1820>=50,K1820<150),1,0)))","v":3},{"$f":"IF(L1820=\"\",3,0)","v":3},null,null,null,null,null,5016]
[5016,"A","Metro","Metro","404 SA  Metro - Port Adelaide","Metro","A Metro",1,null,8851,15,null,null,null,"Metro",86.666666666666671,null,3,3,3,3,1,3,3,null,null,null,null,null,5017]
[5017,"A","Metro","Metro","404 SA  Metro - Port Adelaide","Metro","A Metro",1,null,5025,16.5,null,null,null,"Metro",86.666666666666671,null,3,3,3,3,1,3,3,null,null,null,null,null,5018]
[5018,"A","Metro","Metro","404 SA  Metro - Port Adelaide","Metro","A Metro",1,null,5567,18.5,null,null,null,"Metro",86.666666666666671,null,3,3,3,3,1,3,3,null,null,null,null,null,5019]
[5019,"A","Metro","Metro","404 SA  Metro - Port Adelaide","Metro","A Metro",1,null,9122,13.8,null,null,null,"Metro",86.666666666666671,null,3,3,3,3,1,3,3,null,null,null,null,null,5020]
[5020,"A","Metro","Metro","404 SA  Metro - Port Adelaide","Metro","A Metro",1,null,3112,12.6,null,null,null,"Metro",80,null,3,3,3,3,0,3,3,null,null,null,null,null,5021]
[5021,"A","Metro","Metro","404 SA  Metro - Port Adelaide","Metro","A Metro",1,null,5787,11.3,null,null,null,"Metro",86.666666666666671,null,3,3,3,3,1,3,3,null,null,null,null,null,5022]
[5022,"A","Metro","Metro","404 SA  Metro - Port Adelaide","Metro","A Metro",1,null,15743,9.8000000000000007,null,null,null,"Metro",93.333333333333329,null,3,3,3,3,2,3,3,null,null,null,null,null,5023]
[5023,"A","Metro","Metro","404 SA  Metro - Port Adelaide","Metro","A Metro",1,null,16572,8.6999999999999993,null,null,null,"Metro",93.333333333333329,null,3,3,3,3,2,3,3,null,null,null,null,null,5024]
[5024,"A","Metro","Metro","404 SA  Metro - Port Adelaide","Metro","A Metro",1,null,13846,8.5,null,null,null,"Metro",93.333333333333329,null,3,3,3,3,2,3,3,null,null,null,null,null,5025]
[5025,"A","Metro","Metro","404 SA  Metro - Port Adelaide","Metro","A Metro",1,null,8256,6,null,null,null,"Metro",86.666666666666671,null,3,3,3,3,1,3,3,null,null,null,null,null,5031]
[5031,"A","Metro","Metro","404 SA  Metro - Port Adelaide","Metro","A Metro",1,null,9933,3.2,null,null,null,"Metro",86.666666666666671,null,3,3,3,3,1,3,3,null,null,null,null,null,5032]
[5032,"A","Metro","Metro","404 SA  Metro - Port Adelaide","Metro","A Metro",1,null,12710,5.6,null,null,null,"Metro",93.333333333333329,null,3,3,3,3,2,3,3,null,null,null,null,null,5033]
[5033,"A","Metro","Metro","404 SA  Metro - Port Adelaide","Metro","A Metro",1,null,8373,3.9,null,null,null,"Metro",86.666666666666671,null,3,3,3,3,1,3,3,null,null,null,null,null,5034]
[5034,"A","Metro","Metro","401 SA  Metro - CBD & Adelaide Hills","Metro","A Metro",1,null,10042,3.2,null,null,null,"Metro",93.333333333333329,null,3,3,3,3,2,3,3,null,null,null,null,null,5035]
[5035,"A","Metro","Metro","401 SA  Metro - CBD & Adelaide Hills","Metro","A Metro",1,null,6103,3.5,null,null,null,"Metro",86.666666666666671,null,3,3,3,3,1,3,3,null,null,null,null,null,5037]
[5037,"A","Metro","Metro","404 SA  Metro - Port Adelaide","Metro","A Metro",1,null,10786,4.7,null,null,null,"Metro",93.333333333333329,null,3,3,3,3,2,3,3,null,null,null,null,null,5038]
[5038,"A","Metro","Metro","404 SA  Metro - Port Adelaide","Metro","A Metro",1,null,15262,6.3,null,null,null,"Metro",93.333333333333329,null,3,3,3,3,2,3,3,null,null,null,null,null,5039]
[5039,"A","Metro","Metro","403 SA  Metro - Noarlunga","Metro","A Metro",1,null,8851,6.3,null,null,null,"Metro",86.666666666666671,null,3,3,3,3,1,3,3,null,null,null,null,null,5040]
[5040,"A","Metro","Metro","404 SA  Metro - Port Adelaide","Metro","A Metro",1,null,2504,7.5,null,null,null,"Metro",80,null,3,3,3,3,0,3,3,null,null,null,null,null,5041]
[5041,"A","Metro","Metro","403 SA  Metro - Noarlunga","Metro","A Metro",1,null,13391,6.4,null,null,null,"Metro",93.333333333333329,null,3,3,3,3,2,3,3,null,null,null,null,null,5042]
[5042,"A","Metro","Metro","403 SA  Metro - Noarlunga","Metro","A Metro",1,null,10837,9.1999999999999993,null,null,null,"Metro",93.333333333333329,null,3,3,3,3,2,3,3,null,null,null,null,null,5043]
[5043,"A","Metro","Metro","403 SA  Metro - Noarlunga","Metro","A Metro",1,null,18780,8.8000000000000007,null,null,null,"Metro",93.333333333333329,null,3,3,3,3,2,3,3,null,null,null,null,null,5044]
[5044,"A","Metro","Metro","403 SA  Metro - Noarlunga","Metro","A Metro",1,null,10875,10,null,null,null,"Metro",93.333333333333329,null,3,3,3,3,2,3,3,null,null,null,null,null,5045]
[5045,"A","Metro","Metro","403 SA  Metro - Noarlunga","Metro","A Metro",1,null,15589,9.5,null,null,null,"Metro",93.333333333333329,null,3,3,3,3,2,3,3,null,null,null,null,null,5046]
[5046,"A","Metro","Metro","403 SA  Metro - Noarlunga","Metro","A Metro",1,null,9086,10.7,null,null,null,"Metro",86.666666666666671,null,3,3,3,3,1,3,3,null,null,null,null,null,5047]
[5047,"A","Metro","Metro","403 SA  Metro - Noarlunga","Metro","A Metro",1,null,8263,11.9,null,null,null,"Metro",86.666666666666671,null,3,3,3,3,1,3,3,null,null,null,null,null,5048]
[5048,"A","Metro","Metro","403 SA  Metro - Noarlunga","Metro","A Metro",1,null,14225,12.2,null,null,null,"Metro",93.333333333333329,null,3,3,3,3,2,3,3,null,null,null,null,null,5049]
[5049,"A","Metro","Metro","403 SA  Metro - Noarlunga","Metro","A Metro",1,null,9764,14.4,null,null,null,"Metro",86.666666666666671,null,3,3,3,3,1,3,3,null,null,null,null,null,5050]
[5050,"A","Metro","Metro","403 SA  Metro - Noarlunga","Metro","A Metro",1,null,5602,10.9,null,null,null,"Metro",86.666666666666671,null,3,3,3,3,1,3,3,null,null,null,null,null,5051]
[5051,"A","Metro","Metro","403 SA  Metro - Noarlunga","Metro","A Metro",1,null,14074,11.9,null,null,null,"Metro",93.333333333333329,null,3,3,3,3,2,3,3,null,null,null,null,null,5052]
[5052,"A","Metro","Metro","403 SA  Metro - Noarlunga","Metro","A Metro",1,null,6369,9.1,null,null,null,"Metro",86.666666666666671,null,3,3,3,3,1,3,3,null,null,null,null,null,5061]
[5061,"A","Metro","Metro","401 SA  Metro - CBD & Adelaide Hills","Metro","A Metro",1,null,9695,3.3,null,null,null,"Metro",86.666666666666671,null,3,3,3,3,1,3,3,null,null,null,null,null,5062]
[5062,"A","Metro","Metro","403 SA  Metro - Noarlunga","Metro","A Metro",1,null,14917,6.1,null,null,null,"Metro",93.333333333333329,null,3,3,3,3,2,3,3,null,null,null,null,null,5063]
[5063,"A","Metro","Metro","401 SA  Metro - CBD & Adelaide Hills","Metro","A Metro",1,null,12308,3.3,null,null,null,"Metro",93.333333333333329,null,3,3,3,3,2,3,3,null,null,null,null,null,5064]
[5064,"A","Metro","Metro","401 SA  Metro - CBD & Adelaide Hills","Metro","A Metro",1,null,9855,5.4,null,null,null,"Metro",86.666666666666671,null,3,3,3,3,1,3,3,null,null,null,null,null,5065]
[5065,"A","Metro","Metro","401 SA  Metro - CBD & Adelaide Hills","Metro","A Metro",1,null,10202,4,null,null,null,"Metro",93.333333333333329,null,3,3,3,3,2,3,3,null,null,null,null,null,5066]
[5066,"A","Metro","Metro","401 SA  Metro - CBD & Adelaide Hills","Metro","A Metro",1,null,11718,6.2,null,null,null,"Metro",93.333333333333329,null,3,3,3,3,2,3,3,null,null,null,null,null,5067]
[5067,"A","Metro","Metro","401 SA  Metro - CBD & Adelaide Hills","Metro","A Metro",1,null,10144,3.3,null,null,null,"Metro",93.333333333333329,null,3,3,3,3,2,3,3,null,null,null,null,null,5068]
[5068,"A","Metro","Metro","401 SA  Metro - CBD & Adelaide Hills","Metro","A Metro",1,null,12184,5.2,null,null,null,"Metro",93.333333333333329,null,3,3,3,3,2,3,3,null,null,null,null,null,5069]
[5069,"A","Metro","Metro","401 SA  Metro - CBD & Adelaide Hills","Metro","A Metro",1,null,8292,3.5,null,null,null,"Metro",86.666666666666671,null,3,3,3,3,1,3,3,null,null,null,null,null,5070]
[5070,"A","Metro","Metro","401 SA  Metro - CBD & Adelaide Hills","Metro","A Metro",1,null,14270,5.2,null,null,null,"Metro",93.333333333333329,null,3,3,3,3,2,3,3,null,null,null,null,null,5072]
[5072,"A","Metro","Metro","401 SA  Metro - CBD & Adelaide Hills","Metro","A Metro",1,null,12666,7.4,null,null,null,"Metro",93.333333333333329,null,3,3,3,3,2,3,3,null,null,null,null,null,5073]
[5073,"A","Metro","Metro","401 SA  Metro - CBD & Adelaide Hills","Metro","A Metro",1,null,15238,7.7,null,null,null,"Metro",93.333333333333329,null,3,3,3,3,2,3,3,null,null,null,null,null,5074]
[5074,"A","Metro","Metro","401 SA  Metro - CBD & Adelaide Hills","Metro","A Metro",1,null,12943,8.1999999999999993,null,null,null,"Metro",93.333333333333329,null,3,3,3,3,2,3,3,null,null,null,null,null,5075]
[5075,"A","Metro","Metro","401 SA  Metro - CBD & Adelaide Hills","Metro","A Metro",1,null,10630,9.6,null,null,null,"Metro",93.333333333333329,null,3,3,3,3,2,3,3,null,null,null,null,null,5076]
[5076,"A","Metro","Metro","401 SA  Metro - CBD & Adelaide Hills","Metro","A Metro",1,null,9173,11.5,null,null,null,"Metro",86.666666666666671,null,3,3,3,3,1,3,3,null,null,null,null,null,5081]
[5081,"A","Metro","Metro","401 SA  Metro - CBD & Adelaide Hills","Metro","A Metro",1,null,9279,4.5,null,null,null,"Metro",86.666666666666671,null,3,3,3,3,1,3,3,null,null,null,null,null,5082]
[5082,"A","Metro","Metro","401 SA  Metro - CBD & Adelaide Hills","Metro","A Metro",1,null,14930,5,null,null,null,"Metro",93.333333333333329,null,3,3,3,3,2,3,3,null,null,null,null,null,5083]
[5083,"A","Metro","Metro","401 SA  Metro - CBD & Adelaide Hills","Metro","A Metro",1,null,7489,5.6,null,null,null,"Metro",86.666666666666671,null,3,3,3,3,1,3,3,null,null,null,null,null,5084]
[5084,"A","Metro","Metro","402 SA  Metro - Gawler","Metro","A Metro",1,null,10057,7.5,null,null,null,"Metro",93.333333333333329,null,3,3,3,3,2,3,3,null,null,null,null,null,5085]
[5085,"A","Metro","Metro","402 SA  Metro - Gawler","Metro","A Metro",1,null,19974,8,null,null,null,"Metro",93.333333333333329,null,3,3,3,3,2,3,3,null,null,null,null,null,5086]
[5086,"A","Metro","Metro","402 SA  Metro - Gawler","Metro","A Metro",1,null,16141,8.3000000000000007,null,null,null,"Metro",93.333333333333329,null,3,3,3,3,2,3,3,null,null,null,null,null,5087]
[5087,"A","Metro","Metro","402 SA  Metro - Gawler","Metro","A Metro",1,null,11378,7.6,null,null,null,"Metro",93.333333333333329,null,3,3,3,3,2,3,3,null,null,null,null,null,5088]
[5088,"A","Metro","Metro","402 SA  Metro - Gawler","Metro","A Metro",1,null,3296,10.7,null,null,null,"Metro",80,null,3,3,3,3,0,3,3,null,null,null,null,null,5089]
[5089,"A","Metro","Metro","402 SA  Metro - Gawler","Metro","A Metro",1,null,6586,12.5,null,null,null,"Metro",86.666666666666671,null,3,3,3,3,1,3,3,null,null,null,null,null,5090]
[5090,"A","Metro","Metro","402 SA  Metro - Gawler","Metro","A Metro",1,null,7887,13.2,null,null,null,"Metro",86.666666666666671,null,3,3,3,3,1,3,3,null,null,null,null,null,5091]
[5091,"A","Metro","Metro","402 SA  Metro - Gawler","Metro","A Metro",1,null,7505,16.600000000000001,null,null,null,"Metro",86.666666666666671,null,3,3,3,3,1,3,3,null,null,null,null,null,5092]
[5092,"A","Metro","Metro","402 SA  Metro - Gawler","Metro","A Metro",1,null,17569,13.8,null,null,null,"Metro",93.333333333333329,null,3,3,3,3,2,3,3,null,null,null,null,null,5093]
[5093,"A","Metro","Metro","402 SA  Metro - Gawler","Metro","A Metro",1,null,9012,11.9,null,null,null,"Metro",86.666666666666671,null,3,3,3,3,1,3,3,null,null,null,null,null,5094]
[5094,"A","Metro","Metro","402 SA  Metro - Gawler","Metro","A Metro",1,null,900,9.1999999999999993,null,null,null,"Metro",80,null,3,3,3,3,0,3,3,null,null,null,null,null,5095]
[5095,"A","Metro","Metro","402 SA  Metro - Gawler","Metro","A Metro",1,null,20525,12.9,null,null,null,"Metro",93.333333333333329,null,3,3,3,3,2,3,3,null,null,null,null,null,5096]
[5096,"A","Metro","Metro","402 SA  Metro - Gawler","Metro","A Metro",1,null,13387,15.2,null,null,null,"Metro",93.333333333333329,null,3,3,3,3,2,3,3,null,null,null,null,null,5097]
[5097,"A","Metro","Metro","402 SA  Metro - Gawler","Metro","A Metro",1,null,13565,15.5,null,null,null,"Metro",93.333333333333329,null,3,3,3,3,2,3,3,null,null,null,null,null,5098]
[5098,"A","Metro","Metro","402 SA  Metro - Gawler","Metro","A Metro",1,null,12321,12,null,null,null,{"$f":"IF(ISBLANK(N1884),IF(AND(H1884<>\"\",IF(I1884=\"High Density\",\"High Density\",IF(AND(P1884<=45,P1884>0),\"Refer to Distribution Partner\",IF(AND(P1884<=55,P1884>45),\"Regional\",IF(AND(P1884>55,P1884<=70),\"Non Metro\",IF(F1884=\"Nonmetro\",\"Non Metro\",IF(P1884>70,\"Metro\",\"\"))))))=\"Refer to Distribution Partner\"),\"Regional\",IF(I1884=\"High Density\",\"High Density\",IF(AND(P1884<=45,P1884>0),\"Refer to Distribution Partner\",IF(AND(P1884<=55,P1884>45),\"Regional\",IF(AND(P1884>55,P1884<=70),\"Non Metro\",IF(F1884=\"Nonmetro\",\"Non Metro\",IF(P1884>70,\"Metro\",\"\"))))))),N1884)","v":"Metro"},{"$f":"(R1884/$AB$3*$AA$3+S1884/$AB$4*$AA$4+T1884/$AB$5*$AA$5+U1884/$AB$6*$AA$6+V1884/$AB$7*$AA$7+W1884/$AB$8*$AA$8+X1884/$AB$9*$AA$9)*100","v":93.333333333333329},null,{"$f":"IF(ISNUMBER(SEARCH(\"Metro\",E1884)),3,IF(ISNUMBER(SEARCH(\"Rural\",E1884)),2,1))","v":3},{"$f":"IF(ISNUMBER(FIND(\"Metro\",F1884)),3,IF(ISNUMBER(FIND(\"Nonmetro\",F1884)),2,3))","v":3},{"$f":"IF(G1884=\"A Metro\",3,IF(G1884=\"B Regional\",2,IF(G1884=\"C Pop > 7,000\",1,IF(G1884=\"D Pop > 2,000\",1,0))))","v":3},{"$f":"IF(H1884=1,3,IF(H1884=2,2,IF(H1884=3,1,0)))","v":3},{"$f":"IF(J1884>=100000,3,IF(AND(J1884>=10000,J1884<100000),2,IF(AND(J1884>=5000,J1884<10000),1,0)))","v":2},{"$f":"IF(AND(K1884>=0.1,K1884<25),3,IF(AND(K1884>=25,K1884<50),2,IF(AND(K1884>=50,K1884<150),1,0)))","v":3},{"$f":"IF(L1884=\"\",3,0)","v":3},null,null,null,null,null,5106]
[5106,"A","Metro","Metro","402 SA  Metro - Gawler","Metro","A Metro",1,null,201,0,null,null,null,"Non Metro",70,null,3,3,3,3,0,0,3,null,null,null,null,null,5107]
[5107,"A","Metro","Metro","402 SA  Metro - Gawler","Metro","A Metro",1,null,17097,16.5,null,null,null,"Metro",93.333333333333329,null,3,3,3,3,2,3,3,null,null,null,null,null,5108]
[5108,"A","Metro","Metro","402 SA  Metro - Gawler","Metro","A Metro",1,null,40609,19.2,null,null,null,"Metro",93.333333333333329,null,3,3,3,3,2,3,3,null,null,null,null,null,5109]
[5109,"A","Metro","Metro","402 SA  Metro - Gawler","Metro","A Metro",1,null,20856,18.2,null,null,null,"Metro",93.333333333333329,null,3,3,3,3,2,3,3,null,null,null,null,null,5110]
[5110,"A","Metro","Metro","402 SA  Metro - Gawler","Metro","A Metro",1,null,8956,20.8,null,null,null,"Metro",86.666666666666671,null,3,3,3,3,1,3,3,null,null,null,null,null,5111]
[5111,"A","Metro","Metro","402 SA  Metro - Gawler","Metro","A Metro",1,null,272,0,null,null,null,"Non Metro",70,null,3,3,3,3,0,0,3,null,null,null,null,null,5112]
[5112,"A","Metro","Metro","402 SA  Metro - Gawler","Metro","A Metro",1,null,19421,22.9,null,null,null,"Metro",93.333333333333329,null,3,3,3,3,2,3,3,null,null,null,null,null,5113]
[5113,"A","Metro","Metro","402 SA  Metro - Gawler","Metro","A Metro",1,null,18890,26.4,null,null,null,"Metro",90,null,3,3,3,3,2,2,3,null,null,null,null,null,5114]
[5114,"A","Metro","Metro","402 SA  Metro - Gawler","Metro","A Metro",1,null,33959,28.6,null,null,null,"Metro",90,null,3,3,3,3,2,2,3,null,null,null,null,null,5115]
[5115,"A","Metro","Metro","402 SA  Metro - Gawler","Metro","A Metro",1,null,10390,30.3,null,null,null,"Metro",90,null,3,3,3,3,2,2,3,null,null,null,null,null,5116]
[5116,"A","Metro","Metro","402 SA  Metro - Gawler","Metro","A Metro",1,null,9455,35.700000000000003,null,null,null,"Metro",83.333333333333343,null,3,3,3,3,1,2,3,null,null,null,null,null,5117]
[5117,"A","Other","Metro","402 SA  Metro - Gawler","Metro","D Pop > 2,000",1,null,2923,31.8,null,null,null,"Non Metro",63.333333333333329,null,3,3,1,3,0,2,3,null,null,null,null,null,5118]
[5118,"A","Metro","Metro","402 SA  Metro - Gawler","Metro","A Metro",1,null,18411,39.5,null,null,null,"Metro",90,null,3,3,3,3,2,2,3,null,null,null,null,null,5120]
[5120,"A","Regional","Metro","402 SA  Metro - Gawler","Metro","B Regional",1,null,1977,28.5,null,null,null,"Non Metro",70,null,3,3,2,3,0,2,3,null,null,null,null,null,5121]
[5121,"A","Metro","Metro","402 SA  Metro - Gawler","Metro","A Metro",1,null,1673,27,null,null,null,"Metro",76.666666666666671,null,3,3,3,3,0,2,3,null,null,null,null,null,5125]
[5125,"A","Metro","Metro","402 SA  Metro - Gawler","Metro","A Metro",1,null,19218,19.600000000000001,null,null,null,"Metro",93.333333333333329,null,3,3,3,3,2,3,3,null,null,null,null,null,5126]
[5126,"A","Metro","Metro","402 SA  Metro - Gawler","Metro","A Metro",1,null,7180,17.8,null,null,null,"Metro",86.666666666666671,null,3,3,3,3,1,3,3,null,null,null,null,null,5127]
[5127,"A","Metro","Metro","402 SA  Metro - Gawler","Metro","A Metro",1,null,7763,16.5,null,null,null,"Metro",86.666666666666671,null,3,3,3,3,1,3,3,null,null,null,null,null,5131]
[5131,"A","Metro","Metro","401 SA  Metro - CBD & Adelaide Hills","Metro","A Metro",1,null,980,0,null,null,null,"Non Metro",70,null,3,3,3,3,0,0,3,null,null,null,null,null,5132]
[5132,"A","Metro","Metro","401 SA  Metro - CBD & Adelaide Hills","Metro","A Metro",1,null,426,0,null,null,null,"Non Metro",70,null,3,3,3,3,0,0,3,null,null,null,null,null,5133]
[5133,"A","Metro","Metro","401 SA  Metro - CBD & Adelaide Hills","Metro","A Metro",1,null,390,0,null,null,null,"Non Metro",70,null,3,3,3,3,0,0,3,null,null,null,null,null,5134]
[5134,"A","Metro","Metro","401 SA  Metro - CBD & Adelaide Hills","Metro","A Metro",1,null,431,0,null,null,null,"Non Metro",70,null,3,3,3,3,0,0,3,null,null,null,null,null,5136]
[5136,"A","Metro","Metro","401 SA  Metro - CBD & Adelaide Hills","Metro","A Metro",1,null,532,12.1,null,null,null,"Metro",80,null,3,3,3,3,0,3,3,null,null,null,null,null,5137]
[5137,"A","Metro","Metro","401 SA  Metro - CBD & Adelaide Hills","Metro","A Metro",1,null,579,0,null,null,null,"Non Metro",70,null,3,3,3,3,0,0,3,null,null,null,null,null,5138]
[5138,"A","Metro","Metro","401 SA  Metro - CBD & Adelaide Hills","Metro","A Metro",1,null,294,0,null,null,null,"Non Metro",70,null,3,3,3,3,0,0,3,null,null,null,null,null,5139]
[5139,"A","Metro","Metro","401 SA  Metro - CBD & Adelaide Hills","Metro","A Metro",1,null,236,0,null,null,null,"Non Metro",70,null,3,3,3,3,0,0,3,null,null,null,null,null,5140]
[5140,"A","Metro","Metro","401 SA  Metro - CBD & Adelaide Hills","Metro","A Metro",1,null,421,9.3000000000000007,null,null,null,"Metro",80,null,3,3,3,3,0,3,3,null,null,null,null,null,5141]
[5141,"A","Metro","Metro","401 SA  Metro - CBD & Adelaide Hills","Metro","A Metro",1,null,681,0,null,null,null,"Non Metro",70,null,3,3,3,3,0,0,3,null,null,null,null,null,5142]
[5142,"A","Metro","Metro","401 SA  Metro - CBD & Adelaide Hills","Metro","A Metro",1,null,575,0,null,null,null,"Non Metro",70,null,3,3,3,3,0,0,3,null,null,null,null,null,5144]
[5144,"A","Metro","Metro","401 SA  Metro - CBD & Adelaide Hills","Metro","A Metro",1,null,414,0,null,null,null,"Non Metro",70,null,3,3,3,3,0,0,3,null,null,null,null,null,5150]
[5150,"A","Metro","Metro","403 SA  Metro - Noarlunga","Metro","A Metro",1,null,61,0,null,null,null,"Non Metro",70,null,3,3,3,3,0,0,3,null,null,null,null,null,5151]
[5151,"A","Metro","Metro","401 SA  Metro - CBD & Adelaide Hills","Metro","A Metro",1,null,369,0,null,null,null,"Non Metro",70,null,3,3,3,3,0,0,3,null,null,null,null,null,5152]
[5152,"A","Metro","Metro","401 SA  Metro - CBD & Adelaide Hills","Metro","A Metro",1,null,6132,13.4,null,null,null,"Metro",86.666666666666671,null,3,3,3,3,1,3,3,null,null,null,null,null,5153]
[5153,"A","Metro","Metro","401 SA  Metro - CBD & Adelaide Hills","Metro","A Metro",1,null,6428,24.9,null,null,null,"Metro",86.666666666666671,null,3,3,3,3,1,3,3,null,null,null,null,null,5154]
[5154,"A","Metro","Metro","401 SA  Metro - CBD & Adelaide Hills","Metro","A Metro",1,null,3361,16.100000000000001,null,null,null,"Metro",80,null,3,3,3,3,0,3,3,null,null,null,null,null,5155]
[5155,"A","Metro","Metro","401 SA  Metro - CBD & Adelaide Hills","Metro","A Metro",1,null,3824,17.899999999999999,null,null,null,"Metro",80,null,3,3,3,3,0,3,3,null,null,null,null,null,5156]
[5156,"A","Metro","Metro","401 SA  Metro - CBD & Adelaide Hills","Metro","A Metro",1,null,951,13.1,null,null,null,"Metro",80,null,3,3,3,3,0,3,3,null,null,null,null,null,5157]
[5157,"A","Metro","Metro","403 SA  Metro - Noarlunga","Metro","A Metro",1,null,2914,24.1,null,null,null,"Metro",80,null,3,3,3,3,0,3,3,null,null,null,null,null,5158]
[5158,"A","Metro","Metro","403 SA  Metro - Noarlunga","Metro","A Metro",1,null,24735,18,null,null,null,"Metro",93.333333333333329,null,3,3,3,3,2,3,3,null,null,null,null,null,5159]
[5159,"A","Metro","Metro","403 SA  Metro - Noarlunga","Metro","A Metro",1,null,32934,15.9,null,null,null,"Metro",93.333333333333329,null,3,3,3,3,2,3,3,null,null,null,null,null,5160]
[5160,"A","Metro","Metro","403 SA  Metro - Noarlunga","Metro","A Metro",1,null,29,0,null,null,null,"Non Metro",70,null,3,3,3,3,0,0,3,null,null,null,null,null,5161]
[5161,"A","Metro","Metro","403 SA  Metro - Noarlunga","Metro","A Metro",1,null,10154,20.100000000000001,null,null,null,"Metro",93.333333333333329,null,3,3,3,3,2,3,3,null,null,null,null,null,5162]
[5162,"A","Metro","Metro","403 SA  Metro - Noarlunga","Metro","A Metro",1,null,34294,22.2,null,null,null,"Metro",93.333333333333329,null,3,3,3,3,2,3,3,null,null,null,null,null,5163]
[5163,"A","Metro","Metro","403 SA  Metro - Noarlunga","Metro","A Metro",1,null,14125,25.3,null,null,null,"Metro",90,null,3,3,3,3,2,2,3,null,null,null,null,null,5164]
[5164,"A","Metro","Metro","403 SA  Metro - Noarlunga","Metro","A Metro",1,null,5289,24.4,null,null,null,"Metro",86.666666666666671,null,3,3,3,3,1,3,3,null,null,null,null,null,5165]
[5165,"A","Metro","Metro","403 SA  Metro - Noarlunga","Metro","A Metro",1,null,5383,25.8,null,null,null,"Metro",83.333333333333343,null,3,3,3,3,1,2,3,null,null,null,null,null,5166]
[5166,"A","Metro","Metro","403 SA  Metro - Noarlunga","Metro","A Metro",1,null,1879,24.2,null,null,null,"Metro",80,null,3,3,3,3,0,3,3,null,null,null,null,null,5167]
[5167,"A","Metro","Metro","403 SA  Metro - Noarlunga","Metro","A Metro",1,null,5705,27.9,null,null,null,"Metro",83.333333333333343,null,3,3,3,3,1,2,3,null,null,null,null,null,5168]
[5168,"A","Metro","Metro","403 SA  Metro - Noarlunga","Metro","A Metro",1,null,5499,28.1,null,null,null,"Metro",83.333333333333343,null,3,3,3,3,1,2,3,null,null,null,null,null,5169]
[5169,"A","Metro","Metro","403 SA  Metro - Noarlunga","Metro","A Metro",1,null,17084,31.4,null,null,null,"Metro",90,null,3,3,3,3,2,2,3,null,null,null,null,null,5170]
[5170,"A","Metro","Metro","403 SA  Metro - Noarlunga","Metro","A Metro",1,null,1152,35.4,null,null,null,"Metro",76.666666666666671,null,3,3,3,3,0,2,3,null,null,null,null,null,5171]
[5171,"A","Metro","Metro","403 SA  Metro - Noarlunga","Metro","A Metro",1,null,5923,32.299999999999997,null,null,null,"Metro",83.333333333333343,null,3,3,3,3,1,2,3,null,null,null,null,null,5172]
[5172,"A","Metro","Metro","403 SA  Metro - Noarlunga","Metro","A Metro",1,null,3932,38.799999999999997,null,null,null,"Metro",76.666666666666671,null,3,3,3,3,0,2,3,null,null,null,null,null,5173]
[5173,"A","Metro","Metro","403 SA  Metro - Noarlunga","Metro","A Metro",1,null,12769,41.2,null,null,null,"Metro",90,null,3,3,3,3,2,2,3,null,null,null,null,null,5174]
[5174,"A","Metro","Metro","403 SA  Metro - Noarlunga","Metro","A Metro",1,null,2917,46.8,null,null,null,"Metro",76.666666666666671,null,3,3,3,3,0,2,3,null,null,null,null,null,5201]
[5201,"A","Regional","Regional","401 SA  Metro - CBD & Adelaide Hills","Nonmetro","B Regional",3,null,1944,32.5,null,null,null,"Regional",49.999999999999993,null,3,2,2,1,0,2,3,null,null,null,null,null,5202]
[5202,"A","Regional","Regional","407 SA  Rural - Limestone Coast & Murraylands","Nonmetro","B Regional",3,null,868,53.3,null,null,null,"Regional",44.999999999999993,null,2,2,2,1,0,1,3,null,null,null,null,null,5203]
[5203,"A","Regional","Regional","407 SA  Rural - Limestone Coast & Murraylands","Nonmetro","B Regional",3,null,1268,63.3,null,null,null,"Regional",44.999999999999993,null,2,2,2,1,0,1,3,null,null,null,null,null,5204]
[5204,"A","Regional","Regional","407 SA  Rural - Limestone Coast & Murraylands","Nonmetro","B Regional",3,null,2824,69.599999999999994,null,null,null,"Regional",44.999999999999993,null,2,2,2,1,0,1,3,null,null,null,null,null,5210]
[5210,"A","Other","Regional","407 SA  Rural - Limestone Coast & Murraylands","Nonmetro","E Pop > 500",null,null,1718,47,null,null,null,"Refer to Distribution Partner",28.333333333333332,null,2,2,0,0,0,2,3,null,null,null,null,null,5211]
[5211,"A","Regional","Regional","407 SA  Rural - Limestone Coast & Murraylands","Nonmetro","B Regional",2,null,15276,69.599999999999994,null,null,null,"Non Metro",65,null,2,2,2,2,2,1,3,null,null,null,null,null,5212]
[5212,"A","Regional","Regional","407 SA  Rural - Limestone Coast & Murraylands","Nonmetro","B Regional",2,null,2102,67.2,null,null,null,"Regional",51.666666666666671,null,2,2,2,2,0,1,3,null,null,null,null,null,5213]
[5213,"A","Regional","Regional","407 SA  Rural - Limestone Coast & Murraylands","Nonmetro","B Regional",2,null,1156,65.900000000000006,null,null,null,"Regional",51.666666666666671,null,2,2,2,2,0,1,3,null,null,null,null,null,5214]
[5214,"A","Regional","Regional","407 SA  Rural - Limestone Coast & Murraylands","Nonmetro","B Regional",2,null,8397,66.900000000000006,null,null,"Regional",{"$f":"IF(ISBLANK(N1948),IF(AND(H1948<>\"\",IF(I1948=\"High Density\",\"High Density\",IF(AND(P1948<=45,P1948>0),\"Refer to Distribution Partner\",IF(AND(P1948<=55,P1948>45),\"Regional\",IF(AND(P1948>55,P1948<=70),\"Non Metro\",IF(F1948=\"Nonmetro\",\"Non Metro\",IF(P1948>70,\"Metro\",\"\"))))))=\"Refer to Distribution Partner\"),\"Regional\",IF(I1948=\"High Density\",\"High Density\",IF(AND(P1948<=45,P1948>0),\"Refer to Distribution Partner\",IF(AND(P1948<=55,P1948>45),\"Regional\",IF(AND(P1948>55,P1948<=70),\"Non Metro\",IF(F1948=\"Nonmetro\",\"Non Metro\",IF(P1948>70,\"Metro\",\"\"))))))),N1948)","v":"Regional"},{"$f":"(R1948/$AB$3*$AA$3+S1948/$AB$4*$AA$4+T1948/$AB$5*$AA$5+U1948/$AB$6*$AA$6+V1948/$AB$7*$AA$7+W1948/$AB$8*$AA$8+X1948/$AB$9*$AA$9)*100","v":58.333333333333336},null,{"$f":"IF(ISNUMBER(SEARCH(\"Metro\",E1948)),3,IF(ISNUMBER(SEARCH(\"Rural\",E1948)),2,1))","v":2},{"$f":"IF(ISNUMBER(FIND(\"Metro\",F1948)),3,IF(ISNUMBER(FIND(\"Nonmetro\",F1948)),2,3))","v":2},{"$f":"IF(G1948=\"A Metro\",3,IF(G1948=\"B Regional\",2,IF(G1948=\"C Pop > 7,000\",1,IF(G1948=\"D Pop > 2,000\",1,0))))","v":2},{"$f":"IF(H1948=1,3,IF(H1948=2,2,IF(H1948=3,1,0)))","v":2},{"$f":"IF(J1948>=100000,3,IF(AND(J1948>=10000,J1948<100000),2,IF(AND(J1948>=5000,J1948<10000),1,0)))","v":1},{"$f":"IF(AND(K1948>=0.1,K1948<25),3,IF(AND(K1948>=25,K1948<50),2,IF(AND(K1948>=50,K1948<150),1,0)))","v":1},{"$f":"IF(L1948=\"\",3,0)","v":3},null,null,null,null,null,5220]
[5220,"A","Other","Regional","407 SA  Rural - Limestone Coast & Murraylands","Nonmetro","F Pop <= 500",null,null,149,0,null,null,null,"Refer to Distribution Partner",21.666666666666668,null,2,2,0,0,0,0,3,null,null,null,null,null,5221]
[5221,"A","Other","Regional","407 SA  Rural - Limestone Coast & Murraylands","Nonmetro","F Pop <= 500",null,null,288,0,null,null,null,"Refer to Distribution Partner",21.666666666666668,null,2,2,0,0,0,0,3,null,null,null,null,null,5222]
[5222,"A","Other","Regional","407 SA  Rural - Limestone Coast & Murraylands","Nonmetro","E Pop > 500",null,null,629,112.8,null,null,null,"Refer to Distribution Partner",25,null,2,2,0,0,0,1,3,null,null,null,null,null,5223]
[5223,"A","Other","Regional","407 SA  Rural - Limestone Coast & Murraylands","Nonmetro","D Pop > 2,000",null,null,3642,128.80000000000001,null,null,null,"Refer to Distribution Partner",31.666666666666664,null,2,2,1,0,0,1,3,null,null,null,null,null,5231]
[5231,"A","Regional","Regional","401 SA  Metro - CBD & Adelaide Hills","Nonmetro","B Regional",1,null,1227,29.5,null,null,null,"Non Metro",63.333333333333329,null,3,2,2,3,0,2,3,null,null,null,null,null,5232]
[5232,"A","Metro","Regional","401 SA  Metro - CBD & Adelaide Hills","Nonmetro","A Metro",1,null,421,0,null,null,null,"Non Metro",63.333333333333343,null,3,2,3,3,0,0,3,null,null,null,null,null,5233]
[5233,"A","Metro","Regional","401 SA  Metro - CBD & Adelaide Hills","Nonmetro","A Metro",1,null,1474,30,null,null,null,"Non Metro",70,null,3,2,3,3,0,2,3,null,null,null,null,null,5234]
[5234,"A","Regional","Regional","401 SA  Metro - CBD & Adelaide Hills","Nonmetro","B Regional",1,null,1298,35.4,null,null,null,"Non Metro",63.333333333333329,null,3,2,2,3,0,2,3,null,null,null,null,null,5235]
[5235,"A","Other","Regional","405 SA  Rural - Barossa & Yorke Peninsula","Nonmetro","E Pop > 500",null,null,2475,48.7,null,null,null,"Refer to Distribution Partner",28.333333333333332,null,2,2,0,0,0,2,3,null,null,null,null,null,5236]
[5236,"A","Other","Regional","407 SA  Rural - Limestone Coast & Murraylands","Nonmetro","E Pop > 500",null,null,302,0,null,null,null,"Refer to Distribution Partner",21.666666666666668,null,2,2,0,0,0,0,3,null,null,null,null,null,5237]
[5237,"A","Other","Regional","407 SA  Rural - Limestone Coast & Murraylands","Nonmetro","F Pop <= 500",null,null,357,0,null,null,null,"Refer to Distribution Partner",21.666666666666668,null,2,2,0,0,0,0,3,null,null,null,null,null,5238]
[5238,"A","Other","Regional","407 SA  Rural - Limestone Coast & Murraylands","Nonmetro","D Pop > 2,000",null,null,4084,68.7,null,null,null,"Refer to Distribution Partner",31.666666666666664,null,2,2,1,0,0,1,3,null,null,null,null,null,5240]
[5240,"A","Metro","Regional","401 SA  Metro - CBD & Adelaide Hills","Nonmetro","A Metro",1,null,485,0,null,null,null,"Non Metro",63.333333333333343,null,3,2,3,3,0,0,3,null,null,null,null,null,5241]
[5241,"A","Metro","Regional","401 SA  Metro - CBD & Adelaide Hills","Nonmetro","A Metro",1,null,2527,25.4,null,null,null,"Non Metro",70,null,3,2,3,3,0,2,3,null,null,null,null,null,5242]
[5242,"A","Metro","Regional","401 SA  Metro - CBD & Adelaide Hills","Nonmetro","A Metro",1,null,1621,22.1,null,null,null,"Non Metro",73.333333333333343,null,3,2,3,3,0,3,3,null,null,null,null,null,5243]
[5243,"A","Metro","Regional","401 SA  Metro - CBD & Adelaide Hills","Nonmetro","A Metro",1,null,832,23.2,null,null,null,"Non Metro",73.333333333333343,null,3,2,3,3,0,3,3,null,null,null,null,null,5244]
[5244,"A","Metro","Regional","401 SA  Metro - CBD & Adelaide Hills","Nonmetro","A Metro",1,null,4263,27.2,null,null,null,"Non Metro",70,null,3,2,3,3,0,2,3,null,null,null,null,null,5245]
[5245,"A","Metro","Regional","401 SA  Metro - CBD & Adelaide Hills","Nonmetro","A Metro",1,null,3084,22.4,null,null,null,"Non Metro",73.333333333333343,null,3,2,3,3,0,3,3,null,null,null,null,null,5250]
[5250,"A","Metro","Regional","401 SA  Metro - CBD & Adelaide Hills","Nonmetro","A Metro",1,null,3523,27.7,null,null,null,"Non Metro",70,null,3,2,3,3,0,2,3,null,null,null,null,null,5251]
[5251,"A","Metro","Regional","401 SA  Metro - CBD & Adelaide Hills","Nonmetro","A Metro",1,null,14623,29.9,null,null,null,"Non Metro",83.333333333333343,null,3,2,3,3,2,2,3,null,null,null,null,null,5252]
[5252,"A","Metro","Regional","401 SA  Metro - CBD & Adelaide Hills","Nonmetro","A Metro",3,null,6516,31.2,null,null,null,"Non Metro",63.333333333333343,null,3,2,3,1,1,2,3,null,null,null,null,null,5253]
[5253,"A","Regional","Regional","407 SA  Rural - Limestone Coast & Murraylands","Nonmetro","B Regional",3,null,18489,65.900000000000006,null,null,null,"Non Metro",58.333333333333336,null,2,2,2,1,2,1,3,null,null,null,null,null,5254]
[5254,"A","Regional","Regional","407 SA  Rural - Limestone Coast & Murraylands","Nonmetro","D Pop > 2,000",null,null,2387,56.7,null,null,null,"Refer to Distribution Partner",31.666666666666664,null,2,2,1,0,0,1,3,null,null,null,null,null,5255]
[5255,"A","Regional","Regional","407 SA  Rural - Limestone Coast & Murraylands","Nonmetro","B Regional",3,null,9248,46.6,null,null,null,"Regional",54.999999999999993,null,2,2,2,1,1,2,3,null,null,null,null,null,5256]
[5256,"A","Other","Regional","407 SA  Rural - Limestone Coast & Murraylands","Nonmetro","E Pop > 500",null,null,1355,66.7,null,null,null,"Refer to Distribution Partner",25,null,2,2,0,0,0,1,3,null,null,null,null,null,5259]
[5259,"A","Other","Regional","407 SA  Rural - Limestone Coast & Murraylands","Nonmetro","E Pop > 500",null,null,1110,85.4,null,null,null,"Refer to Distribution Partner",25,null,2,2,0,0,0,1,3,null,null,null,null,null,5260]
[5260,"A","Other","Regional","407 SA  Rural - Limestone Coast & Murraylands","Nonmetro","E Pop > 500",null,null,1755,86.4,null,null,null,"Refer to Distribution Partner",25,null,2,2,0,0,0,1,3,null,null,null,null,null,5261]
[5261,"A","Other","Regional","407 SA  Rural - Limestone Coast & Murraylands","Nonmetro","F Pop <= 500",null,null,368,0,null,null,null,"Refer to Distribution Partner",21.666666666666668,null,2,2,0,0,0,0,3,null,null,null,null,null,5262]
[5262,"A","Other","Regional","407 SA  Rural - Limestone Coast & Murraylands","Nonmetro","E Pop > 500",null,null,412,0,null,null,null,"Refer to Distribution Partner",21.666666666666668,null,2,2,0,0,0,0,3,null,null,null,null,null,5263]
[5263,"A","Other","Regional","407 SA  Rural - Limestone Coast & Murraylands","Nonmetro","F Pop <= 500",null,null,137,331.9,null,null,null,"Refer to Distribution Partner",21.666666666666668,null,2,2,0,0,0,0,3,null,null,null,null,null,5264]
[5264,"A","Other","Regional","407 SA  Rural - Limestone Coast & Murraylands","Nonmetro","E Pop > 500",null,null,1250,109.5,null,null,null,"Refer to Distribution Partner",25,null,2,2,0,0,0,1,3,null,null,null,null,null,5265]
[5265,"A","Other","Regional","407 SA  Rural - Limestone Coast & Murraylands","Nonmetro","E Pop > 500",null,null,431,0,null,null,null,"Refer to Distribution Partner",21.666666666666668,null,2,2,0,0,0,0,3,null,null,null,null,null,5266]
[5266,"A","Other","Regional","407 SA  Rural - Limestone Coast & Murraylands","Nonmetro","E Pop > 500",null,null,624,0,null,null,null,"Refer to Distribution Partner",21.666666666666668,null,2,2,0,0,0,0,3,null,null,null,null,null,5267]
[5267,"A","Other","Regional","407 SA  Rural - Limestone Coast & Murraylands","Nonmetro","D Pop > 2,000",null,null,1959,206.8,null,null,null,"Refer to Distribution Partner",28.333333333333332,null,2,2,1,0,0,0,3,null,null,null,null,null,5268]
[5268,"A","Other","Regional","407 SA  Rural - Limestone Coast & Murraylands","Nonmetro","D Pop > 2,000",null,null,3544,249.3,null,null,null,"Refer to Distribution Partner",28.333333333333332,null,2,2,1,0,0,0,3,null,null,null,null,null,5269]
[5269,"A","Other","Regional","407 SA  Rural - Limestone Coast & Murraylands","Nonmetro","F Pop <= 500",null,null,258,0,null,null,null,"Refer to Distribution Partner",21.666666666666668,null,2,2,0,0,0,0,3,null,null,null,null,null,5270]
[5270,"A","Other","Regional","407 SA  Rural - Limestone Coast & Murraylands","Nonmetro","E Pop > 500",null,null,608,247.6,null,null,null,"Refer to Distribution Partner",21.666666666666668,null,2,2,0,0,0,0,3,null,null,null,null,null,5271]
[5271,"A","Other","Regional","407 SA  Rural - Limestone Coast & Murraylands","Nonmetro","D Pop > 2,000",null,null,7428,296.5,null,null,null,"Refer to Distribution Partner",35,null,2,2,1,0,1,0,3,null,null,null,null,null,5272]
[5272,"A","Other","Regional","407 SA  Rural - Limestone Coast & Murraylands","Nonmetro","E Pop > 500",null,null,794,0,null,null,null,"Refer to Distribution Partner",21.666666666666668,null,2,2,0,0,0,0,3,null,null,null,null,null,5273]
[5273,"A","Other","Regional","407 SA  Rural - Limestone Coast & Murraylands","Nonmetro","F Pop <= 500",null,null,111,0,null,null,null,"Refer to Distribution Partner",21.666666666666668,null,2,2,0,0,0,0,3,null,null,null,null,null,5275]
[5275,"A","Other","Regional","407 SA  Rural - Limestone Coast & Murraylands","Nonmetro","D Pop > 2,000",null,null,2412,242.2,null,null,null,"Refer to Distribution Partner",28.333333333333332,null,2,2,1,0,0,0,3,null,null,null,null,null,5276]
[5276,"A","Other","Regional","407 SA  Rural - Limestone Coast & Murraylands","Nonmetro","E Pop > 500",null,null,1181,271,null,null,null,"Refer to Distribution Partner",21.666666666666668,null,2,2,0,0,0,0,3,null,null,null,null,null,5277]
[5277,"A","Other","Regional","407 SA  Rural - Limestone Coast & Murraylands","Nonmetro","D Pop > 2,000",null,null,2914,344.7,null,null,null,"Refer to Distribution Partner",28.333333333333332,null,2,2,1,0,0,0,3,null,null,null,null,null,5278]
[5278,"A","Other","Regional","407 SA  Rural - Limestone Coast & Murraylands","Nonmetro","E Pop > 500",null,null,521,0,null,null,null,"Refer to Distribution Partner",21.666666666666668,null,2,2,0,0,0,0,3,null,null,null,null,null,5279]
[5279,"A","Other","Regional","407 SA  Rural - Limestone Coast & Murraylands","Nonmetro","F Pop <= 500",null,null,527,332,null,null,null,"Refer to Distribution Partner",21.666666666666668,null,2,2,0,0,0,0,3,null,null,null,null,null,5280]
[5280,"A","Regional","Regional","407 SA  Rural - Limestone Coast & Murraylands","Nonmetro","B Regional",3,null,7370,335.9,null,null,null,"Regional",48.333333333333329,null,2,2,2,1,1,0,3,null,null,null,null,null,5290]
[5290,"A","Regional","Regional","407 SA  Rural - Limestone Coast & Murraylands","Nonmetro","B Regional",2,null,25512,376.9,null,null,null,"Non Metro",61.666666666666671,null,2,2,2,2,2,0,3,null,null,null,null,null,5291]
[5291,"A","Regional","Regional","407 SA  Rural - Limestone Coast & Murraylands","Nonmetro","B Regional",3,null,9171,381.2,null,null,null,"Regional",48.333333333333329,null,2,2,2,1,1,0,3,null,null,null,null,null,5301]
[5301,"A","Other","Regional","407 SA  Rural - Limestone Coast & Murraylands","Nonmetro","F Pop <= 500",null,null,574,0,null,null,null,"Refer to Distribution Partner",21.666666666666668,null,2,2,0,0,0,0,3,null,null,null,null,null,5302]
[5302,"A","Other","Regional","407 SA  Rural - Limestone Coast & Murraylands","Nonmetro","E Pop > 500",null,null,852,180.4,null,null,null,"Refer to Distribution Partner",21.666666666666668,null,2,2,0,0,0,0,3,null,null,null,null,null,5303]
[5303,"A","Other","Regional","407 SA  Rural - Limestone Coast & Murraylands","Nonmetro","F Pop <= 500",null,null,211,0,null,null,null,"Refer to Distribution Partner",21.666666666666668,null,2,2,0,0,0,0,3,null,null,null,null,null,5304]
[5304,"A","Other","Regional","407 SA  Rural - Limestone Coast & Murraylands","Nonmetro","E Pop > 500",null,null,770,213.4,null,null,null,"Refer to Distribution Partner",21.666666666666668,null,2,2,0,0,0,0,3,null,null,null,null,null,5306]
[5306,"A","Other","Regional","407 SA  Rural - Limestone Coast & Murraylands","Nonmetro","F Pop <= 500",null,null,76,0,null,null,null,"Refer to Distribution Partner",21.666666666666668,null,2,2,0,0,0,0,3,null,null,null,null,null,5307]
[5307,"A","Other","Regional","407 SA  Rural - Limestone Coast & Murraylands","Nonmetro","E Pop > 500",null,null,573,119.4,null,null,null,"Refer to Distribution Partner",25,null,2,2,0,0,0,1,3,null,null,null,null,null,5308]
[5308,"A","Other","Regional","407 SA  Rural - Limestone Coast & Murraylands","Nonmetro","F Pop <= 500",null,null,145,0,null,null,null,"Refer to Distribution Partner",21.666666666666668,null,2,2,0,0,0,0,3,null,null,null,null,null,5309]
[5309,"A","Other","Regional","407 SA  Rural - Limestone Coast & Murraylands","Nonmetro","F Pop <= 500",null,null,157,0,null,null,null,"Refer to Distribution Partner",21.666666666666668,null,2,2,0,0,0,0,3,null,null,null,null,null,5310]
[5310,"A","Other","Regional","407 SA  Rural - Limestone Coast & Murraylands","Nonmetro","F Pop <= 500",null,null,62,0,null,null,null,"Refer to Distribution Partner",21.666666666666668,null,2,2,0,0,0,0,3,null,null,null,null,null,5311]
[5311,"A","Other","Regional","407 SA  Rural - Limestone Coast & Murraylands","Nonmetro","E Pop > 500",null,null,418,0,null,null,null,"Refer to Distribution Partner",21.666666666666668,null,2,2,0,0,0,0,3,null,null,null,null,null,5320]
[5320,"A","Other","Regional","407 SA  Rural - Limestone Coast & Murraylands","Nonmetro","E Pop > 500",null,null,652,137.5,null,null,null,"Refer to Distribution Partner",25,null,2,2,0,0,0,1,3,null,null,null,null,null,5321]
[5321,"A","Other","Regional","407 SA  Rural - Limestone Coast & Murraylands","Nonmetro","F Pop <= 500",null,null,548,0,null,null,null,"Refer to Distribution Partner",21.666666666666668,null,2,2,0,0,0,0,3,null,null,null,null,null,5322]
[5322,"A","Other","Regional","407 SA  Rural - Limestone Coast & Murraylands","Nonmetro","E Pop > 500",null,null,1000,147.4,null,null,null,"Refer to Distribution Partner",25,null,2,2,0,0,0,1,3,null,null,null,null,null,5330]
[5330,"A","Regional","Regional","407 SA  Rural - Limestone Coast & Murraylands","Nonmetro","B Regional",null,null,3368,152,null,null,null,"Refer to Distribution Partner",35,null,2,2,2,0,0,0,3,null,null,null,null,null,5331]
[5331,"A","Other","Regional","407 SA  Rural - Limestone Coast & Murraylands","Nonmetro","E Pop > 500",null,null,317,178.1,null,null,null,"Refer to Distribution Partner",21.666666666666668,null,2,2,0,0,0,0,3,null,null,null,null,null,5332]
[5332,"A","Other","Regional","407 SA  Rural - Limestone Coast & Murraylands","Nonmetro","F Pop <= 500",null,null,403,0,null,null,null,{"$f":"IF(ISBLANK(N2012),IF(AND(H2012<>\"\",IF(I2012=\"High Density\",\"High Density\",IF(AND(P2012<=45,P2012>0),\"Refer to Distribution Partner\",IF(AND(P2012<=55,P2012>45),\"Regional\",IF(AND(P2012>55,P2012<=70),\"Non Metro\",IF(F2012=\"Nonmetro\",\"Non Metro\",IF(P2012>70,\"Metro\",\"\"))))))=\"Refer to Distribution Partner\"),\"Regional\",IF(I2012=\"High Density\",\"High Density\",IF(AND(P2012<=45,P2012>0),\"Refer to Distribution Partner\",IF(AND(P2012<=55,P2012>45),\"Regional\",IF(AND(P2012>55,P2012<=70),\"Non Metro\",IF(F2012=\"Nonmetro\",\"Non Metro\",IF(P2012>70,\"Metro\",\"\"))))))),N2012)","v":"Refer to Distribution Partner"},{"$f":"(R2012/$AB$3*$AA$3+S2012/$AB$4*$AA$4+T2012/$AB$5*$AA$5+U2012/$AB$6*$AA$6+V2012/$AB$7*$AA$7+W2012/$AB$8*$AA$8+X2012/$AB$9*$AA$9)*100","v":21.666666666666668},null,{"$f":"IF(ISNUMBER(SEARCH(\"Metro\",E2012)),3,IF(ISNUMBER(SEARCH(\"Rural\",E2012)),2,1))","v":2},{"$f":"IF(ISNUMBER(FIND(\"Metro\",F2012)),3,IF(ISNUMBER(FIND(\"Nonmetro\",F2012)),2,3))","v":2},{"$f":"IF(G2012=\"A Metro\",3,IF(G2012=\"B Regional\",2,IF(G2012=\"C Pop > 7,000\",1,IF(G2012=\"D Pop > 2,000\",1,0))))","v":0},{"$f":"IF(H2012=1,3,IF(H2012=2,2,IF(H2012=3,1,0)))","v":0},{"$f":"IF(J2012>=100000,3,IF(AND(J2012>=10000,J2012<100000),2,IF(AND(J2012>=5000,J2012<10000),1,0)))","v":0},{"$f":"IF(AND(K2012>=0.1,K2012<25),3,IF(AND(K2012>=25,K2012<50),2,IF(AND(K2012>=50,K2012<150),1,0)))","v":0},{"$f":"IF(L2012=\"\",3,0)","v":3},null,null,null,null,null,5333]
[5333,"A","Regional","Regional","407 SA  Rural - Limestone Coast & Murraylands","Nonmetro","B Regional",3,null,5809,188.5,null,null,null,"Regional",48.333333333333329,null,2,2,2,1,1,0,3,null,null,null,null,null,5340]
[5340,"A","Regional","Regional","407 SA  Rural - Limestone Coast & Murraylands","Nonmetro","B Regional",null,null,1432,217.1,null,null,null,"Refer to Distribution Partner",35,null,2,2,2,0,0,0,3,null,null,null,null,null,5341]
[5341,"A","Regional","Regional","407 SA  Rural - Limestone Coast & Murraylands","Nonmetro","B Regional",3,null,7665,213.1,null,null,null,"Regional",48.333333333333329,null,2,2,2,1,1,0,3,null,null,null,null,null,5342]
[5342,"A","Other","Regional","407 SA  Rural - Limestone Coast & Murraylands","Nonmetro","E Pop > 500",null,null,1124,195.2,null,null,null,"Refer to Distribution Partner",21.666666666666668,null,2,2,0,0,0,0,3,null,null,null,null,null,5343]
[5343,"A","Regional","Regional","407 SA  Rural - Limestone Coast & Murraylands","Nonmetro","B Regional",3,null,4846,197,null,null,null,"Regional",41.666666666666664,null,2,2,2,1,0,0,3,null,null,null,null,null,5344]
[5344,"A","Regional","Regional","407 SA  Rural - Limestone Coast & Murraylands","Nonmetro","B Regional",null,null,984,191.3,null,null,null,"Refer to Distribution Partner",35,null,2,2,2,0,0,0,3,null,null,null,null,null,5345]
[5345,"A","Regional","Regional","407 SA  Rural - Limestone Coast & Murraylands","Nonmetro","B Regional",3,null,3582,186.1,null,null,null,"Regional",41.666666666666664,null,2,2,2,1,0,0,3,null,null,null,null,null,5346]
[5346,"A","Other","Regional","407 SA  Rural - Limestone Coast & Murraylands","Nonmetro","F Pop <= 500",null,null,380,0,null,null,null,"Refer to Distribution Partner",21.666666666666668,null,2,2,0,0,0,0,3,null,null,null,null,null,5350]
[5350,"A","Metro","Regional","405 SA  Rural - Barossa & Yorke Peninsula","Nonmetro","A Metro",null,null,476,41.6,null,null,null,"Regional",48.333333333333336,null,2,2,3,0,0,2,3,null,null,null,null,null,5351]
[5351,"A","Regional","Regional","405 SA  Rural - Barossa & Yorke Peninsula","Nonmetro","B Regional",3,null,5864,41.2,null,null,null,"Regional",54.999999999999993,null,2,2,2,1,1,2,3,null,null,null,null,null,5352]
[5352,"A","Regional","Regional","405 SA  Rural - Barossa & Yorke Peninsula","Nonmetro","B Regional",3,null,5216,56.1,null,null,null,"Regional",51.666666666666657,null,2,2,2,1,1,1,3,null,null,null,null,null,5353]
[5353,"A","Regional","Regional","405 SA  Rural - Barossa & Yorke Peninsula","Nonmetro","B Regional",3,null,3775,65.400000000000006,null,null,null,"Regional",44.999999999999993,null,2,2,2,1,0,1,3,null,null,null,null,null,5354]
[5354,"A","Other","Regional","407 SA  Rural - Limestone Coast & Murraylands","Nonmetro","F Pop <= 500",3,null,367,0,null,null,"Regional","Regional",28.333333333333332,null,2,2,0,1,0,0,3,null,null,null,null,null,5355]
[5355,"A","Regional","Regional","Unknown","Nonmetro","B Regional",2,null,7594,63.1,null,null,null,"Non Metro",56.666666666666664,null,1,2,2,2,1,1,3,null,null,null,null,null,5356]
[5356,"A","Other","Regional","407 SA  Rural - Limestone Coast & Murraylands","Nonmetro","E Pop > 500",null,null,810,79.599999999999994,null,null,null,"Refer to Distribution Partner",25,null,2,2,0,0,0,1,3,null,null,null,null,null,5357]
[5357,"A","Other","Regional","407 SA  Rural - Limestone Coast & Murraylands","Nonmetro","E Pop > 500",null,null,419,0,null,null,null,"Refer to Distribution Partner",21.666666666666668,null,2,2,0,0,0,0,3,null,null,null,null,null,5360]
[5360,"A","Regional","Regional","405 SA  Rural - Barossa & Yorke Peninsula","Nonmetro","B Regional",null,null,1118,60.6,null,null,"Regional","Regional",38.333333333333329,null,2,2,2,0,0,1,3,null,null,null,null,null,5371]
[5371,"A","Other","Regional","402 SA  Metro - Gawler","Nonmetro","E Pop > 500",null,null,1268,46.7,null,null,null,"Refer to Distribution Partner",30,null,3,2,0,0,0,2,3,null,null,null,null,null,5372]
[5372,"A","Other","Regional","405 SA  Rural - Barossa & Yorke Peninsula","Nonmetro","E Pop > 500",null,null,2214,56.2,null,null,null,"Refer to Distribution Partner",25,null,2,2,0,0,0,1,3,null,null,null,null,null,5373]
[5373,"A","Other","Regional","405 SA  Rural - Barossa & Yorke Peninsula","Nonmetro","D Pop > 2,000",null,null,3427,71.7,null,null,null,"Refer to Distribution Partner",31.666666666666664,null,2,2,1,0,0,1,3,null,null,null,null,null,5374]
[5374,"A","Other","Regional","405 SA  Rural - Barossa & Yorke Peninsula","Nonmetro","E Pop > 500",null,null,1480,98,null,null,null,"Refer to Distribution Partner",25,null,2,2,0,0,0,1,3,null,null,null,null,null,5381]
[5381,"A","Other","Regional","405 SA  Rural - Barossa & Yorke Peninsula","Nonmetro","F Pop <= 500",null,null,384,0,null,null,null,"Refer to Distribution Partner",21.666666666666668,null,2,2,0,0,0,0,3,null,null,null,null,null,5400]
[5400,"A","Other","Regional","405 SA  Rural - Barossa & Yorke Peninsula","Nonmetro","E Pop > 500",null,null,877,51.1,null,null,null,"Refer to Distribution Partner",25,null,2,2,0,0,0,1,3,null,null,null,null,null,5401]
[5401,"A","Other","Regional","405 SA  Rural - Barossa & Yorke Peninsula","Nonmetro","E Pop > 500",null,null,847,64,null,null,null,"Refer to Distribution Partner",25,null,2,2,0,0,0,1,3,null,null,null,null,null,5410]
[5410,"A","Other","Regional","405 SA  Rural - Barossa & Yorke Peninsula","Nonmetro","E Pop > 500",null,null,317,0,null,null,null,"Refer to Distribution Partner",21.666666666666668,null,2,2,0,0,0,0,3,null,null,null,null,null,5411]
[5411,"A","Other","Regional","405 SA  Rural - Barossa & Yorke Peninsula","Nonmetro","F Pop <= 500",null,null,324,0,null,null,null,"Refer to Distribution Partner",21.666666666666668,null,2,2,0,0,0,0,3,null,null,null,null,null,5412]
[5412,"A","Other","Regional","405 SA  Rural - Barossa & Yorke Peninsula","Nonmetro","E Pop > 500",null,null,1207,86.5,null,null,null,"Refer to Distribution Partner",25,null,2,2,0,0,0,1,3,null,null,null,null,null,5413]
[5413,"A","Other","Regional","405 SA  Rural - Barossa & Yorke Peninsula","Nonmetro","E Pop > 500",null,null,831,0,null,null,null,"Refer to Distribution Partner",21.666666666666668,null,2,2,0,0,0,0,3,null,null,null,null,null,5414]
[5414,"A","Other","Regional","405 SA  Rural - Barossa & Yorke Peninsula","Nonmetro","F Pop <= 500",null,null,149,0,null,null,null,"Refer to Distribution Partner",21.666666666666668,null,2,2,0,0,0,0,3,null,null,null,null,null,5415]
[5415,"A","Other","Regional","405 SA  Rural - Barossa & Yorke Peninsula","Nonmetro","F Pop <= 500",null,null,222,0,null,null,null,"Refer to Distribution Partner",21.666666666666668,null,2,2,0,0,0,0,3,null,null,null,null,null,5416]
[5416,"A","Other","Regional","405 SA  Rural - Barossa & Yorke Peninsula","Nonmetro","F Pop <= 500",null,null,248,0,null,null,null,"Refer to Distribution Partner",21.666666666666668,null,2,2,0,0,0,0,3,null,null,null,null,null,5417]
[5417,"A","Other","Regional","405 SA  Rural - Barossa & Yorke Peninsula","Nonmetro","E Pop > 500",null,null,1486,143.19999999999999,null,null,null,"Refer to Distribution Partner",25,null,2,2,0,0,0,1,3,null,null,null,null,null,5418]
[5418,"A","Other","Regional","405 SA  Rural - Barossa & Yorke Peninsula","Nonmetro","F Pop <= 500",null,null,114,0,null,null,null,"Refer to Distribution Partner",21.666666666666668,null,2,2,0,0,0,0,3,null,null,null,null,null,5419]
[5419,"A","Other","Regional","405 SA  Rural - Barossa & Yorke Peninsula","Nonmetro","F Pop <= 500",null,null,223,0,null,null,null,"Refer to Distribution Partner",21.666666666666668,null,2,2,0,0,0,0,3,null,null,null,null,null,5420]
[5420,"A","Other","Regional","405 SA  Rural - Barossa & Yorke Peninsula","Nonmetro","F Pop <= 500",null,null,83,0,null,null,null,"Refer to Distribution Partner",21.666666666666668,null,2,2,0,0,0,0,3,null,null,null,null,null,5421]
[5421,"A","Other","Regional","405 SA  Rural - Barossa & Yorke Peninsula","Nonmetro","F Pop <= 500",null,null,139,0,null,null,null,"Refer to Distribution Partner",21.666666666666668,null,2,2,0,0,0,0,3,null,null,null,null,null,5422]
[5422,"A","Other","Regional","405 SA  Rural - Barossa & Yorke Peninsula","Nonmetro","E Pop > 500",null,null,1686,218,null,null,null,"Refer to Distribution Partner",21.666666666666668,null,2,2,0,0,0,0,3,null,null,null,null,null,5431]
[5431,"A","Other","Regional","405 SA  Rural - Barossa & Yorke Peninsula","Nonmetro","E Pop > 500",null,null,906,248.5,null,null,null,"Refer to Distribution Partner",21.666666666666668,null,2,2,0,0,0,0,3,null,null,null,null,null,5432]
[5432,"A","Other","Regional","405 SA  Rural - Barossa & Yorke Peninsula","Nonmetro","F Pop <= 500",null,null,137,0,null,null,null,"Refer to Distribution Partner",21.666666666666668,null,2,2,0,0,0,0,3,null,null,null,null,null,5433]
[5433,"A","Other","Regional","406 SA  Rural - Outback","Nonmetro","E Pop > 500",null,null,1256,291.60000000000002,null,null,null,"Refer to Distribution Partner",21.666666666666668,null,2,2,0,0,0,0,3,null,null,null,null,null,5434]
[5434,"A","Other","Regional","406 SA  Rural - Outback","Nonmetro","F Pop <= 500",null,null,456,0,null,null,null,"Refer to Distribution Partner",21.666666666666668,null,2,2,0,0,0,0,3,null,null,null,null,null,5440]
[5440,"A","Other","Regional","406 SA  Rural - Outback","Nonmetro","F Pop <= 500",null,null,263,0,"Mining",null,null,"Refer to Distribution Partner",16.666666666666664,null,2,2,0,0,0,0,0,null,null,null,null,null,5451]
[5451,"A","Other","Regional","405 SA  Rural - Barossa & Yorke Peninsula","Nonmetro","E Pop > 500",null,null,695,100.5,null,null,null,"Refer to Distribution Partner",25,null,2,2,0,0,0,1,3,null,null,null,null,null,5452]
[5452,"A","Other","Regional","405 SA  Rural - Barossa & Yorke Peninsula","Nonmetro","F Pop <= 500",null,null,442,0,null,null,null,"Refer to Distribution Partner",21.666666666666668,null,2,2,0,0,0,0,3,null,null,null,null,null,5453]
[5453,"A","Regional","Regional","405 SA  Rural - Barossa & Yorke Peninsula","Nonmetro","B Regional",3,null,4938,121.1,null,null,null,"Regional",44.999999999999993,null,2,2,2,1,0,1,3,null,null,null,null,null,5454]
[5454,"A","Other","Regional","405 SA  Rural - Barossa & Yorke Peninsula","Nonmetro","F Pop <= 500",null,null,398,0,null,null,null,"Refer to Distribution Partner",21.666666666666668,null,2,2,0,0,0,0,3,null,null,null,null,null,5455]
[5455,"A","Other","Regional","405 SA  Rural - Barossa & Yorke Peninsula","Nonmetro","F Pop <= 500",null,null,58,0,null,null,null,"Refer to Distribution Partner",21.666666666666668,null,2,2,0,0,0,0,3,null,null,null,null,null,5460]
[5460,"A","Other","Regional","405 SA  Rural - Barossa & Yorke Peninsula","Nonmetro","E Pop > 500",null,null,746,0,null,null,null,"Refer to Distribution Partner",21.666666666666668,null,2,2,0,0,0,0,3,null,null,null,null,null,5461]
[5461,"A","Other","Regional","405 SA  Rural - Barossa & Yorke Peninsula","Nonmetro","D Pop > 2,000",null,null,2553,88.3,null,null,null,"Refer to Distribution Partner",31.666666666666664,null,2,2,1,0,0,1,3,null,null,null,null,null,5462]
[5462,"A","Other","Regional","405 SA  Rural - Barossa & Yorke Peninsula","Nonmetro","E Pop > 500",null,null,518,120.6,null,null,null,"Refer to Distribution Partner",25,null,2,2,0,0,0,1,3,null,null,null,null,null,5464]
[5464,"A","Other","Regional","405 SA  Rural - Barossa & Yorke Peninsula","Nonmetro","F Pop <= 500",null,null,634,0,null,null,null,"Refer to Distribution Partner",21.666666666666668,null,2,2,0,0,0,0,3,null,null,null,null,null,5470]
[5470,"A","Other","Regional","405 SA  Rural - Barossa & Yorke Peninsula","Nonmetro","F Pop <= 500",null,null,140,0,null,null,null,"Refer to Distribution Partner",21.666666666666668,null,2,2,0,0,0,0,3,null,null,null,null,null,5471]
[5471,"A","Other","Regional","405 SA  Rural - Barossa & Yorke Peninsula","Nonmetro","F Pop <= 500",null,null,88,0,null,null,null,"Refer to Distribution Partner",21.666666666666668,null,2,2,0,0,0,0,3,null,null,null,null,null,5472]
[5472,"A","Other","Regional","405 SA  Rural - Barossa & Yorke Peninsula","Nonmetro","F Pop <= 500",null,null,168,0,null,null,null,"Refer to Distribution Partner",21.666666666666668,null,2,2,0,0,0,0,3,null,null,null,null,null,5473]
[5473,"A","Other","Regional","405 SA  Rural - Barossa & Yorke Peninsula","Nonmetro","E Pop > 500",null,null,755,0,null,null,null,"Refer to Distribution Partner",21.666666666666668,null,2,2,0,0,0,0,3,null,null,null,null,null,5480]
[5480,"A","Other","Regional","405 SA  Rural - Barossa & Yorke Peninsula","Nonmetro","E Pop > 500",null,null,773,196.1,null,null,null,"Refer to Distribution Partner",21.666666666666668,null,2,2,0,0,0,0,3,null,null,null,null,null,5481]
[5481,"A","Other","Regional","405 SA  Rural - Barossa & Yorke Peninsula","Nonmetro","E Pop > 500",null,null,562,0,null,null,null,"Refer to Distribution Partner",21.666666666666668,null,2,2,0,0,0,0,3,null,null,null,null,null,5482]
[5482,"A","Other","Regional","405 SA  Rural - Barossa & Yorke Peninsula","Nonmetro","E Pop > 500",null,null,516,0,null,null,null,"Refer to Distribution Partner",21.666666666666668,null,2,2,0,0,0,0,3,null,null,null,null,null,5483]
[5483,"A","Other","Regional","405 SA  Rural - Barossa & Yorke Peninsula","Nonmetro","F Pop <= 500",null,null,347,0,null,null,null,"Refer to Distribution Partner",21.666666666666668,null,2,2,0,0,0,0,3,null,null,null,null,null,5485]
[5485,"A","Other","Regional","405 SA  Rural - Barossa & Yorke Peninsula","Nonmetro","E Pop > 500",null,null,581,257.39999999999998,null,null,null,"Refer to Distribution Partner",21.666666666666668,null,2,2,0,0,0,0,3,null,null,null,null,null,5490]
[5490,"A","Other","Regional","405 SA  Rural - Barossa & Yorke Peninsula","Nonmetro","F Pop <= 500",null,null,172,0,null,null,null,"Refer to Distribution Partner",21.666666666666668,null,2,2,0,0,0,0,3,null,null,null,null,null,5491]
[5491,"A","Other","Regional","405 SA  Rural - Barossa & Yorke Peninsula","Nonmetro","E Pop > 500",null,null,1816,191.3,null,null,null,"Refer to Distribution Partner",21.666666666666668,null,2,2,0,0,0,0,3,null,null,null,null,null,5493]
[5493,"A","Other","Regional","405 SA  Rural - Barossa & Yorke Peninsula","Nonmetro","F Pop <= 500",null,null,91,0,null,null,null,"Refer to Distribution Partner",21.666666666666668,null,2,2,0,0,0,0,3,null,null,null,null,null,5495]
[5495,"A","Other","Regional","405 SA  Rural - Barossa & Yorke Peninsula","Nonmetro","E Pop > 500",null,null,595,0,null,null,null,{"$f":"IF(ISBLANK(N2076),IF(AND(H2076<>\"\",IF(I2076=\"High Density\",\"High Density\",IF(AND(P2076<=45,P2076>0),\"Refer to Distribution Partner\",IF(AND(P2076<=55,P2076>45),\"Regional\",IF(AND(P2076>55,P2076<=70),\"Non Metro\",IF(F2076=\"Nonmetro\",\"Non Metro\",IF(P2076>70,\"Metro\",\"\"))))))=\"Refer to Distribution Partner\"),\"Regional\",IF(I2076=\"High Density\",\"High Density\",IF(AND(P2076<=45,P2076>0),\"Refer to Distribution Partner\",IF(AND(P2076<=55,P2076>45),\"Regional\",IF(AND(P2076>55,P2076<=70),\"Non Metro\",IF(F2076=\"Nonmetro\",\"Non Metro\",IF(P2076>70,\"Metro\",\"\"))))))),N2076)","v":"Refer to Distribution Partner"},{"$f":"(R2076/$AB$3*$AA$3+S2076/$AB$4*$AA$4+T2076/$AB$5*$AA$5+U2076/$AB$6*$AA$6+V2076/$AB$7*$AA$7+W2076/$AB$8*$AA$8+X2076/$AB$9*$AA$9)*100","v":21.666666666666668},null,{"$f":"IF(ISNUMBER(SEARCH(\"Metro\",E2076)),3,IF(ISNUMBER(SEARCH(\"Rural\",E2076)),2,1))","v":2},{"$f":"IF(ISNUMBER(FIND(\"Metro\",F2076)),3,IF(ISNUMBER(FIND(\"Nonmetro\",F2076)),2,3))","v":2},{"$f":"IF(G2076=\"A Metro\",3,IF(G2076=\"B Regional\",2,IF(G2076=\"C Pop > 7,000\",1,IF(G2076=\"D Pop > 2,000\",1,0))))","v":0},{"$f":"IF(H2076=1,3,IF(H2076=2,2,IF(H2076=3,1,0)))","v":0},{"$f":"IF(J2076>=100000,3,IF(AND(J2076>=10000,J2076<100000),2,IF(AND(J2076>=5000,J2076<10000),1,0)))","v":0},{"$f":"IF(AND(K2076>=0.1,K2076<25),3,IF(AND(K2076>=25,K2076<50),2,IF(AND(K2076>=50,K2076<150),1,0)))","v":0},{"$f":"IF(L2076=\"\",3,0)","v":3},null,null,null,null,null,5501]
[5501,"A","Regional","Regional","402 SA  Metro - Gawler","Nonmetro","B Regional",3,null,7323,42.9,null,null,null,"Non Metro",56.666666666666664,null,3,2,2,1,1,2,3,null,null,null,null,null,5502]
[5502,"A","Other","Regional","405 SA  Rural - Barossa & Yorke Peninsula","Nonmetro","E Pop > 500",null,null,1540,53.7,null,null,null,"Refer to Distribution Partner",25,null,2,2,0,0,0,1,3,null,null,null,null,null,5510]
[5510,"A","Other","Regional","405 SA  Rural - Barossa & Yorke Peninsula","Nonmetro","F Pop <= 500",null,null,113,0,null,null,null,"Refer to Distribution Partner",21.666666666666668,null,2,2,0,0,0,0,3,null,null,null,null,null,5520]
[5520,"A","Other","Regional","405 SA  Rural - Barossa & Yorke Peninsula","Nonmetro","E Pop > 500",null,null,589,132,null,null,null,"Refer to Distribution Partner",25,null,2,2,0,0,0,1,3,null,null,null,null,null,5521]
[5521,"A","Other","Regional","405 SA  Rural - Barossa & Yorke Peninsula","Nonmetro","F Pop <= 500",null,null,148,0,null,null,null,"Refer to Distribution Partner",21.666666666666668,null,2,2,0,0,0,0,3,null,null,null,null,null,5522]
[5522,"A","Other","Regional","405 SA  Rural - Barossa & Yorke Peninsula","Nonmetro","E Pop > 500",null,null,1421,160.4,null,null,null,"Refer to Distribution Partner",21.666666666666668,null,2,2,0,0,0,0,3,null,null,null,null,null,5523]
[5523,"A","Other","Regional","405 SA  Rural - Barossa & Yorke Peninsula","Nonmetro","E Pop > 500",null,null,1935,179.1,null,null,null,"Refer to Distribution Partner",21.666666666666668,null,2,2,0,0,0,0,3,null,null,null,null,null,5540]
[5540,"A","Other","Regional","405 SA  Rural - Barossa & Yorke Peninsula","Nonmetro","C Pop > 7,000",3,null,15343,200.4,null,null,null,"Regional",48.333333333333336,null,2,2,1,1,2,0,3,null,null,null,null,null,5550]
[5550,"A","Other","Regional","405 SA  Rural - Barossa & Yorke Peninsula","Nonmetro","E Pop > 500",null,null,916,93.5,null,null,null,"Refer to Distribution Partner",25,null,2,2,0,0,0,1,3,null,null,null,null,null,5552]
[5552,"A","Other","Regional","405 SA  Rural - Barossa & Yorke Peninsula","Nonmetro","F Pop <= 500",null,null,381,0,null,null,null,"Refer to Distribution Partner",21.666666666666668,null,2,2,0,0,0,0,3,null,null,null,null,null,5554]
[5554,"A","Other","Regional","405 SA  Rural - Barossa & Yorke Peninsula","Nonmetro","D Pop > 2,000",3,null,5233,134.5,null,null,null,"Regional",44.999999999999993,null,2,2,1,1,1,1,3,null,null,null,null,null,5555]
[5555,"A","Other","Regional","405 SA  Rural - Barossa & Yorke Peninsula","Nonmetro","E Pop > 500",null,null,502,0,null,null,null,"Refer to Distribution Partner",21.666666666666668,null,2,2,0,0,0,0,3,null,null,null,null,null,5556]
[5556,"A","Other","Regional","405 SA  Rural - Barossa & Yorke Peninsula","Nonmetro","D Pop > 2,000",3,null,4039,142.4,null,null,"Regional","Regional",38.333333333333329,null,2,2,1,1,0,1,3,null,null,null,null,null,5558]
[5558,"A","Other","Regional","405 SA  Rural - Barossa & Yorke Peninsula","Nonmetro","D Pop > 2,000",3,null,4830,134.4,null,null,"Regional","Regional",38.333333333333329,null,2,2,1,1,0,1,3,null,null,null,null,null,5560]
[5560,"A","Other","Regional","405 SA  Rural - Barossa & Yorke Peninsula","Nonmetro","F Pop <= 500",null,null,471,0,null,null,null,"Refer to Distribution Partner",21.666666666666668,null,2,2,0,0,0,0,3,null,null,null,null,null,5570]
[5570,"A","Other","Regional","405 SA  Rural - Barossa & Yorke Peninsula","Nonmetro","E Pop > 500",null,null,544,93.9,null,null,null,"Refer to Distribution Partner",25,null,2,2,0,0,0,1,3,null,null,null,null,null,5571]
[5571,"A","Other","Regional","405 SA  Rural - Barossa & Yorke Peninsula","Nonmetro","E Pop > 500",null,null,1850,82.9,null,null,null,"Refer to Distribution Partner",25,null,2,2,0,0,0,1,3,null,null,null,null,null,5572]
[5572,"A","Other","Regional","405 SA  Rural - Barossa & Yorke Peninsula","Nonmetro","F Pop <= 500",null,null,148,0,null,null,null,"Refer to Distribution Partner",21.666666666666668,null,2,2,0,0,0,0,3,null,null,null,null,null,5573]
[5573,"A","Other","Regional","405 SA  Rural - Barossa & Yorke Peninsula","Nonmetro","D Pop > 2,000",null,null,2041,110.6,null,null,null,"Refer to Distribution Partner",31.666666666666664,null,2,2,1,0,0,1,3,null,null,null,null,null,5575]
[5575,"A","Other","Regional","405 SA  Rural - Barossa & Yorke Peninsula","Nonmetro","D Pop > 2,000",null,null,2332,111.5,null,null,null,"Refer to Distribution Partner",31.666666666666664,null,2,2,1,0,0,1,3,null,null,null,null,null,5576]
[5576,"A","Other","Regional","405 SA  Rural - Barossa & Yorke Peninsula","Nonmetro","E Pop > 500",null,null,1070,92.6,null,null,null,"Refer to Distribution Partner",25,null,2,2,0,0,0,1,3,null,null,null,null,null,5577]
[5577,"A","Other","Regional","405 SA  Rural - Barossa & Yorke Peninsula","Nonmetro","F Pop <= 500",null,null,528,123,null,null,null,"Refer to Distribution Partner",25,null,2,2,0,0,0,1,3,null,null,null,null,null,5580]
[5580,"A","Other","Regional","405 SA  Rural - Barossa & Yorke Peninsula","Nonmetro","F Pop <= 500",null,null,346,0,null,null,null,"Refer to Distribution Partner",21.666666666666668,null,2,2,0,0,0,0,3,null,null,null,null,null,5581]
[5581,"A","Other","Regional","405 SA  Rural - Barossa & Yorke Peninsula","Nonmetro","F Pop <= 500",null,null,542,69.8,null,null,null,"Refer to Distribution Partner",25,null,2,2,0,0,0,1,3,null,null,null,null,null,5582]
[5582,"A","Other","Regional","405 SA  Rural - Barossa & Yorke Peninsula","Nonmetro","E Pop > 500",null,null,648,73.400000000000006,null,null,null,"Refer to Distribution Partner",25,null,2,2,0,0,0,1,3,null,null,null,null,null,5583]
[5583,"A","Other","Regional","405 SA  Rural - Barossa & Yorke Peninsula","Nonmetro","E Pop > 500",null,null,785,79.900000000000006,null,null,null,"Refer to Distribution Partner",25,null,2,2,0,0,0,1,3,null,null,null,null,null,5600]
[5600,"A","Other","Regional","406 SA  Rural - Outback","Nonmetro","C Pop > 7,000",2,null,6202,231.1,"Mining",null,null,"Regional",43.333333333333336,null,2,2,1,2,1,0,0,null,null,null,null,null,5601]
[5601,"A","Other","Regional","406 SA  Rural - Outback","Nonmetro","F Pop <= 500",null,null,469,0,"Mining",null,null,"Refer to Distribution Partner",16.666666666666664,null,2,2,0,0,0,0,0,null,null,null,null,null,5602]
[5602,"A","Other","Regional","406 SA  Rural - Outback","Nonmetro","E Pop > 500",null,null,1341,208.5,null,null,null,"Refer to Distribution Partner",21.666666666666668,null,2,2,0,0,0,0,3,null,null,null,null,null,5603]
[5603,"A","Other","Regional","406 SA  Rural - Outback","Nonmetro","F Pop <= 500",null,null,446,0,null,null,null,"Refer to Distribution Partner",21.666666666666668,null,2,2,0,0,0,0,3,null,null,null,null,null,5604]
[5604,"A","Other","Regional","406 SA  Rural - Outback","Nonmetro","F Pop <= 500",null,null,194,0,null,null,null,"Refer to Distribution Partner",21.666666666666668,null,2,2,0,0,0,0,3,null,null,null,null,null,5605]
[5605,"A","Other","Regional","406 SA  Rural - Outback","Nonmetro","E Pop > 500",null,null,1690,236.2,null,null,null,"Refer to Distribution Partner",21.666666666666668,null,2,2,0,0,0,0,3,null,null,null,null,null,5606]
[5606,"A","Other","Regional","406 SA  Rural - Outback","Nonmetro","C Pop > 7,000",3,null,14128,251.4,null,null,null,"Regional",48.333333333333336,null,2,2,1,1,2,0,3,null,null,null,null,null,5607]
[5607,"A","Other","Regional","406 SA  Rural - Outback","Nonmetro","D Pop > 2,000",3,null,4919,274.10000000000002,null,null,"Regional","Regional",35,null,2,2,1,1,0,0,3,null,null,null,null,null,5608]
[5608,"A","Other","Regional","406 SA  Rural - Outback","Nonmetro","C Pop > 7,000",2,null,13357,233.2,"Mining",null,null,"Regional",50,null,2,2,1,2,2,0,0,null,null,null,null,null,5609]
[5609,"A","Other","Regional","406 SA  Rural - Outback","Nonmetro","E Pop > 500",2,null,1950,234.1,"Mining",null,"Regional","Regional",30,null,2,2,0,2,0,0,0,null,null,null,null,null,5630]
[5630,"A","Other","Regional","406 SA  Rural - Outback","Nonmetro","F Pop <= 500",null,null,136,0,null,null,null,"Refer to Distribution Partner",21.666666666666668,null,2,2,0,0,0,0,3,null,null,null,null,null,5631]
[5631,"A","Other","Regional","406 SA  Rural - Outback","Nonmetro","E Pop > 500",null,null,1046,0,null,null,null,"Refer to Distribution Partner",21.666666666666668,null,2,2,0,0,0,0,3,null,null,null,null,null,5632]
[5632,"A","Other","Regional","406 SA  Rural - Outback","Nonmetro","F Pop <= 500",null,null,250,0,null,null,null,"Refer to Distribution Partner",21.666666666666668,null,2,2,0,0,0,0,3,null,null,null,null,null,5633]
[5633,"A","Other","Regional","406 SA  Rural - Outback","Nonmetro","F Pop <= 500",null,null,321,0,null,null,null,"Refer to Distribution Partner",21.666666666666668,null,2,2,0,0,0,0,3,null,null,null,null,null,5640]
[5640,"A","Other","Regional","406 SA  Rural - Outback","Nonmetro","E Pop > 500",null,null,1017,236.3,null,null,null,"Refer to Distribution Partner",21.666666666666668,null,2,2,0,0,0,0,3,null,null,null,null,null,5641]
[5641,"A","Other","Regional","406 SA  Rural - Outback","Nonmetro","E Pop > 500",null,null,1023,0,null,null,null,"Refer to Distribution Partner",21.666666666666668,null,2,2,0,0,0,0,3,null,null,null,null,null,5642]
[5642,"A","Other","Regional","406 SA  Rural - Outback","Nonmetro","E Pop > 500",null,null,251,0,null,null,null,"Refer to Distribution Partner",21.666666666666668,null,2,2,0,0,0,0,3,null,null,null,null,null,5650]
[5650,"A","Other","Regional","406 SA  Rural - Outback","Nonmetro","F Pop <= 500",null,null,175,0,null,null,null,"Refer to Distribution Partner",21.666666666666668,null,2,2,0,0,0,0,3,null,null,null,null,null,5651]
[5651,"A","Other","Regional","406 SA  Rural - Outback","Nonmetro","F Pop <= 500",null,null,79,0,null,null,null,"Refer to Distribution Partner",21.666666666666668,null,2,2,0,0,0,0,3,null,null,null,null,null,5652]
[5652,"A","Other","Regional","406 SA  Rural - Outback","Nonmetro","E Pop > 500",null,null,728,0,null,null,null,"Refer to Distribution Partner",21.666666666666668,null,2,2,0,0,0,0,3,null,null,null,null,null,5653]
[5653,"A","Other","Regional","406 SA  Rural - Outback","Nonmetro","F Pop <= 500",null,null,79,0,null,null,null,"Refer to Distribution Partner",21.666666666666668,null,2,2,0,0,0,0,3,null,null,null,null,null,5654]
[5654,"A","Other","Regional","406 SA  Rural - Outback","Nonmetro","F Pop <= 500",null,null,241,0,null,null,null,"Refer to Distribution Partner",21.666666666666668,null,2,2,0,0,0,0,3,null,null,null,null,null,5655]
[5655,"A","Other","Regional","406 SA  Rural - Outback","Nonmetro","F Pop <= 500",null,null,100,0,null,null,null,"Refer to Distribution Partner",21.666666666666668,null,2,2,0,0,0,0,3,null,null,null,null,null,5660]
[5660,"A","Other","Regional","406 SA  Rural - Outback","Nonmetro","F Pop <= 500",null,null,45,0,null,null,null,"Refer to Distribution Partner",21.666666666666668,null,2,2,0,0,0,0,3,null,null,null,null,null,5661]
[5661,"A","Other","Regional","406 SA  Rural - Outback","Nonmetro","F Pop <= 500",null,null,146,0,null,null,null,"Refer to Distribution Partner",21.666666666666668,null,2,2,0,0,0,0,3,null,null,null,null,null,5670]
[5670,"A","Other","Regional","406 SA  Rural - Outback","Nonmetro","F Pop <= 500",null,null,482,0,null,null,null,"Refer to Distribution Partner",21.666666666666668,null,2,2,0,0,0,0,3,null,null,null,null,null,5671]
[5671,"A","Other","Regional","406 SA  Rural - Outback","Nonmetro","E Pop > 500",null,null,163,0,null,null,null,"Refer to Distribution Partner",21.666666666666668,null,2,2,0,0,0,0,3,null,null,null,null,null,5680]
[5680,"A","Other","Regional","406 SA  Rural - Outback","Nonmetro","D Pop > 2,000",null,null,2117,472.3,null,null,null,"Refer to Distribution Partner",28.333333333333332,null,2,2,1,0,0,0,3,null,null,null,null,null,5690]
[5690,"A","Other","Regional","406 SA  Rural - Outback","Nonmetro","D Pop > 2,000",null,null,3656,555.4,null,null,null,"Refer to Distribution Partner",28.333333333333332,null,2,2,1,0,0,0,3,null,null,null,null,null,5700]
[5700,"A","Other","Regional","406 SA  Rural - Outback","Nonmetro","C Pop > 7,000",3,null,11136,281.2,null,null,null,"Regional",48.333333333333336,null,2,2,1,1,2,0,3,null,null,null,null,null,5701]
[5701,"A","Other","Regional","Unknown","Nonmetro","C Pop > 7,000",null,null,8,0,null,null,null,"Refer to Distribution Partner",26.666666666666668,null,1,2,1,0,0,0,3,null,null,null,null,null,5710]
[5710,"A","Other","Regional","406 SA  Rural - Outback","Nonmetro","D Pop > 2,000",null,null,2673,277.39999999999998,null,null,null,"Refer to Distribution Partner",28.333333333333332,null,2,2,1,0,0,0,3,null,null,null,null,null,5713]
[5713,"A","Other","Regional","Unknown","Nonmetro","F Pop <= 500",null,null,18,0,null,null,null,"Refer to Distribution Partner",20,null,1,2,0,0,0,0,3,null,null,null,null,null,5715]
[5715,"A","Other","Regional","Unknown","Nonmetro","F Pop <= 500",null,null,42,0,null,null,null,"Refer to Distribution Partner",20,null,1,2,0,0,0,0,3,null,null,null,null,null,5717]
[5717,"A","Other","Regional","Unknown","Nonmetro","F Pop <= 500",null,null,19,0,null,null,null,"Refer to Distribution Partner",20,null,1,2,0,0,0,0,3,null,null,null,null,null,5719]
[5719,"A","Other","Regional","Unknown","Nonmetro","F Pop <= 500",2,null,41,0,null,null,"Regional","Regional",33.333333333333329,null,1,2,0,2,0,0,3,null,null,null,null,null,5720]
[5720,"A","Other","Regional","406 SA  Rural - Outback","Nonmetro","F Pop <= 500",null,null,195,0,null,null,null,"Refer to Distribution Partner",21.666666666666668,null,2,2,0,0,0,0,3,null,null,null,null,null,5722]
[5722,"A","Other","Regional","406 SA  Rural - Outback","Nonmetro","E Pop > 500",null,null,316,0,"Mining",null,null,{"$f":"IF(ISBLANK(N2140),IF(AND(H2140<>\"\",IF(I2140=\"High Density\",\"High Density\",IF(AND(P2140<=45,P2140>0),\"Refer to Distribution Partner\",IF(AND(P2140<=55,P2140>45),\"Regional\",IF(AND(P2140>55,P2140<=70),\"Non Metro\",IF(F2140=\"Nonmetro\",\"Non Metro\",IF(P2140>70,\"Metro\",\"\"))))))=\"Refer to Distribution Partner\"),\"Regional\",IF(I2140=\"High Density\",\"High Density\",IF(AND(P2140<=45,P2140>0),\"Refer to Distribution Partner\",IF(AND(P2140<=55,P2140>45),\"Regional\",IF(AND(P2140>55,P2140<=70),\"Non Metro\",IF(F2140=\"Nonmetro\",\"Non Metro\",IF(P2140>70,\"Metro\",\"\"))))))),N2140)","v":"Refer to Distribution Partner"},{"$f":"(R2140/$AB$3*$AA$3+S2140/$AB$4*$AA$4+T2140/$AB$5*$AA$5+U2140/$AB$6*$AA$6+V2140/$AB$7*$AA$7+W2140/$AB$8*$AA$8+X2140/$AB$9*$AA$9)*100","v":16.666666666666664},null,{"$f":"IF(ISNUMBER(SEARCH(\"Metro\",E2140)),3,IF(ISNUMBER(SEARCH(\"Rural\",E2140)),2,1))","v":2},{"$f":"IF(ISNUMBER(FIND(\"Metro\",F2140)),3,IF(ISNUMBER(FIND(\"Nonmetro\",F2140)),2,3))","v":2},{"$f":"IF(G2140=\"A Metro\",3,IF(G2140=\"B Regional\",2,IF(G2140=\"C Pop > 7,000\",1,IF(G2140=\"D Pop > 2,000\",1,0))))","v":0},{"$f":"IF(H2140=1,3,IF(H2140=2,2,IF(H2140=3,1,0)))","v":0},{"$f":"IF(J2140>=100000,3,IF(AND(J2140>=10000,J2140<100000),2,IF(AND(J2140>=5000,J2140<10000),1,0)))","v":0},{"$f":"IF(AND(K2140>=0.1,K2140<25),3,IF(AND(K2140>=25,K2140<50),2,IF(AND(K2140>=50,K2140<150),1,0)))","v":0},{"$f":"IF(L2140=\"\",3,0)","v":0},null,null,null,null,null,5723]
[5723,"A","Other","Regional","406 SA  Rural - Outback","Nonmetro","E Pop > 500",null,null,2059,750.6,"Mining",null,null,"Refer to Distribution Partner",16.666666666666664,null,2,2,0,0,0,0,0,null,null,null,null,null,5724]
[5724,"A","Other","Regional","406 SA  Rural - Outback","Nonmetro","E Pop > 500",null,null,433,0,null,null,null,"Refer to Distribution Partner",21.666666666666668,null,2,2,0,0,0,0,3,null,null,null,null,null,5725]
[5725,"A","Other","Regional","406 SA  Rural - Outback","Nonmetro","D Pop > 2,000",null,null,3888,510.6,"Mining",null,null,"Refer to Distribution Partner",23.333333333333332,null,2,2,1,0,0,0,0,null,null,null,null,null,5730]
[5730,"A","Other","Regional","406 SA  Rural - Outback","Nonmetro","F Pop <= 500",null,null,94,0,null,null,null,"Refer to Distribution Partner",21.666666666666668,null,2,2,0,0,0,0,3,null,null,null,null,null,5731]
[5731,"A","Other","Regional","406 SA  Rural - Outback","Nonmetro","E Pop > 500",null,null,499,0,"Mining",null,null,"Refer to Distribution Partner",16.666666666666664,null,2,2,0,0,0,0,0,null,null,null,null,null,5732]
[5732,"A","Other","Regional","406 SA  Rural - Outback","Nonmetro","F Pop <= 500",null,null,211,0,"Mining",null,null,"Refer to Distribution Partner",16.666666666666664,null,2,2,0,0,0,0,0,null,null,null,null,null,5733]
[5733,"A","Other","Regional","406 SA  Rural - Outback","Nonmetro","F Pop <= 500",null,null,229,0,"Mining",null,null,"Refer to Distribution Partner",16.666666666666664,null,2,2,0,0,0,0,0,null,null,null,null,null,5734]
[5734,"A","Other","Regional","406 SA  Rural - Outback","Nonmetro","F Pop <= 500",null,null,167,0,null,null,null,"Refer to Distribution Partner",21.666666666666668,null,2,2,0,0,0,0,3,null,null,null,null,null,6000]
[6000,"A","Metro","Inner City","503 WA  Metro - CBD & Inner Suburbs","Metro","A Metro",1,null,11425,1.3,null,null,null,"Metro",93.333333333333329,null,3,3,3,3,2,3,3,null,null,null,null,null,6003]
[6003,"A","Metro","Inner City","503 WA  Metro - CBD & Inner Suburbs","Metro","A Metro",1,null,3509,1.7,null,null,null,"Metro",80,null,3,3,3,3,0,3,3,null,null,null,null,null,6004]
[6004,"A","Metro","Inner City","503 WA  Metro - CBD & Inner Suburbs","Metro","A Metro",1,null,10596,2,null,null,null,"Metro",93.333333333333329,null,3,3,3,3,2,3,3,null,null,null,null,null,6005]
[6005,"A","Metro","Metro","503 WA  Metro - CBD & Inner Suburbs","Metro","A Metro",1,null,5624,1.7,null,null,null,"Metro",86.666666666666671,null,3,3,3,3,1,3,3,null,null,null,null,null,6006]
[6006,"A","Metro","Metro","503 WA  Metro - CBD & Inner Suburbs","Metro","A Metro",1,null,8744,3,null,null,null,"Metro",86.666666666666671,null,3,3,3,3,1,3,3,null,null,null,null,null,6007]
[6007,"A","Metro","Metro","503 WA  Metro - CBD & Inner Suburbs","Metro","A Metro",1,null,7130,2.9,null,null,null,"Metro",86.666666666666671,null,3,3,3,3,1,3,3,null,null,null,null,null,6008]
[6008,"A","Metro","Metro","503 WA  Metro - CBD & Inner Suburbs","Metro","A Metro",1,null,15144,3.9,null,null,null,"Metro",93.333333333333329,null,3,3,3,3,2,3,3,null,null,null,null,null,6009]
[6009,"A","Metro","Metro","503 WA  Metro - CBD & Inner Suburbs","Metro","A Metro",1,null,18534,6.5,null,null,null,"Metro",93.333333333333329,null,3,3,3,3,2,3,3,null,null,null,null,null,6010]
[6010,"A","Metro","Metro","503 WA  Metro - CBD & Inner Suburbs","Metro","A Metro",1,null,16825,8.1,null,null,null,"Metro",93.333333333333329,null,3,3,3,3,2,3,3,null,null,null,null,null,6011]
[6011,"A","Metro","Metro","503 WA  Metro - CBD & Inner Suburbs","Metro","A Metro",1,null,9007,10.7,null,null,null,"Metro",86.666666666666671,null,3,3,3,3,1,3,3,null,null,null,null,null,6012]
[6012,"A","Metro","Metro","503 WA  Metro - CBD & Inner Suburbs","Metro","A Metro",1,null,8757,11.4,null,null,null,"Metro",86.666666666666671,null,3,3,3,3,1,3,3,null,null,null,null,null,6014]
[6014,"A","Metro","Metro","503 WA  Metro - CBD & Inner Suburbs","Metro","A Metro",1,null,20604,5.4,null,null,null,"Metro",93.333333333333329,null,3,3,3,3,2,3,3,null,null,null,null,null,6015]
[6015,"A","Metro","Metro","503 WA  Metro - CBD & Inner Suburbs","Metro","A Metro",1,null,6609,9.5,null,null,null,"Metro",86.666666666666671,null,3,3,3,3,1,3,3,null,null,null,null,null,6016]
[6016,"A","Metro","Metro","503 WA  Metro - CBD & Inner Suburbs","Metro","A Metro",1,null,10035,4.8,null,null,null,"Metro",93.333333333333329,null,3,3,3,3,2,3,3,null,null,null,null,null,6017]
[6017,"A","Metro","Metro","505 WA  Metro - Stirling","Metro","A Metro",1,null,4120,6.8,null,null,null,"Metro",80,null,3,3,3,3,0,3,3,null,null,null,null,null,6018]
[6018,"A","Metro","Metro","505 WA  Metro - Stirling","Metro","A Metro",1,null,38004,9.6999999999999993,null,null,null,"Metro",93.333333333333329,null,3,3,3,3,2,3,3,null,null,null,null,null,6019]
[6019,"A","Metro","Metro","505 WA  Metro - Stirling","Metro","A Metro",1,null,21787,10.8,null,null,null,"Metro",93.333333333333329,null,3,3,3,3,2,3,3,null,null,null,null,null,6020]
[6020,"A","Metro","Metro","505 WA  Metro - Stirling","Metro","A Metro",1,null,20791,15.6,null,null,null,"Metro",93.333333333333329,null,3,3,3,3,2,3,3,null,null,null,null,null,6021]
[6021,"A","Metro","Metro","505 WA  Metro - Stirling","Metro","A Metro",1,null,20058,8.6999999999999993,null,null,null,"Metro",93.333333333333329,null,3,3,3,3,2,3,3,null,null,null,null,null,6022]
[6022,"A","Metro","Metro","505 WA  Metro - Stirling","Metro","A Metro",1,null,4982,12.1,null,null,null,"Metro",80,null,3,3,3,3,0,3,3,null,null,null,null,null,6023]
[6023,"A","Metro","Metro","505 WA  Metro - Stirling","Metro","A Metro",1,null,15268,15.4,null,null,null,"Metro",93.333333333333329,null,3,3,3,3,2,3,3,null,null,null,null,null,6024]
[6024,"A","Metro","Metro","505 WA  Metro - Stirling","Metro","A Metro",1,null,13347,14.4,null,null,null,"Metro",93.333333333333329,null,3,3,3,3,2,3,3,null,null,null,null,null,6025]
[6025,"A","Metro","Metro","505 WA  Metro - Stirling","Metro","A Metro",1,null,30031,20,null,null,null,"Metro",93.333333333333329,null,3,3,3,3,2,3,3,null,null,null,null,null,6026]
[6026,"A","Metro","Metro","505 WA  Metro - Stirling","Metro","A Metro",1,null,22337,17.899999999999999,null,null,null,"Metro",93.333333333333329,null,3,3,3,3,2,3,3,null,null,null,null,null,6027]
[6027,"A","Metro","Metro","505 WA  Metro - Stirling","Metro","A Metro",1,null,41677,24.3,null,null,null,"Metro",93.333333333333329,null,3,3,3,3,2,3,3,null,null,null,null,null,6028]
[6028,"A","Metro","Metro","505 WA  Metro - Stirling","Metro","A Metro",1,null,22440,27.5,null,null,null,"Metro",90,null,3,3,3,3,2,2,3,null,null,null,null,null,6029]
[6029,"A","Metro","Metro","505 WA  Metro - Stirling","Metro","A Metro",1,null,2794,12.9,null,null,null,"Metro",80,null,3,3,3,3,0,3,3,null,null,null,null,null,6030]
[6030,"A","Metro","Metro","505 WA  Metro - Stirling","Metro","A Metro",1,null,39386,33.700000000000003,null,null,null,"Metro",90,null,3,3,3,3,2,2,3,null,null,null,null,null,6031]
[6031,"A","Metro","Metro","505 WA  Metro - Stirling","Metro","A Metro",1,null,16624,28.6,null,null,null,"Metro",90,null,3,3,3,3,2,2,3,null,null,null,null,null,6032]
[6032,"A","Metro","Metro","505 WA  Metro - Stirling","Metro","A Metro",1,null,195,0,null,null,null,"Non Metro",70,null,3,3,3,3,0,0,3,null,null,null,null,null,6033]
[6033,"A","Metro","Metro","505 WA  Metro - Stirling","Metro","A Metro",1,null,442,0,null,null,null,"Non Metro",70,null,3,3,3,3,0,0,3,null,null,null,null,null,6034]
[6034,"A","Metro","Metro","505 WA  Metro - Stirling","Metro","A Metro",1,null,1680,43.6,null,null,null,"Metro",76.666666666666671,null,3,3,3,3,0,2,3,null,null,null,null,null,6035]
[6035,"A","Metro","Metro","505 WA  Metro - Stirling","Metro","A Metro",1,null,8868,49.7,null,null,null,"Metro",83.333333333333343,null,3,3,3,3,1,2,3,null,null,null,null,null,6036]
[6036,"A","Metro","Metro","505 WA  Metro - Stirling","Metro","A Metro",1,null,15796,37.5,null,null,null,"Metro",90,null,3,3,3,3,2,2,3,null,null,null,null,null,6037]
[6037,"A","Metro","Metro","505 WA  Metro - Stirling","Metro","A Metro",1,null,2990,56.3,null,null,null,"Metro",73.333333333333343,null,3,3,3,3,0,1,3,null,null,null,null,null,6038]
[6038,"A","Metro","Metro","505 WA  Metro - Stirling","Metro","A Metro",1,null,6269,42.9,null,null,null,"Metro",83.333333333333343,null,3,3,3,3,1,2,3,null,null,null,null,null,6041]
[6041,"A","Regional","Metro","509 WA  Rural - Wheat Belt","Metro","B Regional",1,null,1514,76.099999999999994,null,null,null,"Non Metro",65,null,2,3,2,3,0,1,3,null,null,null,null,null,6042]
[6042,"A","Regional","Metro","509 WA  Rural - Wheat Belt","Metro","B Regional",1,null,78,84.8,null,null,null,"Non Metro",65,null,2,3,2,3,0,1,3,null,null,null,null,null,6043]
[6043,"A","Regional","Metro","509 WA  Rural - Wheat Belt","Metro","B Regional",1,null,244,104.8,null,null,null,"Non Metro",65,null,2,3,2,3,0,1,3,null,null,null,null,null,6044]
[6044,"A","Regional","Metro","509 WA  Rural - Wheat Belt","Metro","B Regional",1,null,1233,115.4,null,null,null,"Non Metro",65,null,2,3,2,3,0,1,3,null,null,null,null,null,6050]
[6050,"A","Metro","Metro","503 WA  Metro - CBD & Inner Suburbs","Metro","A Metro",1,null,15380,3.2,null,null,null,"Metro",93.333333333333329,null,3,3,3,3,2,3,3,null,null,null,null,null,6051]
[6051,"A","Metro","Metro","504 WA  Metro - Swan Districts","Metro","A Metro",1,null,12577,4.5,null,null,null,"Metro",93.333333333333329,null,3,3,3,3,2,3,3,null,null,null,null,null,6052]
[6052,"A","Metro","Metro","503 WA  Metro - CBD & Inner Suburbs","Metro","A Metro",1,null,11113,5.3,null,null,null,"Metro",93.333333333333329,null,3,3,3,3,2,3,3,null,null,null,null,null,6053]
[6053,"A","Metro","Metro","504 WA  Metro - Swan Districts","Metro","A Metro",1,null,14432,6.6,null,null,null,"Metro",93.333333333333329,null,3,3,3,3,2,3,3,null,null,null,null,null,6054]
[6054,"A","Metro","Metro","504 WA  Metro - Swan Districts","Metro","A Metro",1,null,20378,10.4,null,null,null,"Metro",93.333333333333329,null,3,3,3,3,2,3,3,null,null,null,null,null,6055]
[6055,"A","Metro","Metro","504 WA  Metro - Swan Districts","Metro","A Metro",1,null,21034,15.2,null,null,null,"Metro",93.333333333333329,null,3,3,3,3,2,3,3,null,null,null,null,null,6056]
[6056,"A","Metro","Metro","504 WA  Metro - Swan Districts","Metro","A Metro",1,null,39167,18.399999999999999,null,null,null,"Metro",93.333333333333329,null,3,3,3,3,2,3,3,null,null,null,null,null,6057]
[6057,"A","Metro","Metro","506 WA  Metro - Gosnells","Metro","A Metro",1,null,16806,14.4,null,null,null,"Metro",93.333333333333329,null,3,3,3,3,2,3,3,null,null,null,null,null,6058]
[6058,"A","Metro","Metro","506 WA  Metro - Gosnells","Metro","A Metro",1,null,12690,14.5,null,null,null,"Metro",93.333333333333329,null,3,3,3,3,2,3,3,null,null,null,null,null,6059]
[6059,"A","Metro","Metro","505 WA  Metro - Stirling","Metro","A Metro",1,null,23486,7,null,null,null,"Metro",93.333333333333329,null,3,3,3,3,2,3,3,null,null,null,null,null,6060]
[6060,"A","Metro","Metro","505 WA  Metro - Stirling","Metro","A Metro",1,null,23393,6.1,null,null,null,"Metro",93.333333333333329,null,3,3,3,3,2,3,3,null,null,null,null,null,6061]
[6061,"A","Metro","Metro","505 WA  Metro - Stirling","Metro","A Metro",1,null,38563,9.6999999999999993,null,null,null,"Metro",93.333333333333329,null,3,3,3,3,2,3,3,null,null,null,null,null,6062]
[6062,"A","Metro","Metro","504 WA  Metro - Swan Districts","Metro","A Metro",1,null,32670,8.6,null,null,null,"Metro",93.333333333333329,null,3,3,3,3,2,3,3,null,null,null,null,null,6063]
[6063,"A","Metro","Metro","504 WA  Metro - Swan Districts","Metro","A Metro",1,null,14359,12.5,null,null,null,"Metro",93.333333333333329,null,3,3,3,3,2,3,3,null,null,null,null,null,6064]
[6064,"A","Metro","Metro","505 WA  Metro - Stirling","Metro","A Metro",1,null,31325,13.3,null,null,null,"Metro",93.333333333333329,null,3,3,3,3,2,3,3,null,null,null,null,null,6065]
[6065,"A","Metro","Metro","505 WA  Metro - Stirling","Metro","A Metro",1,null,61998,20.399999999999999,null,null,null,{"$f":"IF(ISBLANK(N2204),IF(AND(H2204<>\"\",IF(I2204=\"High Density\",\"High Density\",IF(AND(P2204<=45,P2204>0),\"Refer to Distribution Partner\",IF(AND(P2204<=55,P2204>45),\"Regional\",IF(AND(P2204>55,P2204<=70),\"Non Metro\",IF(F2204=\"Nonmetro\",\"Non Metro\",IF(P2204>70,\"Metro\",\"\"))))))=\"Refer to Distribution Partner\"),\"Regional\",IF(I2204=\"High Density\",\"High Density\",IF(AND(P2204<=45,P2204>0),\"Refer to Distribution Partner\",IF(AND(P2204<=55,P2204>45),\"Regional\",IF(AND(P2204>55,P2204<=70),\"Non Metro\",IF(F2204=\"Nonmetro\",\"Non Metro\",IF(P2204>70,\"Metro\",\"\"))))))),N2204)","v":"Metro"},{"$f":"(R2204/$AB$3*$AA$3+S2204/$AB$4*$AA$4+T2204/$AB$5*$AA$5+U2204/$AB$6*$AA$6+V2204/$AB$7*$AA$7+W2204/$AB$8*$AA$8+X2204/$AB$9*$AA$9)*100","v":93.333333333333329},null,{"$f":"IF(ISNUMBER(SEARCH(\"Metro\",E2204)),3,IF(ISNUMBER(SEARCH(\"Rural\",E2204)),2,1))","v":3},{"$f":"IF(ISNUMBER(FIND(\"Metro\",F2204)),3,IF(ISNUMBER(FIND(\"Nonmetro\",F2204)),2,3))","v":3},{"$f":"IF(G2204=\"A Metro\",3,IF(G2204=\"B Regional\",2,IF(G2204=\"C Pop > 7,000\",1,IF(G2204=\"D Pop > 2,000\",1,0))))","v":3},{"$f":"IF(H2204=1,3,IF(H2204=2,2,IF(H2204=3,1,0)))","v":3},{"$f":"IF(J2204>=100000,3,IF(AND(J2204>=10000,J2204<100000),2,IF(AND(J2204>=5000,J2204<10000),1,0)))","v":2},{"$f":"IF(AND(K2204>=0.1,K2204<25),3,IF(AND(K2204>=25,K2204<50),2,IF(AND(K2204>=50,K2204<150),1,0)))","v":3},{"$f":"IF(L2204=\"\",3,0)","v":3},null,null,null,null,null,6066]
[6066,"A","Metro","Metro","504 WA  Metro - Swan Districts","Metro","A Metro",1,null,18704,13.4,null,null,null,"Metro",93.333333333333329,null,3,3,3,3,2,3,3,null,null,null,null,null,6067]
[6067,"A","Other","Metro","504 WA  Metro - Swan Districts","Metro","F Pop <= 500",1,null,36,0,null,null,null,"Regional",50,null,3,3,0,3,0,0,3,null,null,null,null,null,6068]
[6068,"A","Other","Metro","504 WA  Metro - Swan Districts","Metro","F Pop <= 500",1,null,7,0,null,null,null,"Regional",50,null,3,3,0,3,0,0,3,null,null,null,null,null,6069]
[6069,"A","Metro","Metro","504 WA  Metro - Swan Districts","Metro","A Metro",1,null,39391,23.5,null,null,null,"Metro",93.333333333333329,null,3,3,3,3,2,3,3,null,null,null,null,null,6070]
[6070,"A","Metro","Metro","504 WA  Metro - Swan Districts","Metro","A Metro",1,null,3656,21.1,null,null,null,"Metro",80,null,3,3,3,3,0,3,3,null,null,null,null,null,6071]
[6071,"A","Metro","Metro","504 WA  Metro - Swan Districts","Metro","A Metro",1,null,3400,23.9,null,null,null,"Metro",80,null,3,3,3,3,0,3,3,null,null,null,null,null,6072]
[6072,"A","Metro","Metro","504 WA  Metro - Swan Districts","Metro","A Metro",1,null,900,26.5,null,null,null,"Metro",76.666666666666671,null,3,3,3,3,0,2,3,null,null,null,null,null,6073]
[6073,"A","Metro","Metro","504 WA  Metro - Swan Districts","Metro","A Metro",1,null,3041,29.7,null,null,null,"Metro",76.666666666666671,null,3,3,3,3,0,2,3,null,null,null,null,null,6074]
[6074,"A","Regional","Metro","504 WA  Metro - Swan Districts","Metro","B Regional",1,null,991,32.799999999999997,null,null,null,"Non Metro",70,null,3,3,2,3,0,2,3,null,null,null,null,null,6076]
[6076,"A","Metro","Metro","506 WA  Metro - Gosnells","Metro","A Metro",1,null,21948,18.899999999999999,null,null,null,"Metro",93.333333333333329,null,3,3,3,3,2,3,3,null,null,null,null,null,6077]
[6077,"A","Regional","Metro","505 WA  Metro - Stirling","Metro","B Regional",1,null,1428,19.600000000000001,null,null,null,"Metro",73.333333333333329,null,3,3,2,3,0,3,3,null,null,null,null,null,6078]
[6078,"A","Regional","Metro","505 WA  Metro - Stirling","Metro","B Regional",1,null,934,27.9,null,null,null,"Non Metro",70,null,3,3,2,3,0,2,3,null,null,null,null,null,6079]
[6079,"A","Regional","Metro","505 WA  Metro - Stirling","Metro","B Regional",1,null,30,0,null,null,null,"Non Metro",63.333333333333329,null,3,3,2,3,0,0,3,null,null,null,null,null,6081]
[6081,"A","Regional","Metro","504 WA  Metro - Swan Districts","Metro","B Regional",1,null,4756,29.3,null,null,null,"Non Metro",70,null,3,3,2,3,0,2,3,null,null,null,null,null,6082]
[6082,"A","Other","Metro","504 WA  Metro - Swan Districts","Metro","D Pop > 2,000",1,null,3221,34.4,null,null,null,"Non Metro",63.333333333333329,null,3,3,1,3,0,2,3,null,null,null,null,null,6083]
[6083,"A","Other","Metro","504 WA  Metro - Swan Districts","Metro","D Pop > 2,000",1,null,3512,39.700000000000003,null,null,null,"Non Metro",63.333333333333329,null,3,3,1,3,0,2,3,null,null,null,null,null,6084]
[6084,"A","Other","Metro","504 WA  Metro - Swan Districts","Metro","D Pop > 2,000",1,null,8240,42.2,null,null,null,"Non Metro",70,null,3,3,1,3,1,2,3,null,null,null,null,null,6090]
[6090,"A","Metro","Metro","504 WA  Metro - Swan Districts","Metro","A Metro",1,null,6,0,null,null,null,"Non Metro",70,null,3,3,3,3,0,0,3,null,"Mining",null,null,null,6100]
[6100,"A","Metro","Metro","506 WA  Metro - Gosnells","Metro","A Metro",1,null,14480,4.5,null,null,null,"Metro",93.333333333333329,null,3,3,3,3,2,3,3,null,null,null,null,null,6101]
[6101,"A","Metro","Metro","506 WA  Metro - Gosnells","Metro","A Metro",1,null,16551,6.2,null,null,null,"Metro",93.333333333333329,null,3,3,3,3,2,3,3,null,null,null,null,null,6102]
[6102,"A","Metro","Metro","506 WA  Metro - Gosnells","Metro","A Metro",1,null,13688,8,null,null,null,"Metro",93.333333333333329,null,3,3,3,3,2,3,3,null,null,null,null,null,6103]
[6103,"A","Metro","Metro","506 WA  Metro - Gosnells","Metro","A Metro",1,null,10366,5.7,null,null,null,"Metro",93.333333333333329,null,3,3,3,3,2,3,3,null,null,null,null,null,6104]
[6104,"A","Metro","Metro","506 WA  Metro - Gosnells","Metro","A Metro",1,null,14321,7.6,null,null,null,"Metro",93.333333333333329,null,3,3,3,3,2,3,3,null,null,null,null,null,6105]
[6105,"A","Metro","Metro","506 WA  Metro - Gosnells","Metro","A Metro",1,null,14997,7.9,null,null,null,"Metro",93.333333333333329,null,3,3,3,3,2,3,3,null,null,null,null,null,6106]
[6106,"A","Metro","Metro","506 WA  Metro - Gosnells","Metro","A Metro",1,null,19,0,null,null,null,"Non Metro",70,null,3,3,3,3,0,0,3,null,null,null,null,null,6107]
[6107,"A","Metro","Metro","506 WA  Metro - Gosnells","Metro","A Metro",1,null,43605,11.4,null,null,null,"Metro",93.333333333333329,null,3,3,3,3,2,3,3,null,null,null,null,null,6108]
[6108,"A","Metro","Metro","506 WA  Metro - Gosnells","Metro","A Metro",1,null,23153,15.2,null,null,null,"Metro",93.333333333333329,null,3,3,3,3,2,3,3,null,null,null,null,null,6109]
[6109,"A","Metro","Metro","506 WA  Metro - Gosnells","Metro","A Metro",1,null,12122,17.100000000000001,null,null,null,"Metro",93.333333333333329,null,3,3,3,3,2,3,3,null,null,null,null,null,6110]
[6110,"A","Metro","Metro","506 WA  Metro - Gosnells","Metro","A Metro",1,null,40858,19.2,null,null,null,"Metro",93.333333333333329,null,3,3,3,3,2,3,3,null,null,null,null,null,6111]
[6111,"A","Metro","Metro","506 WA  Metro - Gosnells","Metro","A Metro",1,null,23068,24.8,null,null,null,"Metro",93.333333333333329,null,3,3,3,3,2,3,3,null,null,null,null,null,6112]
[6112,"A","Metro","Metro","506 WA  Metro - Gosnells","Metro","A Metro",1,null,56554,25.9,null,null,null,"Metro",90,null,3,3,3,3,2,2,3,null,null,null,null,null,6121]
[6121,"A","Metro","Metro","506 WA  Metro - Gosnells","Metro","A Metro",1,null,2963,29.2,null,null,null,"Metro",76.666666666666671,null,3,3,3,3,0,2,3,null,null,null,null,null,6122]
[6122,"A","Regional","Metro","506 WA  Metro - Gosnells","Metro","B Regional",1,null,17410,32.4,null,null,null,"Metro",83.333333333333329,null,3,3,2,3,2,2,3,null,null,null,null,null,6123]
[6123,"A","Other","Metro","506 WA  Metro - Gosnells","Metro","E Pop > 500",1,null,1551,39.299999999999997,null,null,null,"Non Metro",56.666666666666679,null,3,3,0,3,0,2,3,null,null,null,null,null,6124]
[6124,"A","Other","Metro","506 WA  Metro - Gosnells","Metro","E Pop > 500",1,null,1192,45.6,null,null,null,"Non Metro",56.666666666666679,null,3,3,0,3,0,2,3,null,null,null,null,null,6125]
[6125,"A","Other","Metro","506 WA  Metro - Gosnells","Metro","D Pop > 2,000",1,null,3135,47.3,null,null,null,"Non Metro",63.333333333333329,null,3,3,1,3,0,2,3,null,null,null,null,null,6126]
[6126,"A","Other","Metro","506 WA  Metro - Gosnells","Metro","E Pop > 500",1,null,626,0,null,null,null,"Regional",50,null,3,3,0,3,0,0,3,null,null,null,null,null,6147]
[6147,"A","Metro","Metro","506 WA  Metro - Gosnells","Metro","A Metro",1,null,15138,12,null,null,null,"Metro",93.333333333333329,null,3,3,3,3,2,3,3,null,null,null,null,null,6148]
[6148,"A","Metro","Metro","506 WA  Metro - Gosnells","Metro","A Metro",1,null,17814,9.8000000000000007,null,null,null,"Metro",93.333333333333329,null,3,3,3,3,2,3,3,null,null,null,null,null,6149]
[6149,"A","Metro","Metro","507 WA  Metro - Fremantle","Metro","A Metro",1,null,18476,12.8,null,null,null,"Metro",93.333333333333329,null,3,3,3,3,2,3,3,null,null,null,null,null,6150]
[6150,"A","Metro","Metro","507 WA  Metro - Fremantle","Metro","A Metro",1,null,13146,11.6,null,null,null,"Metro",93.333333333333329,null,3,3,3,3,2,3,3,null,null,null,null,null,6151]
[6151,"A","Metro","Metro","506 WA  Metro - Gosnells","Metro","A Metro",1,null,16576,3.6,null,null,null,"Metro",93.333333333333329,null,3,3,3,3,2,3,3,null,null,null,null,null,6152]
[6152,"A","Metro","Metro","506 WA  Metro - Gosnells","Metro","A Metro",1,null,25463,6.2,null,null,null,"Metro",93.333333333333329,null,3,3,3,3,2,3,3,null,null,null,null,null,6153]
[6153,"A","Metro","Metro","507 WA  Metro - Fremantle","Metro","A Metro",1,null,19865,8.1,null,null,null,"Metro",93.333333333333329,null,3,3,3,3,2,3,3,null,null,null,null,null,6154]
[6154,"A","Metro","Metro","507 WA  Metro - Fremantle","Metro","A Metro",1,null,10028,10.199999999999999,null,null,null,"Metro",93.333333333333329,null,3,3,3,3,2,3,3,null,null,null,null,null,6155]
[6155,"A","Metro","Metro","506 WA  Metro - Gosnells","Metro","A Metro",1,null,51244,15,null,null,null,"Metro",93.333333333333329,null,3,3,3,3,2,3,3,null,null,null,null,null,6156]
[6156,"A","Metro","Metro","507 WA  Metro - Fremantle","Metro","A Metro",1,null,16897,11,null,null,null,"Metro",93.333333333333329,null,3,3,3,3,2,3,3,null,null,null,null,null,6157]
[6157,"A","Metro","Metro","507 WA  Metro - Fremantle","Metro","A Metro",1,null,13525,11.9,null,null,null,"Metro",93.333333333333329,null,3,3,3,3,2,3,3,null,null,null,null,null,6158]
[6158,"A","Metro","Metro","507 WA  Metro - Fremantle","Metro","A Metro",1,null,7376,13.1,null,null,null,"Metro",86.666666666666671,null,3,3,3,3,1,3,3,null,null,null,null,null,6159]
[6159,"A","Metro","Metro","507 WA  Metro - Fremantle","Metro","A Metro",1,null,3340,13.1,null,null,null,"Metro",80,null,3,3,3,3,0,3,3,null,null,null,null,null,6160]
[6160,"A","Metro","Metro","507 WA  Metro - Fremantle","Metro","A Metro",1,null,8211,14.9,null,null,null,"Metro",86.666666666666671,null,3,3,3,3,1,3,3,null,null,null,null,null,6161]
[6161,"A","Other","Metro","507 WA  Metro - Fremantle","Metro","F Pop <= 500",1,null,334,0,null,null,"Refer to Distribution Partner","Refer to Distribution Partner",50,null,3,3,0,3,0,0,3,null,null,null,null,null,6162]
[6162,"A","Metro","Metro","507 WA  Metro - Fremantle","Metro","A Metro",1,null,11023,15.8,null,null,null,"Metro",93.333333333333329,null,3,3,3,3,2,3,3,null,null,null,null,null,6163]
[6163,"A","Metro","Metro","507 WA  Metro - Fremantle","Metro","A Metro",1,null,50359,17.2,null,null,null,"Metro",93.333333333333329,null,3,3,3,3,2,3,3,null,null,null,null,null,6164]
[6164,"A","Metro","Metro","507 WA  Metro - Fremantle","Metro","A Metro",1,null,57214,20.9,null,null,null,"Metro",93.333333333333329,null,3,3,3,3,2,3,3,null,null,null,null,null,6165]
[6165,"A","Metro","Metro","507 WA  Metro - Fremantle","Metro","A Metro",1,null,84,0,null,null,null,"Non Metro",70,null,3,3,3,3,0,0,3,null,null,null,null,null,6166]
[6166,"A","Metro","Metro","507 WA  Metro - Fremantle","Metro","A Metro",1,null,9509,20.5,null,null,null,"Metro",86.666666666666671,null,3,3,3,3,1,3,3,null,null,null,null,null,6167]
[6167,"A","Metro","Metro","507 WA  Metro - Fremantle","Metro","A Metro",1,null,26444,31.7,null,null,null,"Metro",90,null,3,3,3,3,2,2,3,null,null,null,null,null,6168]
[6168,"A","Metro","Metro","507 WA  Metro - Fremantle","Metro","A Metro",1,null,24027,38.799999999999997,null,null,null,"Metro",90,null,3,3,3,3,2,2,3,null,null,null,null,null,6169]
[6169,"A","Metro","Metro","507 WA  Metro - Fremantle","Metro","A Metro",1,null,34667,41.9,null,null,null,"Metro",90,null,3,3,3,3,2,2,3,null,null,null,null,null,6170]
[6170,"A","Metro","Metro","507 WA  Metro - Fremantle","Metro","A Metro",1,null,12393,34.9,null,null,null,"Metro",90,null,3,3,3,3,2,2,3,null,null,null,null,null,6171]
[6171,"A","Metro","Metro","507 WA  Metro - Fremantle","Metro","A Metro",1,null,31653,43,null,null,null,"Metro",90,null,3,3,3,3,2,2,3,null,null,null,null,null,6172]
[6172,"A","Metro","Metro","507 WA  Metro - Fremantle","Metro","A Metro",1,null,13777,46.2,null,null,null,"Metro",90,null,3,3,3,3,2,2,3,null,null,null,null,null,6173]
[6173,"A","Metro","Metro","507 WA  Metro - Fremantle","Metro","A Metro",1,null,12073,51.2,null,null,null,{"$f":"IF(ISBLANK(N2268),IF(AND(H2268<>\"\",IF(I2268=\"High Density\",\"High Density\",IF(AND(P2268<=45,P2268>0),\"Refer to Distribution Partner\",IF(AND(P2268<=55,P2268>45),\"Regional\",IF(AND(P2268>55,P2268<=70),\"Non Metro\",IF(F2268=\"Nonmetro\",\"Non Metro\",IF(P2268>70,\"Metro\",\"\"))))))=\"Refer to Distribution Partner\"),\"Regional\",IF(I2268=\"High Density\",\"High Density\",IF(AND(P2268<=45,P2268>0),\"Refer to Distribution Partner\",IF(AND(P2268<=55,P2268>45),\"Regional\",IF(AND(P2268>55,P2268<=70),\"Non Metro\",IF(F2268=\"Nonmetro\",\"Non Metro\",IF(P2268>70,\"Metro\",\"\"))))))),N2268)","v":"Metro"},{"$f":"(R2268/$AB$3*$AA$3+S2268/$AB$4*$AA$4+T2268/$AB$5*$AA$5+U2268/$AB$6*$AA$6+V2268/$AB$7*$AA$7+W2268/$AB$8*$AA$8+X2268/$AB$9*$AA$9)*100","v":86.666666666666671},null,{"$f":"IF(ISNUMBER(SEARCH(\"Metro\",E2268)),3,IF(ISNUMBER(SEARCH(\"Rural\",E2268)),2,1))","v":3},{"$f":"IF(ISNUMBER(FIND(\"Metro\",F2268)),3,IF(ISNUMBER(FIND(\"Nonmetro\",F2268)),2,3))","v":3},{"$f":"IF(G2268=\"A Metro\",3,IF(G2268=\"B Regional\",2,IF(G2268=\"C Pop > 7,000\",1,IF(G2268=\"D Pop > 2,000\",1,0))))","v":3},{"$f":"IF(H2268=1,3,IF(H2268=2,2,IF(H2268=3,1,0)))","v":3},{"$f":"IF(J2268>=100000,3,IF(AND(J2268>=10000,J2268<100000),2,IF(AND(J2268>=5000,J2268<10000),1,0)))","v":2},{"$f":"IF(AND(K2268>=0.1,K2268<25),3,IF(AND(K2268>=25,K2268<50),2,IF(AND(K2268>=50,K2268<150),1,0)))","v":1},{"$f":"IF(L2268=\"\",3,0)","v":3},null,null,null,null,null,6174]
[6174,"A","Metro","Metro","507 WA  Metro - Fremantle","Metro","A Metro",1,null,3785,53.4,null,null,null,"Metro",73.333333333333343,null,3,3,3,3,0,1,3,null,null,null,null,null,6175]
[6175,"A","Metro","Metro","507 WA  Metro - Fremantle","Metro","A Metro",1,null,3752,55.6,null,null,null,"Metro",73.333333333333343,null,3,3,3,3,0,1,3,null,null,null,null,null,6176]
[6176,"A","Metro","Metro","507 WA  Metro - Fremantle","Metro","A Metro",1,null,1371,54,null,null,null,"Metro",73.333333333333343,null,3,3,3,3,0,1,3,null,null,null,null,null,6180]
[6180,"A","Metro","Metro","502 WA  Metro - Mandurah","Metro","A Metro",1,null,5408,58.6,null,null,null,"Metro",80,null,3,3,3,3,1,1,3,null,null,null,null,null,6181]
[6181,"A","Metro","Metro","502 WA  Metro - Mandurah","Metro","A Metro",1,null,485,0,null,null,null,"Non Metro",70,null,3,3,3,3,0,0,3,null,null,null,null,null,6207]
[6207,"A","Other","Metro","502 WA  Metro - Mandurah","Metro","E Pop > 500",1,null,1047,63.1,null,null,null,"Regional",53.333333333333336,null,3,3,0,3,0,1,3,null,null,null,null,null,6208]
[6208,"A","Regional","Metro","502 WA  Metro - Mandurah","Metro","B Regional",1,null,11838,71.900000000000006,null,null,null,"Metro",80,null,3,3,2,3,2,1,3,null,null,null,null,null,6209]
[6209,"A","Metro","Metro","502 WA  Metro - Mandurah","Metro","A Metro",1,null,1954,66.599999999999994,null,null,null,"Metro",73.333333333333343,null,3,3,3,3,0,1,3,null,null,null,null,null,6210]
[6210,"A","Metro","Metro","502 WA  Metro - Mandurah","Metro","A Metro",1,null,68316,66.900000000000006,null,null,null,"Metro",86.666666666666671,null,3,3,3,3,2,1,3,null,null,null,null,null,6211]
[6211,"A","Metro","Metro","502 WA  Metro - Mandurah","Metro","A Metro",1,null,7088,79,null,null,null,"Metro",80,null,3,3,3,3,1,1,3,null,null,null,null,null,6213]
[6213,"A","Other","Metro","509 WA  Rural - Wheat Belt","Metro","E Pop > 500",1,null,717,86.9,null,null,null,"Regional",51.666666666666671,null,2,3,0,3,0,1,3,null,null,null,null,null,6214]
[6214,"A","Other","Metro","502 WA  Metro - Mandurah","Metro","F Pop <= 500",1,null,613,0,null,null,null,"Regional",50,null,3,3,0,3,0,0,3,null,null,null,null,null,6215]
[6215,"A","Other","Regional","501 WA  Rural - Bunbury","Nonmetro","D Pop > 2,000",null,null,4148,100.5,"Mining",null,null,"Refer to Distribution Partner",26.666666666666668,null,2,2,1,0,0,1,0,null,null,null,null,null,6218]
[6218,"A","Other","Regional","501 WA  Rural - Bunbury","Nonmetro","F Pop <= 500",null,null,395,0,null,null,null,"Refer to Distribution Partner",21.666666666666668,null,2,2,0,0,0,0,3,null,null,null,null,null,6220]
[6220,"A","Other","Regional","501 WA  Rural - Bunbury","Nonmetro","D Pop > 2,000",null,null,4675,125.6,null,null,null,"Refer to Distribution Partner",31.666666666666664,null,2,2,1,0,0,1,3,null,null,null,null,null,6221]
[6221,"A","Other","Regional","501 WA  Rural - Bunbury","Nonmetro","F Pop <= 500",null,null,425,0,null,null,null,"Refer to Distribution Partner",21.666666666666668,null,2,2,0,0,0,0,3,null,null,null,null,null,6223]
[6223,"A","Other","Regional","501 WA  Rural - Bunbury","Nonmetro","F Pop <= 500",null,null,217,0,null,null,null,"Refer to Distribution Partner",21.666666666666668,null,2,2,0,0,0,0,3,null,null,null,null,null,6224]
[6224,"A","Other","Regional","501 WA  Rural - Bunbury","Nonmetro","E Pop > 500",null,null,1151,144.80000000000001,null,null,null,"Refer to Distribution Partner",25,null,2,2,0,0,0,1,3,null,null,null,null,null,6225]
[6225,"A","Other","Regional","501 WA  Rural - Bunbury","Nonmetro","C Pop > 7,000",3,null,9105,158.5,"Mining",null,null,"Regional",36.666666666666664,null,2,2,1,1,1,0,0,null,null,null,null,null,6226]
[6226,"A","Other","Regional","501 WA  Rural - Bunbury","Nonmetro","E Pop > 500",null,null,845,149.1,null,null,null,"Refer to Distribution Partner",25,null,2,2,0,0,0,1,3,null,null,null,null,null,6227]
[6227,"A","Other","Regional","501 WA  Rural - Bunbury","Nonmetro","E Pop > 500",null,null,800,151.19999999999999,null,null,null,"Refer to Distribution Partner",21.666666666666668,null,2,2,0,0,0,0,3,null,null,null,null,null,6228]
[6228,"A","Other","Regional","501 WA  Rural - Bunbury","Nonmetro","F Pop <= 500",null,null,176,0,"Mining",null,null,"Refer to Distribution Partner",16.666666666666664,null,2,2,0,0,0,0,0,null,null,null,null,null,6229]
[6229,"A","Regional","Regional","501 WA  Rural - Bunbury","Nonmetro","B Regional",1,null,193,0,null,null,null,"Regional",55.000000000000007,null,2,2,2,3,0,0,3,null,null,null,null,null,6230]
[6230,"A","Regional","Regional","501 WA  Rural - Bunbury","Nonmetro","B Regional",1,null,43134,158.19999999999999,null,null,null,"Non Metro",68.333333333333329,null,2,2,2,3,2,0,3,null,null,null,null,null,6232]
[6232,"A","Regional","Regional","501 WA  Rural - Bunbury","Nonmetro","B Regional",1,null,10886,151.80000000000001,"Mining",null,null,"Non Metro",63.333333333333329,null,2,2,2,3,2,0,0,null,null,null,null,null,6233]
[6233,"A","Regional","Regional","501 WA  Rural - Bunbury","Nonmetro","B Regional",1,null,18844,146.6,"Mining",null,null,"Non Metro",66.666666666666657,null,2,2,2,3,2,1,0,null,null,null,null,null,6236]
[6236,"A","Other","Regional","501 WA  Rural - Bunbury","Nonmetro","E Pop > 500",null,null,2052,162.6,null,null,null,"Refer to Distribution Partner",21.666666666666668,null,2,2,0,0,0,0,3,null,null,null,null,null,6237]
[6237,"A","Other","Regional","501 WA  Rural - Bunbury","Nonmetro","D Pop > 2,000",null,null,2482,169.6,null,null,null,"Refer to Distribution Partner",28.333333333333332,null,2,2,1,0,0,0,3,null,null,null,null,null,6239]
[6239,"A","Other","Regional","501 WA  Rural - Bunbury","Nonmetro","D Pop > 2,000",null,null,4408,180.2,null,null,null,"Refer to Distribution Partner",28.333333333333332,null,2,2,1,0,0,0,3,null,null,null,null,null,6240]
[6240,"A","Other","Regional","501 WA  Rural - Bunbury","Nonmetro","F Pop <= 500",null,null,116,0,null,null,null,"Refer to Distribution Partner",21.666666666666668,null,2,2,0,0,0,0,3,null,null,null,null,null,6243]
[6243,"A","Other","Regional","501 WA  Rural - Bunbury","Nonmetro","F Pop <= 500",null,null,56,0,null,null,null,"Refer to Distribution Partner",21.666666666666668,null,2,2,0,0,0,0,3,null,null,null,null,null,6244]
[6244,"A","Other","Regional","501 WA  Rural - Bunbury","Nonmetro","E Pop > 500",null,null,1457,214.8,null,null,null,"Refer to Distribution Partner",21.666666666666668,null,2,2,0,0,0,0,3,null,null,null,null,null,6251]
[6251,"A","Other","Regional","501 WA  Rural - Bunbury","Nonmetro","F Pop <= 500",null,null,385,0,null,null,null,"Refer to Distribution Partner",21.666666666666668,null,2,2,0,0,0,0,3,null,null,null,null,null,6252]
[6252,"A","Other","Regional","501 WA  Rural - Bunbury","Nonmetro","F Pop <= 500",null,null,152,0,"Mining",null,null,"Refer to Distribution Partner",16.666666666666664,null,2,2,0,0,0,0,0,null,null,null,null,null,6253]
[6253,"A","Other","Regional","501 WA  Rural - Bunbury","Nonmetro","E Pop > 500",null,null,618,204.5,null,null,null,"Refer to Distribution Partner",21.666666666666668,null,2,2,0,0,0,0,3,null,null,null,null,null,6254]
[6254,"A","Other","Regional","501 WA  Rural - Bunbury","Nonmetro","E Pop > 500",null,null,502,0,"Mining",null,null,"Refer to Distribution Partner",16.666666666666664,null,2,2,0,0,0,0,0,null,null,null,null,null,6255]
[6255,"A","Other","Regional","501 WA  Rural - Bunbury","Nonmetro","D Pop > 2,000",null,null,3916,224.5,"Mining",null,null,"Refer to Distribution Partner",23.333333333333332,null,2,2,1,0,0,0,0,null,null,null,null,null,6256]
[6256,"A","Other","Regional","501 WA  Rural - Bunbury","Nonmetro","F Pop <= 500",null,null,381,0,"Mining",null,null,"Refer to Distribution Partner",16.666666666666664,null,2,2,0,0,0,0,0,null,null,null,null,null,6258]
[6258,"A","Other","Regional","501 WA  Rural - Bunbury","Nonmetro","D Pop > 2,000",null,null,6568,259.5,null,null,null,"Refer to Distribution Partner",35,null,2,2,1,0,1,0,3,null,null,null,null,null,6260]
[6260,"A","Other","Regional","501 WA  Rural - Bunbury","Nonmetro","E Pop > 500",null,null,1431,277.89999999999998,null,null,null,"Refer to Distribution Partner",21.666666666666668,null,2,2,0,0,0,0,3,null,null,null,null,null,6262]
[6262,"A","Other","Regional","501 WA  Rural - Bunbury","Nonmetro","E Pop > 500",null,null,744,299.3,null,null,null,"Refer to Distribution Partner",21.666666666666668,null,2,2,0,0,0,0,3,null,null,null,null,null,6271]
[6271,"A","Other","Regional","501 WA  Rural - Bunbury","Nonmetro","D Pop > 2,000",null,null,3314,180.2,null,null,null,"Refer to Distribution Partner",28.333333333333332,null,2,2,1,0,0,0,3,null,null,null,null,null,6275]
[6275,"A","Other","Regional","501 WA  Rural - Bunbury","Nonmetro","E Pop > 500",null,null,1347,228.6,null,null,null,"Refer to Distribution Partner",21.666666666666668,null,2,2,0,0,0,0,3,null,null,null,null,null,6280]
[6280,"A","Regional","Regional","501 WA  Rural - Bunbury","Nonmetro","B Regional",1,null,28166,196.3,null,null,null,"Non Metro",68.333333333333329,null,2,2,2,3,2,0,3,null,null,null,null,null,6281]
[6281,"A","Regional","Regional","501 WA  Rural - Bunbury","Nonmetro","B Regional",1,null,7203,198.2,"Mining",null,null,"Non Metro",56.666666666666664,null,2,2,2,3,1,0,0,null,null,null,null,null,6282]
[6282,"A","Regional","Regional","501 WA  Rural - Bunbury","Nonmetro","B Regional",1,null,1330,205,null,null,null,"Regional",55.000000000000007,null,2,2,2,3,0,0,3,null,null,null,null,null,6284]
[6284,"A","Regional","Regional","501 WA  Rural - Bunbury","Nonmetro","B Regional",1,null,2249,223.4,"Mining",null,null,"Regional",50,null,2,2,2,3,0,0,0,null,null,null,null,null,6285]
[6285,"A","Regional","Regional","501 WA  Rural - Bunbury","Nonmetro","B Regional",1,null,9177,235.6,null,null,null,"Non Metro",61.666666666666671,null,2,2,2,3,1,0,3,null,null,null,null,null,6286]
[6286,"A","Other","Regional","501 WA  Rural - Bunbury","Nonmetro","E Pop > 500",null,null,603,0,null,null,null,"Refer to Distribution Partner",21.666666666666668,null,2,2,0,0,0,0,3,null,null,null,null,null,6288]
[6288,"A","Other","Regional","501 WA  Rural - Bunbury","Nonmetro","F Pop <= 500",null,null,555,0,null,null,null,"Refer to Distribution Partner",21.666666666666668,null,2,2,0,0,0,0,3,null,null,null,null,null,6290]
[6290,"A","Regional","Regional","501 WA  Rural - Bunbury","Nonmetro","B Regional",2,null,1680,269.7,null,null,null,"Regional",48.333333333333336,null,2,2,2,2,0,0,3,null,null,null,null,null,6302]
[6302,"A","Other","Regional","509 WA  Rural - Wheat Belt","Nonmetro","D Pop > 2,000",null,null,3623,87.1,null,null,null,"Refer to Distribution Partner",31.666666666666664,null,2,2,1,0,0,1,3,null,null,null,null,null,6304]
[6304,"A","Other","Regional","509 WA  Rural - Wheat Belt","Nonmetro","E Pop > 500",null,null,1724,103.8,null,null,null,"Refer to Distribution Partner",25,null,2,2,0,0,0,1,3,null,null,null,null,null,6306]
[6306,"A","Other","Regional","509 WA  Rural - Wheat Belt","Nonmetro","E Pop > 500",null,null,1025,117.9,null,null,null,"Refer to Distribution Partner",25,null,2,2,0,0,0,1,3,null,null,null,null,null,6308]
[6308,"A","Other","Regional","509 WA  Rural - Wheat Belt","Nonmetro","E Pop > 500",null,null,1593,123.3,null,null,null,"Refer to Distribution Partner",25,null,2,2,0,0,0,1,3,null,null,null,null,null,6309]
[6309,"A","Other","Regional","509 WA  Rural - Wheat Belt","Nonmetro","F Pop <= 500",null,null,275,0,null,null,null,"Refer to Distribution Partner",21.666666666666668,null,2,2,0,0,0,0,3,null,null,null,null,null,6311]
[6311,"A","Other","Regional","509 WA  Rural - Wheat Belt","Nonmetro","E Pop > 500",null,null,589,157.1,null,null,null,"Refer to Distribution Partner",21.666666666666668,null,2,2,0,0,0,0,3,null,null,null,null,null,6312]
[6312,"A","Other","Regional","509 WA  Rural - Wheat Belt","Nonmetro","D Pop > 2,000",null,null,4884,165.3,null,null,null,"Refer to Distribution Partner",28.333333333333332,null,2,2,1,0,0,0,3,null,null,null,null,null,6313]
[6313,"A","Other","Regional","509 WA  Rural - Wheat Belt","Nonmetro","F Pop <= 500",null,null,294,0,null,null,null,"Refer to Distribution Partner",21.666666666666668,null,2,2,0,0,0,0,3,null,null,null,null,null,6315]
[6315,"A","Other","Regional","509 WA  Rural - Wheat Belt","Nonmetro","E Pop > 500",null,null,1988,204.9,null,null,null,"Refer to Distribution Partner",21.666666666666668,null,2,2,0,0,0,0,3,null,null,null,null,null,6316]
[6316,"A","Other","Regional","509 WA  Rural - Wheat Belt","Nonmetro","F Pop <= 500",null,null,344,0,null,null,null,"Refer to Distribution Partner",21.666666666666668,null,2,2,0,0,0,0,3,null,null,null,null,null,6317]
[6317,"A","Other","Regional","509 WA  Rural - Wheat Belt","Nonmetro","D Pop > 2,000",null,null,4183,249.8,null,null,null,"Refer to Distribution Partner",28.333333333333332,null,2,2,1,0,0,0,3,null,null,null,null,null,6318]
[6318,"A","Other","Regional","509 WA  Rural - Wheat Belt","Nonmetro","F Pop <= 500",null,null,525,0,null,null,null,"Refer to Distribution Partner",21.666666666666668,null,2,2,0,0,0,0,3,null,null,null,null,null,6320]
[6320,"A","Other","Regional","509 WA  Rural - Wheat Belt","Nonmetro","E Pop > 500",null,null,618,0,null,null,null,{"$f":"IF(ISBLANK(N2332),IF(AND(H2332<>\"\",IF(I2332=\"High Density\",\"High Density\",IF(AND(P2332<=45,P2332>0),\"Refer to Distribution Partner\",IF(AND(P2332<=55,P2332>45),\"Regional\",IF(AND(P2332>55,P2332<=70),\"Non Metro\",IF(F2332=\"Nonmetro\",\"Non Metro\",IF(P2332>70,\"Metro\",\"\"))))))=\"Refer to Distribution Partner\"),\"Regional\",IF(I2332=\"High Density\",\"High Density\",IF(AND(P2332<=45,P2332>0),\"Refer to Distribution Partner\",IF(AND(P2332<=55,P2332>45),\"Regional\",IF(AND(P2332>55,P2332<=70),\"Non Metro\",IF(F2332=\"Nonmetro\",\"Non Metro\",IF(P2332>70,\"Metro\",\"\"))))))),N2332)","v":"Refer to Distribution Partner"},{"$f":"(R2332/$AB$3*$AA$3+S2332/$AB$4*$AA$4+T2332/$AB$5*$AA$5+U2332/$AB$6*$AA$6+V2332/$AB$7*$AA$7+W2332/$AB$8*$AA$8+X2332/$AB$9*$AA$9)*100","v":21.666666666666668},null,{"$f":"IF(ISNUMBER(SEARCH(\"Metro\",E2332)),3,IF(ISNUMBER(SEARCH(\"Rural\",E2332)),2,1))","v":2},{"$f":"IF(ISNUMBER(FIND(\"Metro\",F2332)),3,IF(ISNUMBER(FIND(\"Nonmetro\",F2332)),2,3))","v":2},{"$f":"IF(G2332=\"A Metro\",3,IF(G2332=\"B Regional\",2,IF(G2332=\"C Pop > 7,000\",1,IF(G2332=\"D Pop > 2,000\",1,0))))","v":0},{"$f":"IF(H2332=1,3,IF(H2332=2,2,IF(H2332=3,1,0)))","v":0},{"$f":"IF(J2332>=100000,3,IF(AND(J2332>=10000,J2332<100000),2,IF(AND(J2332>=5000,J2332<10000),1,0)))","v":0},{"$f":"IF(AND(K2332>=0.1,K2332<25),3,IF(AND(K2332>=25,K2332<50),2,IF(AND(K2332>=50,K2332<150),1,0)))","v":0},{"$f":"IF(L2332=\"\",3,0)","v":3},null,null,null,null,null,6321]
[6321,"A","Other","Regional","509 WA  Rural - Wheat Belt","Nonmetro","F Pop <= 500",null,null,496,0,null,null,null,"Refer to Distribution Partner",21.666666666666668,null,2,2,0,0,0,0,3,null,null,null,null,null,6322]
[6322,"A","Other","Regional","509 WA  Rural - Wheat Belt","Nonmetro","F Pop <= 500",null,null,224,0,null,null,null,"Refer to Distribution Partner",21.666666666666668,null,2,2,0,0,0,0,3,null,null,null,null,null,6323]
[6323,"A","Other","Regional","509 WA  Rural - Wheat Belt","Nonmetro","E Pop > 500",null,null,989,327.10000000000002,null,null,null,"Refer to Distribution Partner",21.666666666666668,null,2,2,0,0,0,0,3,null,null,null,null,null,6324]
[6324,"A","Other","Regional","509 WA  Rural - Wheat Belt","Nonmetro","D Pop > 2,000",null,null,3519,341.6,null,null,null,"Refer to Distribution Partner",28.333333333333332,null,2,2,1,0,0,0,3,null,null,null,null,null,6326]
[6326,"A","Other","Regional","509 WA  Rural - Wheat Belt","Nonmetro","E Pop > 500",null,null,492,0,null,null,null,"Refer to Distribution Partner",21.666666666666668,null,2,2,0,0,0,0,3,null,null,null,null,null,6327]
[6327,"A","Other","Regional","509 WA  Rural - Wheat Belt","Nonmetro","F Pop <= 500",null,null,273,0,null,null,null,"Refer to Distribution Partner",21.666666666666668,null,2,2,0,0,0,0,3,null,null,null,null,null,6328]
[6328,"A","Other","Regional","509 WA  Rural - Wheat Belt","Nonmetro","F Pop <= 500",null,null,427,0,null,null,null,"Refer to Distribution Partner",21.666666666666668,null,2,2,0,0,0,0,3,null,null,null,null,null,6330]
[6330,"A","Regional","Regional","509 WA  Rural - Wheat Belt","Nonmetro","B Regional",1,null,35869,388.9,null,null,null,"Non Metro",68.333333333333329,null,2,2,2,3,2,0,3,null,null,null,null,null,6333]
[6333,"A","Other","Regional","509 WA  Rural - Wheat Belt","Nonmetro","D Pop > 2,000",3,null,5845,361.8,null,null,null,"Regional",41.666666666666664,null,2,2,1,1,1,0,3,null,null,null,null,null,6335]
[6335,"A","Other","Regional","509 WA  Rural - Wheat Belt","Nonmetro","E Pop > 500",null,null,775,298.2,null,null,null,"Refer to Distribution Partner",21.666666666666668,null,2,2,0,0,0,0,3,null,null,null,null,null,6336]
[6336,"A","Other","Regional","509 WA  Rural - Wheat Belt","Nonmetro","F Pop <= 500",null,null,330,0,null,null,null,"Refer to Distribution Partner",21.666666666666668,null,2,2,0,0,0,0,3,null,null,null,null,null,6337]
[6337,"A","Other","Regional","509 WA  Rural - Wheat Belt","Nonmetro","F Pop <= 500",null,null,546,0,null,null,null,"Refer to Distribution Partner",21.666666666666668,null,2,2,0,0,0,0,3,null,null,null,null,null,6338]
[6338,"A","Other","Regional","509 WA  Rural - Wheat Belt","Nonmetro","E Pop > 500",null,null,676,422.5,null,null,null,"Refer to Distribution Partner",21.666666666666668,null,2,2,0,0,0,0,3,null,null,null,null,null,6341]
[6341,"A","Other","Regional","509 WA  Rural - Wheat Belt","Nonmetro","F Pop <= 500",null,null,296,0,null,null,null,"Refer to Distribution Partner",21.666666666666668,null,2,2,0,0,0,0,3,null,null,null,null,null,6343]
[6343,"A","Other","Regional","509 WA  Rural - Wheat Belt","Nonmetro","F Pop <= 500",null,null,264,0,null,null,null,"Refer to Distribution Partner",21.666666666666668,null,2,2,0,0,0,0,3,null,null,null,null,null,6346]
[6346,"A","Other","Regional","508 WA  Rural - Outback","Nonmetro","E Pop > 500",null,null,738,431.4,"Mining",null,null,"Refer to Distribution Partner",16.666666666666664,null,2,2,0,0,0,0,0,null,null,null,null,null,6348]
[6348,"A","Other","Regional","508 WA  Rural - Outback","Nonmetro","E Pop > 500",null,null,871,455.3,"Mining",null,null,"Refer to Distribution Partner",16.666666666666664,null,2,2,0,0,0,0,0,null,null,null,null,null,6350]
[6350,"A","Other","Regional","509 WA  Rural - Wheat Belt","Nonmetro","F Pop <= 500",null,null,302,0,null,null,null,"Refer to Distribution Partner",21.666666666666668,null,2,2,0,0,0,0,3,null,null,null,null,null,6351]
[6351,"A","Other","Regional","509 WA  Rural - Wheat Belt","Nonmetro","F Pop <= 500",null,null,85,0,null,null,null,"Refer to Distribution Partner",21.666666666666668,null,2,2,0,0,0,0,3,null,null,null,null,null,6352]
[6352,"A","Other","Regional","509 WA  Rural - Wheat Belt","Nonmetro","F Pop <= 500",null,null,187,0,null,null,null,"Refer to Distribution Partner",21.666666666666668,null,2,2,0,0,0,0,3,null,null,null,null,null,6353]
[6353,"A","Other","Regional","509 WA  Rural - Wheat Belt","Nonmetro","E Pop > 500",null,null,785,0,null,null,null,"Refer to Distribution Partner",21.666666666666668,null,2,2,0,0,0,0,3,null,null,null,null,null,6355]
[6355,"A","Other","Regional","509 WA  Rural - Wheat Belt","Nonmetro","E Pop > 500",null,null,438,0,null,null,null,"Refer to Distribution Partner",21.666666666666668,null,2,2,0,0,0,0,3,null,null,null,null,null,6356]
[6356,"A","Other","Regional","509 WA  Rural - Wheat Belt","Nonmetro","F Pop <= 500",null,null,125,0,null,null,null,"Refer to Distribution Partner",21.666666666666668,null,2,2,0,0,0,0,3,null,null,null,null,null,6357]
[6357,"A","Other","Regional","509 WA  Rural - Wheat Belt","Nonmetro","F Pop <= 500",null,null,76,0,null,null,null,"Refer to Distribution Partner",21.666666666666668,null,2,2,0,0,0,0,3,null,null,null,null,null,6358]
[6358,"A","Other","Regional","509 WA  Rural - Wheat Belt","Nonmetro","F Pop <= 500",null,null,93,0,null,null,null,"Refer to Distribution Partner",21.666666666666668,null,2,2,0,0,0,0,3,null,null,null,null,null,6359]
[6359,"A","Other","Regional","509 WA  Rural - Wheat Belt","Nonmetro","E Pop > 500",null,null,437,0,"Mining",null,null,"Refer to Distribution Partner",16.666666666666664,null,2,2,0,0,0,0,0,null,null,null,null,null,6361]
[6361,"A","Other","Regional","509 WA  Rural - Wheat Belt","Nonmetro","F Pop <= 500",null,null,109,0,null,null,null,"Refer to Distribution Partner",21.666666666666668,null,2,2,0,0,0,0,3,null,null,null,null,null,6363]
[6363,"A","Other","Regional","509 WA  Rural - Wheat Belt","Nonmetro","F Pop <= 500",null,null,105,0,null,null,null,"Refer to Distribution Partner",21.666666666666668,null,2,2,0,0,0,0,3,null,null,null,null,null,6365]
[6365,"A","Other","Regional","509 WA  Rural - Wheat Belt","Nonmetro","E Pop > 500",null,null,531,0,null,null,null,"Refer to Distribution Partner",21.666666666666668,null,2,2,0,0,0,0,3,null,null,null,null,null,6367]
[6367,"A","Other","Regional","509 WA  Rural - Wheat Belt","Nonmetro","F Pop <= 500",null,null,354,0,null,null,null,"Refer to Distribution Partner",21.666666666666668,null,2,2,0,0,0,0,3,null,null,null,null,null,6368]
[6368,"A","Other","Regional","509 WA  Rural - Wheat Belt","Nonmetro","F Pop <= 500",null,null,73,0,null,null,null,"Refer to Distribution Partner",21.666666666666668,null,2,2,0,0,0,0,3,null,null,null,null,null,6369]
[6369,"A","Other","Regional","509 WA  Rural - Wheat Belt","Nonmetro","E Pop > 500",null,null,671,0,null,null,null,"Refer to Distribution Partner",21.666666666666668,null,2,2,0,0,0,0,3,null,null,null,null,null,6370]
[6370,"A","Other","Regional","509 WA  Rural - Wheat Belt","Nonmetro","E Pop > 500",null,null,458,0,null,null,null,"Refer to Distribution Partner",21.666666666666668,null,2,2,0,0,0,0,3,null,null,null,null,null,6372]
[6372,"A","Other","Regional","509 WA  Rural - Wheat Belt","Nonmetro","F Pop <= 500",null,null,115,0,null,null,null,"Refer to Distribution Partner",21.666666666666668,null,2,2,0,0,0,0,3,null,null,null,null,null,6373]
[6373,"A","Other","Regional","509 WA  Rural - Wheat Belt","Nonmetro","F Pop <= 500",null,null,94,0,null,null,null,"Refer to Distribution Partner",21.666666666666668,null,2,2,0,0,0,0,3,null,null,null,null,null,6375]
[6375,"A","Other","Regional","509 WA  Rural - Wheat Belt","Nonmetro","E Pop > 500",null,null,1001,194.9,null,null,null,"Refer to Distribution Partner",21.666666666666668,null,2,2,0,0,0,0,3,null,null,null,null,null,6383]
[6383,"A","Other","Regional","509 WA  Rural - Wheat Belt","Nonmetro","E Pop > 500",null,null,981,145.6,null,null,null,"Refer to Distribution Partner",25,null,2,2,0,0,0,1,3,null,null,null,null,null,6384]
[6384,"A","Other","Regional","509 WA  Rural - Wheat Belt","Nonmetro","F Pop <= 500",null,null,40,0,null,null,null,"Refer to Distribution Partner",21.666666666666668,null,2,2,0,0,0,0,3,null,null,null,null,null,6385]
[6385,"A","Other","Regional","509 WA  Rural - Wheat Belt","Nonmetro","F Pop <= 500",null,null,19,0,null,null,null,"Refer to Distribution Partner",21.666666666666668,null,2,2,0,0,0,0,3,null,null,null,null,null,6386]
[6386,"A","Other","Regional","509 WA  Rural - Wheat Belt","Nonmetro","F Pop <= 500",null,null,96,0,null,null,null,"Refer to Distribution Partner",21.666666666666668,null,2,2,0,0,0,0,3,null,null,null,null,null,6390]
[6390,"A","Other","Regional","509 WA  Rural - Wheat Belt","Nonmetro","D Pop > 2,000",null,null,1811,111.4,"Mining",null,null,"Refer to Distribution Partner",26.666666666666668,null,2,2,1,0,0,1,0,null,null,null,null,null,6391]
[6391,"A","Other","Regional","509 WA  Rural - Wheat Belt","Nonmetro","E Pop > 500",null,null,1001,0,null,null,null,"Refer to Distribution Partner",21.666666666666668,null,2,2,0,0,0,0,3,null,null,null,null,null,6392]
[6392,"A","Other","Regional","509 WA  Rural - Wheat Belt","Nonmetro","F Pop <= 500",null,null,463,0,null,null,null,"Refer to Distribution Partner",21.666666666666668,null,2,2,0,0,0,0,3,null,null,null,null,null,6393]
[6393,"A","Other","Regional","509 WA  Rural - Wheat Belt","Nonmetro","F Pop <= 500",null,null,120,0,null,null,null,"Refer to Distribution Partner",21.666666666666668,null,2,2,0,0,0,0,3,null,null,null,null,null,6394]
[6394,"A","Other","Regional","509 WA  Rural - Wheat Belt","Nonmetro","F Pop <= 500",null,null,454,0,null,null,null,"Refer to Distribution Partner",21.666666666666668,null,2,2,0,0,0,0,3,null,null,null,null,null,6395]
[6395,"A","Other","Regional","509 WA  Rural - Wheat Belt","Nonmetro","F Pop <= 500",null,null,1649,242.7,null,null,null,"Refer to Distribution Partner",21.666666666666668,null,2,2,0,0,0,0,3,null,null,null,null,null,6396]
[6396,"A","Other","Regional","509 WA  Rural - Wheat Belt","Nonmetro","F Pop <= 500",null,null,367,0,null,null,null,"Refer to Distribution Partner",21.666666666666668,null,2,2,0,0,0,0,3,null,null,null,null,null,6397]
[6397,"A","Other","Regional","509 WA  Rural - Wheat Belt","Nonmetro","F Pop <= 500",null,null,98,0,null,null,null,"Refer to Distribution Partner",21.666666666666668,null,2,2,0,0,0,0,3,null,null,null,null,null,6398]
[6398,"A","Other","Regional","501 WA  Rural - Bunbury","Nonmetro","E Pop > 500",null,null,546,345.2,null,null,null,"Refer to Distribution Partner",21.666666666666668,null,2,2,0,0,0,0,3,null,null,null,null,null,6401]
[6401,"A","Other","Regional","509 WA  Rural - Wheat Belt","Nonmetro","C Pop > 7,000",3,null,8176,83,null,null,null,"Regional",44.999999999999993,null,2,2,1,1,1,1,3,null,null,null,null,null,6403]
[6403,"A","Other","Regional","509 WA  Rural - Wheat Belt","Nonmetro","F Pop <= 500",null,null,176,0,null,null,null,"Refer to Distribution Partner",21.666666666666668,null,2,2,0,0,0,0,3,null,null,null,null,null,6405]
[6405,"A","Other","Regional","509 WA  Rural - Wheat Belt","Nonmetro","F Pop <= 500",null,null,319,0,null,null,null,"Refer to Distribution Partner",21.666666666666668,null,2,2,0,0,0,0,3,null,null,null,null,null,6407]
[6407,"A","Other","Regional","509 WA  Rural - Wheat Belt","Nonmetro","E Pop > 500",null,null,1138,134.5,null,null,null,"Refer to Distribution Partner",25,null,2,2,0,0,0,1,3,null,null,null,null,null,6409]
[6409,"A","Other","Regional","509 WA  Rural - Wheat Belt","Nonmetro","F Pop <= 500",null,null,402,0,null,null,null,"Refer to Distribution Partner",21.666666666666668,null,2,2,0,0,0,0,3,null,null,null,null,null,6410]
[6410,"A","Other","Regional","509 WA  Rural - Wheat Belt","Nonmetro","E Pop > 500",null,null,1051,179,null,null,null,"Refer to Distribution Partner",21.666666666666668,null,2,2,0,0,0,0,3,null,null,null,null,null,6411]
[6411,"A","Other","Regional","509 WA  Rural - Wheat Belt","Nonmetro","F Pop <= 500",null,null,123,0,null,null,null,"Refer to Distribution Partner",21.666666666666668,null,2,2,0,0,0,0,3,null,null,null,null,null,6412]
[6412,"A","Other","Regional","509 WA  Rural - Wheat Belt","Nonmetro","F Pop <= 500",null,null,56,0,null,null,null,"Refer to Distribution Partner",21.666666666666668,null,2,2,0,0,0,0,3,null,null,null,null,null,6413]
[6413,"A","Other","Regional","509 WA  Rural - Wheat Belt","Nonmetro","F Pop <= 500",null,null,47,0,null,null,null,"Refer to Distribution Partner",21.666666666666668,null,2,2,0,0,0,0,3,null,null,null,null,null,6414]
[6414,"A","Other","Regional","509 WA  Rural - Wheat Belt","Nonmetro","F Pop <= 500",null,null,64,0,null,null,null,"Refer to Distribution Partner",21.666666666666668,null,2,2,0,0,0,0,3,null,null,null,null,null,6415]
[6415,"A","Other","Regional","509 WA  Rural - Wheat Belt","Nonmetro","D Pop > 2,000",null,null,3003,234.8,null,null,null,"Refer to Distribution Partner",28.333333333333332,null,2,2,1,0,0,0,3,null,null,null,null,null,6418]
[6418,"A","Other","Regional","509 WA  Rural - Wheat Belt","Nonmetro","E Pop > 500",null,null,703,0,null,null,null,"Refer to Distribution Partner",21.666666666666668,null,2,2,0,0,0,0,3,null,null,null,null,null,6419]
[6419,"A","Other","Regional","509 WA  Rural - Wheat Belt","Nonmetro","F Pop <= 500",null,null,57,0,null,null,null,"Refer to Distribution Partner",21.666666666666668,null,2,2,0,0,0,0,3,null,null,null,null,null,6420]
[6420,"A","Other","Regional","509 WA  Rural - Wheat Belt","Nonmetro","E Pop > 500",null,null,107,0,null,null,null,"Refer to Distribution Partner",21.666666666666668,null,2,2,0,0,0,0,3,null,null,null,null,null,6421]
[6421,"A","Other","Regional","509 WA  Rural - Wheat Belt","Nonmetro","F Pop <= 500",null,null,157,0,null,null,null,{"$f":"IF(ISBLANK(N2396),IF(AND(H2396<>\"\",IF(I2396=\"High Density\",\"High Density\",IF(AND(P2396<=45,P2396>0),\"Refer to Distribution Partner\",IF(AND(P2396<=55,P2396>45),\"Regional\",IF(AND(P2396>55,P2396<=70),\"Non Metro\",IF(F2396=\"Nonmetro\",\"Non Metro\",IF(P2396>70,\"Metro\",\"\"))))))=\"Refer to Distribution Partner\"),\"Regional\",IF(I2396=\"High Density\",\"High Density\",IF(AND(P2396<=45,P2396>0),\"Refer to Distribution Partner\",IF(AND(P2396<=55,P2396>45),\"Regional\",IF(AND(P2396>55,P2396<=70),\"Non Metro\",IF(F2396=\"Nonmetro\",\"Non Metro\",IF(P2396>70,\"Metro\",\"\"))))))),N2396)","v":"Refer to Distribution Partner"},{"$f":"(R2396/$AB$3*$AA$3+S2396/$AB$4*$AA$4+T2396/$AB$5*$AA$5+U2396/$AB$6*$AA$6+V2396/$AB$7*$AA$7+W2396/$AB$8*$AA$8+X2396/$AB$9*$AA$9)*100","v":21.666666666666668},null,{"$f":"IF(ISNUMBER(SEARCH(\"Metro\",E2396)),3,IF(ISNUMBER(SEARCH(\"Rural\",E2396)),2,1))","v":2},{"$f":"IF(ISNUMBER(FIND(\"Metro\",F2396)),3,IF(ISNUMBER(FIND(\"Nonmetro\",F2396)),2,3))","v":2},{"$f":"IF(G2396=\"A Metro\",3,IF(G2396=\"B Regional\",2,IF(G2396=\"C Pop > 7,000\",1,IF(G2396=\"D Pop > 2,000\",1,0))))","v":0},{"$f":"IF(H2396=1,3,IF(H2396=2,2,IF(H2396=3,1,0)))","v":0},{"$f":"IF(J2396>=100000,3,IF(AND(J2396>=10000,J2396<100000),2,IF(AND(J2396>=5000,J2396<10000),1,0)))","v":0},{"$f":"IF(AND(K2396>=0.1,K2396<25),3,IF(AND(K2396>=25,K2396<50),2,IF(AND(K2396>=50,K2396<150),1,0)))","v":0},{"$f":"IF(L2396=\"\",3,0)","v":3},null,null,null,null,null,6422]
[6422,"A","Other","Regional","509 WA  Rural - Wheat Belt","Nonmetro","F Pop <= 500",null,null,52,0,null,null,null,"Refer to Distribution Partner",21.666666666666668,null,2,2,0,0,0,0,3,null,null,null,null,null,6423]
[6423,"A","Other","Regional","509 WA  Rural - Wheat Belt","Nonmetro","F Pop <= 500",null,null,216,0,"Mining",null,null,"Refer to Distribution Partner",16.666666666666664,null,2,2,0,0,0,0,0,null,null,null,null,null,6424]
[6424,"A","Other","Regional","509 WA  Rural - Wheat Belt","Nonmetro","F Pop <= 500",null,null,79,0,null,null,null,"Refer to Distribution Partner",21.666666666666668,null,2,2,0,0,0,0,3,null,null,null,null,null,6425]
[6425,"A","Other","Regional","509 WA  Rural - Wheat Belt","Nonmetro","F Pop <= 500",null,null,85,0,null,null,null,"Refer to Distribution Partner",21.666666666666668,null,2,2,0,0,0,0,3,null,null,null,null,null,6426]
[6426,"A","Other","Regional","509 WA  Rural - Wheat Belt","Nonmetro","E Pop > 500",null,null,846,339.8,"Mining",null,null,"Refer to Distribution Partner",16.666666666666664,null,2,2,0,0,0,0,0,null,null,null,null,null,6427]
[6427,"A","Other","Regional","509 WA  Rural - Wheat Belt","Nonmetro","F Pop <= 500",null,null,94,0,null,null,null,"Refer to Distribution Partner",21.666666666666668,null,2,2,0,0,0,0,3,null,null,null,null,null,6428]
[6428,"A","Other","Regional","509 WA  Rural - Wheat Belt","Nonmetro","F Pop <= 500",null,null,54,0,null,null,null,"Refer to Distribution Partner",21.666666666666668,null,2,2,0,0,0,0,3,null,null,null,null,null,6429]
[6429,"A","Other","Regional","508 WA  Rural - Outback","Nonmetro","E Pop > 500",null,null,992,515.29999999999995,"Mining",null,null,"Refer to Distribution Partner",16.666666666666664,null,2,2,0,0,0,0,0,null,null,null,null,null,6430]
[6430,"A","Regional","Regional","508 WA  Rural - Outback","Nonmetro","B Regional",3,null,22746,548.70000000000005,"Mining",null,null,"Regional",50,null,2,2,2,1,2,0,0,null,null,null,null,null,6431]
[6431,"A","Other","Regional","508 WA  Rural - Outback","Nonmetro","E Pop > 500",null,null,1012,0,"Mining",null,null,"Refer to Distribution Partner",16.666666666666664,null,2,2,0,0,0,0,0,null,null,null,null,null,6432]
[6432,"A","Other","Regional","508 WA  Rural - Outback","Nonmetro","C Pop > 7,000",3,null,7092,549.6,"Mining",null,null,"Regional",36.666666666666664,null,2,2,1,1,1,0,0,null,null,null,null,null,6434]
[6434,"A","Other","Regional","508 WA  Rural - Outback","Nonmetro","F Pop <= 500",null,null,174,0,"Mining",null,null,"Refer to Distribution Partner",16.666666666666664,null,2,2,0,0,0,0,0,null,null,null,null,null,6436]
[6436,"A","Other","Regional","508 WA  Rural - Outback","Nonmetro","F Pop <= 500",null,null,107,0,"Mining",null,null,"Refer to Distribution Partner",16.666666666666664,null,2,2,0,0,0,0,0,null,null,null,null,null,6437]
[6437,"A","Other","Regional","508 WA  Rural - Outback","Nonmetro","E Pop > 500",null,null,584,0,"Mining",null,null,"Refer to Distribution Partner",16.666666666666664,null,2,2,0,0,0,0,0,null,null,null,null,null,6438]
[6438,"A","Other","Regional","508 WA  Rural - Outback","Nonmetro","E Pop > 500",null,null,831,0,"Mining",null,null,"Refer to Distribution Partner",16.666666666666664,null,2,2,0,0,0,0,0,null,null,null,null,null,6440]
[6440,"A","Other","Regional","508 WA  Rural - Outback","Nonmetro","E Pop > 500",null,null,1153,0,"Mining",null,null,"Refer to Distribution Partner",16.666666666666664,null,2,2,0,0,0,0,0,null,null,null,null,null,6442]
[6442,"A","Other","Regional","508 WA  Rural - Outback","Nonmetro","D Pop > 2,000",null,null,2542,554.4,"Mining",null,null,"Refer to Distribution Partner",23.333333333333332,null,2,2,1,0,0,0,0,null,null,null,null,null,6443]
[6443,"A","Other","Regional","508 WA  Rural - Outback","Nonmetro","E Pop > 500",null,null,854,558.5,"Mining",null,null,"Refer to Distribution Partner",16.666666666666664,null,2,2,0,0,0,0,0,null,null,null,null,null,6445]
[6445,"A","Other","Regional","508 WA  Rural - Outback","Nonmetro","F Pop <= 500",null,null,203,0,null,null,null,"Refer to Distribution Partner",21.666666666666668,null,2,2,0,0,0,0,3,null,null,null,null,null,6446]
[6446,"A","Other","Regional","508 WA  Rural - Outback","Nonmetro","F Pop <= 500",null,null,133,0,null,null,null,"Refer to Distribution Partner",21.666666666666668,null,2,2,0,0,0,0,3,null,null,null,null,null,6447]
[6447,"A","Other","Regional","508 WA  Rural - Outback","Nonmetro","F Pop <= 500",null,null,183,0,null,null,null,"Refer to Distribution Partner",21.666666666666668,null,2,2,0,0,0,0,3,null,null,null,null,null,6448]
[6448,"A","Other","Regional","508 WA  Rural - Outback","Nonmetro","F Pop <= 500",null,null,449,0,null,null,null,"Refer to Distribution Partner",21.666666666666668,null,2,2,0,0,0,0,3,null,null,null,null,null,6450]
[6450,"A","Regional","Regional","508 WA  Rural - Outback","Nonmetro","B Regional",2,null,13397,601.9,null,null,null,"Non Metro",61.666666666666671,null,2,2,2,2,2,0,3,null,null,null,null,null,6452]
[6452,"A","Other","Regional","508 WA  Rural - Outback","Nonmetro","F Pop <= 500",null,null,5,0,null,null,null,"Refer to Distribution Partner",21.666666666666668,null,2,2,0,0,0,0,3,null,"Distance from PO",null,null,null,6460]
[6460,"A","Other","Regional","509 WA  Rural - Wheat Belt","Nonmetro","E Pop > 500",null,null,752,0,null,null,null,"Refer to Distribution Partner",21.666666666666668,null,2,2,0,0,0,0,3,null,null,null,null,null,6461]
[6461,"A","Other","Regional","509 WA  Rural - Wheat Belt","Nonmetro","F Pop <= 500",null,null,533,0,null,null,null,"Refer to Distribution Partner",21.666666666666668,null,2,2,0,0,0,0,3,null,null,null,null,null,6462]
[6462,"A","Other","Regional","509 WA  Rural - Wheat Belt","Nonmetro","F Pop <= 500",null,null,128,0,null,null,null,"Refer to Distribution Partner",21.666666666666668,null,2,2,0,0,0,0,3,null,null,null,null,null,6463]
[6463,"A","Other","Regional","509 WA  Rural - Wheat Belt","Nonmetro","F Pop <= 500",null,null,20,0,null,null,null,"Refer to Distribution Partner",21.666666666666668,null,2,2,0,0,0,0,3,null,null,null,null,null,6465]
[6465,"A","Other","Regional","509 WA  Rural - Wheat Belt","Nonmetro","F Pop <= 500",null,null,28,0,null,null,null,"Refer to Distribution Partner",21.666666666666668,null,2,2,0,0,0,0,3,null,null,null,null,null,6466]
[6466,"A","Other","Regional","509 WA  Rural - Wheat Belt","Nonmetro","F Pop <= 500",null,null,67,0,null,null,null,"Refer to Distribution Partner",21.666666666666668,null,2,2,0,0,0,0,3,null,null,null,null,null,6467]
[6467,"A","Other","Regional","509 WA  Rural - Wheat Belt","Nonmetro","F Pop <= 500",null,null,32,0,null,null,null,"Refer to Distribution Partner",21.666666666666668,null,2,2,0,0,0,0,3,null,null,null,null,null,6468]
[6468,"A","Other","Regional","509 WA  Rural - Wheat Belt","Nonmetro","F Pop <= 500",null,null,250,0,null,null,null,"Refer to Distribution Partner",21.666666666666668,null,2,2,0,0,0,0,3,null,null,null,null,null,6470]
[6470,"A","Other","Regional","509 WA  Rural - Wheat Belt","Nonmetro","F Pop <= 500",null,null,18,0,null,null,null,"Refer to Distribution Partner",21.666666666666668,null,2,2,0,0,0,0,3,null,null,null,null,null,6472]
[6472,"A","Other","Regional","509 WA  Rural - Wheat Belt","Nonmetro","F Pop <= 500",null,null,177,0,null,null,null,"Refer to Distribution Partner",21.666666666666668,null,2,2,0,0,0,0,3,null,null,null,null,null,6473]
[6473,"A","Other","Regional","509 WA  Rural - Wheat Belt","Nonmetro","F Pop <= 500",null,null,43,0,null,null,null,"Refer to Distribution Partner",21.666666666666668,null,2,2,0,0,0,0,3,null,null,null,null,null,6475]
[6475,"A","Other","Regional","509 WA  Rural - Wheat Belt","Nonmetro","F Pop <= 500",null,null,399,0,null,null,null,"Refer to Distribution Partner",21.666666666666668,null,2,2,0,0,0,0,3,null,null,null,null,null,6476]
[6476,"A","Other","Regional","509 WA  Rural - Wheat Belt","Nonmetro","F Pop <= 500",null,null,53,0,null,null,null,"Refer to Distribution Partner",21.666666666666668,null,2,2,0,0,0,0,3,null,null,null,null,null,6477]
[6477,"A","Other","Regional","509 WA  Rural - Wheat Belt","Nonmetro","F Pop <= 500",null,null,273,0,null,null,null,"Refer to Distribution Partner",21.666666666666668,null,2,2,0,0,0,0,3,null,null,null,null,null,6479]
[6479,"A","Other","Regional","509 WA  Rural - Wheat Belt","Nonmetro","F Pop <= 500",null,null,548,0,null,null,null,"Refer to Distribution Partner",21.666666666666668,null,2,2,0,0,0,0,3,null,null,null,null,null,6480]
[6480,"A","Other","Regional","509 WA  Rural - Wheat Belt","Nonmetro","F Pop <= 500",null,null,49,0,null,null,null,"Refer to Distribution Partner",21.666666666666668,null,2,2,0,0,0,0,3,null,null,null,null,null,6484]
[6484,"A","Other","Regional","509 WA  Rural - Wheat Belt","Nonmetro","F Pop <= 500",null,null,96,0,null,null,null,"Refer to Distribution Partner",21.666666666666668,null,2,2,0,0,0,0,3,null,null,null,null,null,6485]
[6485,"A","Other","Regional","509 WA  Rural - Wheat Belt","Nonmetro","E Pop > 500",null,null,498,168.2,null,null,null,"Refer to Distribution Partner",21.666666666666668,null,2,2,0,0,0,0,3,null,null,null,null,null,6487]
[6487,"A","Other","Regional","509 WA  Rural - Wheat Belt","Nonmetro","F Pop <= 500",null,null,50,0,null,null,null,"Refer to Distribution Partner",21.666666666666668,null,2,2,0,0,0,0,3,null,null,null,null,null,6488]
[6488,"A","Other","Regional","509 WA  Rural - Wheat Belt","Nonmetro","F Pop <= 500",null,null,193,0,null,null,null,"Refer to Distribution Partner",21.666666666666668,null,2,2,0,0,0,0,3,null,null,null,null,null,6489]
[6489,"A","Other","Regional","509 WA  Rural - Wheat Belt","Nonmetro","F Pop <= 500",null,null,104,0,null,null,null,"Refer to Distribution Partner",21.666666666666668,null,2,2,0,0,0,0,3,null,null,null,null,null,6490]
[6490,"A","Other","Regional","509 WA  Rural - Wheat Belt","Nonmetro","F Pop <= 500",null,null,257,0,null,null,null,"Refer to Distribution Partner",21.666666666666668,null,2,2,0,0,0,0,3,null,null,null,null,null,6501]
[6501,"A","Other","Regional","509 WA  Rural - Wheat Belt","Nonmetro","E Pop > 500",null,null,968,42.9,null,null,null,"Refer to Distribution Partner",28.333333333333332,null,2,2,0,0,0,2,3,null,null,null,null,null,6502]
[6502,"A","Other","Regional","509 WA  Rural - Wheat Belt","Nonmetro","E Pop > 500",null,null,1183,66.400000000000006,"Mining",null,null,"Refer to Distribution Partner",20,null,2,2,0,0,0,1,0,null,null,null,null,null,6503]
[6503,"A","Other","Regional","509 WA  Rural - Wheat Belt","Nonmetro","D Pop > 2,000",null,null,2177,69.3,null,null,null,"Refer to Distribution Partner",31.666666666666664,null,2,2,1,0,0,1,3,null,null,null,null,null,6504]
[6504,"A","Other","Regional","509 WA  Rural - Wheat Belt","Nonmetro","F Pop <= 500",null,null,157,0,null,null,null,"Refer to Distribution Partner",21.666666666666668,null,2,2,0,0,0,0,3,null,null,null,null,null,6505]
[6505,"A","Other","Regional","509 WA  Rural - Wheat Belt","Nonmetro","F Pop <= 500",null,null,114,0,null,null,null,"Refer to Distribution Partner",21.666666666666668,null,2,2,0,0,0,0,3,null,null,null,null,null,6506]
[6506,"A","Other","Regional","509 WA  Rural - Wheat Belt","Nonmetro","F Pop <= 500",null,null,59,0,null,null,null,"Refer to Distribution Partner",21.666666666666668,null,2,2,0,0,0,0,3,null,null,null,null,null,6507]
[6507,"A","Other","Regional","509 WA  Rural - Wheat Belt","Nonmetro","F Pop <= 500",null,null,536,0,null,null,null,"Refer to Distribution Partner",21.666666666666668,null,2,2,0,0,0,0,3,null,null,null,null,null,6509]
[6509,"A","Other","Regional","509 WA  Rural - Wheat Belt","Nonmetro","F Pop <= 500",null,null,205,0,null,null,null,"Refer to Distribution Partner",21.666666666666668,null,2,2,0,0,0,0,3,null,null,null,null,null,6510]
[6510,"A","Other","Regional","509 WA  Rural - Wheat Belt","Nonmetro","D Pop > 2,000",null,null,1976,146.4,null,null,null,"Refer to Distribution Partner",31.666666666666664,null,2,2,1,0,0,1,3,null,null,null,null,null,6511]
[6511,"A","Regional","Regional","509 WA  Rural - Wheat Belt","Nonmetro","B Regional",null,null,527,177.9,null,null,null,"Refer to Distribution Partner",35,null,2,2,2,0,0,0,3,null,null,null,null,null,6512]
[6512,"A","Other","Regional","509 WA  Rural - Wheat Belt","Nonmetro","F Pop <= 500",null,null,97,0,null,null,null,"Refer to Distribution Partner",21.666666666666668,null,2,2,0,0,0,0,3,null,null,null,null,null,6513]
[6513,"A","Other","Regional","509 WA  Rural - Wheat Belt","Nonmetro","F Pop <= 500",null,null,218,0,null,null,null,"Refer to Distribution Partner",21.666666666666668,null,2,2,0,0,0,0,3,null,null,null,null,null,6514]
[6514,"A","Other","Regional","508 WA  Rural - Outback","Nonmetro","E Pop > 500",null,null,648,231.6,null,null,null,"Refer to Distribution Partner",21.666666666666668,null,2,2,0,0,0,0,3,null,null,null,null,null,6515]
[6515,"A","Other","Regional","508 WA  Rural - Outback","Nonmetro","F Pop <= 500",null,null,284,0,null,null,null,"Refer to Distribution Partner",21.666666666666668,null,2,2,0,0,0,0,3,null,null,null,null,null,6516]
[6516,"A","Regional","Regional","509 WA  Rural - Wheat Belt","Nonmetro","B Regional",null,null,1761,198.5,"Mining",null,null,"Refer to Distribution Partner",30,null,2,2,2,0,0,0,0,null,null,null,null,null,6517]
[6517,"A","Other","Regional","508 WA  Rural - Outback","Nonmetro","F Pop <= 500",null,null,405,251.8,null,null,null,"Refer to Distribution Partner",21.666666666666668,null,2,2,0,0,0,0,3,null,null,null,null,null,6518]
[6518,"A","Other","Regional","508 WA  Rural - Outback","Nonmetro","F Pop <= 500",null,null,209,0,null,null,null,"Refer to Distribution Partner",21.666666666666668,null,2,2,0,0,0,0,3,null,null,null,null,null,6519]
[6519,"A","Other","Regional","508 WA  Rural - Outback","Nonmetro","E Pop > 500",null,null,594,271,null,null,null,{"$f":"IF(ISBLANK(N2460),IF(AND(H2460<>\"\",IF(I2460=\"High Density\",\"High Density\",IF(AND(P2460<=45,P2460>0),\"Refer to Distribution Partner\",IF(AND(P2460<=55,P2460>45),\"Regional\",IF(AND(P2460>55,P2460<=70),\"Non Metro\",IF(F2460=\"Nonmetro\",\"Non Metro\",IF(P2460>70,\"Metro\",\"\"))))))=\"Refer to Distribution Partner\"),\"Regional\",IF(I2460=\"High Density\",\"High Density\",IF(AND(P2460<=45,P2460>0),\"Refer to Distribution Partner\",IF(AND(P2460<=55,P2460>45),\"Regional\",IF(AND(P2460>55,P2460<=70),\"Non Metro\",IF(F2460=\"Nonmetro\",\"Non Metro\",IF(P2460>70,\"Metro\",\"\"))))))),N2460)","v":"Refer to Distribution Partner"},{"$f":"(R2460/$AB$3*$AA$3+S2460/$AB$4*$AA$4+T2460/$AB$5*$AA$5+U2460/$AB$6*$AA$6+V2460/$AB$7*$AA$7+W2460/$AB$8*$AA$8+X2460/$AB$9*$AA$9)*100","v":21.666666666666668},null,{"$f":"IF(ISNUMBER(SEARCH(\"Metro\",E2460)),3,IF(ISNUMBER(SEARCH(\"Rural\",E2460)),2,1))","v":2},{"$f":"IF(ISNUMBER(FIND(\"Metro\",F2460)),3,IF(ISNUMBER(FIND(\"Nonmetro\",F2460)),2,3))","v":2},{"$f":"IF(G2460=\"A Metro\",3,IF(G2460=\"B Regional\",2,IF(G2460=\"C Pop > 7,000\",1,IF(G2460=\"D Pop > 2,000\",1,0))))","v":0},{"$f":"IF(H2460=1,3,IF(H2460=2,2,IF(H2460=3,1,0)))","v":0},{"$f":"IF(J2460>=100000,3,IF(AND(J2460>=10000,J2460<100000),2,IF(AND(J2460>=5000,J2460<10000),1,0)))","v":0},{"$f":"IF(AND(K2460>=0.1,K2460<25),3,IF(AND(K2460>=25,K2460<50),2,IF(AND(K2460>=50,K2460<150),1,0)))","v":0},{"$f":"IF(L2460=\"\",3,0)","v":3},null,null,null,null,null,6521]
[6521,"A","Other","Regional","509 WA  Rural - Wheat Belt","Nonmetro","F Pop <= 500",null,null,352,0,null,null,null,"Refer to Distribution Partner",21.666666666666668,null,2,2,0,0,0,0,3,null,null,null,null,null,6522]
[6522,"A","Other","Regional","508 WA  Rural - Outback","Nonmetro","F Pop <= 500",null,null,455,0,null,null,null,"Refer to Distribution Partner",21.666666666666668,null,2,2,0,0,0,0,3,null,null,null,null,null,6525]
[6525,"A","Other","Regional","508 WA  Rural - Outback","Nonmetro","D Pop > 2,000",null,null,3569,313,"Mining",null,null,"Refer to Distribution Partner",23.333333333333332,null,2,2,1,0,0,0,0,null,null,null,null,null,6528]
[6528,"A","Other","Regional","508 WA  Rural - Outback","Nonmetro","F Pop <= 500",null,null,405,0,null,null,null,"Refer to Distribution Partner",21.666666666666668,null,2,2,0,0,0,0,3,null,null,null,null,null,6530]
[6530,"A","Regional","Regional","508 WA  Rural - Outback","Nonmetro","B Regional",1,null,32455,373.1,null,null,null,"Non Metro",68.333333333333329,null,2,2,2,3,2,0,3,null,null,null,null,null,6532]
[6532,"A","Regional","Regional","508 WA  Rural - Outback","Nonmetro","B Regional",null,null,6725,376.7,null,null,null,"Refer to Distribution Partner",41.666666666666664,null,2,2,2,0,1,0,3,null,null,null,null,null,6535]
[6535,"A","Other","Regional","508 WA  Rural - Outback","Nonmetro","E Pop > 500",null,null,1596,417.6,null,null,null,"Refer to Distribution Partner",21.666666666666668,null,2,2,0,0,0,0,3,null,null,null,null,null,6536]
[6536,"A","Other","Regional","508 WA  Rural - Outback","Nonmetro","E Pop > 500",null,null,1557,499.5,null,null,null,"Refer to Distribution Partner",21.666666666666668,null,2,2,0,0,0,0,3,null,null,null,null,null,6537]
[6537,"A","Other","Regional","508 WA  Rural - Outback","Nonmetro","E Pop > 500",null,null,910,707.3,"Mining",null,null,"Refer to Distribution Partner",16.666666666666664,null,2,2,0,0,0,0,0,null,null,null,null,null,6556]
[6556,"A","Other","Regional","504 WA  Metro - Swan Districts","Nonmetro","E Pop > 500",null,null,2034,40.6,null,null,null,"Refer to Distribution Partner",30,null,3,2,0,0,0,2,3,null,null,null,null,null,6558]
[6558,"A","Other","Regional","504 WA  Metro - Swan Districts","Nonmetro","D Pop > 2,000",null,null,2642,46.3,null,null,null,"Refer to Distribution Partner",36.666666666666664,null,3,2,1,0,0,2,3,null,null,null,null,null,6560]
[6560,"A","Other","Regional","509 WA  Rural - Wheat Belt","Nonmetro","E Pop > 500",null,null,1352,54,"Mining",null,null,"Refer to Distribution Partner",20,null,2,2,0,0,0,1,0,null,null,null,null,null,6562]
[6562,"A","Other","Regional","509 WA  Rural - Wheat Belt","Nonmetro","E Pop > 500",null,null,1257,60.6,"Mining",null,null,"Refer to Distribution Partner",20,null,2,2,0,0,0,1,0,null,null,null,null,null,6564]
[6564,"A","Other","Regional","509 WA  Rural - Wheat Belt","Nonmetro","F Pop <= 500",null,null,310,67.8,"Mining",null,null,"Refer to Distribution Partner",20,null,2,2,0,0,0,1,0,null,null,null,null,null,6566]
[6566,"A","Other","Regional","509 WA  Rural - Wheat Belt","Nonmetro","D Pop > 2,000",null,null,3275,73.400000000000006,"Mining",null,null,"Refer to Distribution Partner",26.666666666666668,null,2,2,1,0,0,1,0,null,null,null,null,null,6567]
[6567,"A","Other","Regional","509 WA  Rural - Wheat Belt","Nonmetro","F Pop <= 500",null,null,417,66.2,"Mining",null,null,"Refer to Distribution Partner",20,null,2,2,0,0,0,1,0,null,null,null,null,null,6568]
[6568,"A","Other","Regional","509 WA  Rural - Wheat Belt","Nonmetro","F Pop <= 500",null,null,226,0,null,null,null,"Refer to Distribution Partner",21.666666666666668,null,2,2,0,0,0,0,3,null,null,null,null,null,6569]
[6569,"A","Other","Regional","509 WA  Rural - Wheat Belt","Nonmetro","F Pop <= 500",null,null,272,0,null,null,null,"Refer to Distribution Partner",21.666666666666668,null,2,2,0,0,0,0,3,null,null,null,null,null,6571]
[6571,"A","Other","Regional","509 WA  Rural - Wheat Belt","Nonmetro","F Pop <= 500",null,null,75,0,null,null,null,"Refer to Distribution Partner",21.666666666666668,null,2,2,0,0,0,0,3,null,null,null,null,null,6572]
[6572,"A","Other","Regional","509 WA  Rural - Wheat Belt","Nonmetro","F Pop <= 500",null,null,57,0,null,null,null,"Refer to Distribution Partner",21.666666666666668,null,2,2,0,0,0,0,3,null,null,null,null,null,6574]
[6574,"A","Other","Regional","509 WA  Rural - Wheat Belt","Nonmetro","F Pop <= 500",null,null,84,0,null,null,null,"Refer to Distribution Partner",21.666666666666668,null,2,2,0,0,0,0,3,null,null,null,null,null,6575]
[6575,"A","Other","Regional","509 WA  Rural - Wheat Belt","Nonmetro","F Pop <= 500",null,null,141,0,null,null,null,"Refer to Distribution Partner",21.666666666666668,null,2,2,0,0,0,0,3,null,null,null,null,null,6603]
[6603,"A","Other","Regional","509 WA  Rural - Wheat Belt","Nonmetro","E Pop > 500",null,null,1111,143.6,null,null,null,"Refer to Distribution Partner",25,null,2,2,0,0,0,1,3,null,null,null,null,null,6605]
[6605,"A","Other","Regional","509 WA  Rural - Wheat Belt","Nonmetro","F Pop <= 500",null,null,40,0,null,null,null,"Refer to Distribution Partner",21.666666666666668,null,2,2,0,0,0,0,3,null,null,null,null,null,6606]
[6606,"A","Other","Regional","509 WA  Rural - Wheat Belt","Nonmetro","F Pop <= 500",null,null,168,0,null,null,null,"Refer to Distribution Partner",21.666666666666668,null,2,2,0,0,0,0,3,null,null,null,null,null,6608]
[6608,"A","Other","Regional","509 WA  Rural - Wheat Belt","Nonmetro","F Pop <= 500",null,null,135,0,null,null,null,"Refer to Distribution Partner",21.666666666666668,null,2,2,0,0,0,0,3,null,null,null,null,null,6609]
[6609,"A","Other","Regional","509 WA  Rural - Wheat Belt","Nonmetro","E Pop > 500",null,null,822,201.3,null,null,null,"Refer to Distribution Partner",21.666666666666668,null,2,2,0,0,0,0,3,null,null,null,null,null,6612]
[6612,"A","Other","Regional","508 WA  Rural - Outback","Nonmetro","F Pop <= 500",null,null,224,0,"Mining",null,null,"Refer to Distribution Partner",16.666666666666664,null,2,2,0,0,0,0,0,null,null,null,null,null,6613]
[6613,"A","Other","Regional","509 WA  Rural - Wheat Belt","Nonmetro","F Pop <= 500",null,null,62,0,null,null,null,"Refer to Distribution Partner",21.666666666666668,null,2,2,0,0,0,0,3,null,null,null,null,null,6614]
[6614,"A","Other","Regional","508 WA  Rural - Outback","Nonmetro","F Pop <= 500",null,null,23,0,null,null,null,"Refer to Distribution Partner",21.666666666666668,null,2,2,0,0,0,0,3,null,null,null,null,null,6616]
[6616,"A","Other","Regional","508 WA  Rural - Outback","Nonmetro","F Pop <= 500",null,null,56,0,null,null,null,"Refer to Distribution Partner",21.666666666666668,null,2,2,0,0,0,0,3,null,null,null,null,null,6620]
[6620,"A","Other","Regional","508 WA  Rural - Outback","Nonmetro","F Pop <= 500",null,null,498,0,"Mining",null,null,"Refer to Distribution Partner",16.666666666666664,null,2,2,0,0,0,0,0,null,null,null,null,null,6623]
[6623,"A","Other","Regional","508 WA  Rural - Outback","Nonmetro","E Pop > 500",null,null,674,0,null,null,null,"Refer to Distribution Partner",21.666666666666668,null,2,2,0,0,0,0,3,null,null,null,null,null,6625]
[6625,"A","Other","Regional","508 WA  Rural - Outback","Nonmetro","F Pop <= 500",null,null,49,0,null,null,null,"Refer to Distribution Partner",21.666666666666668,null,2,2,0,0,0,0,3,null,null,null,null,null,6627]
[6627,"A","Other","Regional","508 WA  Rural - Outback","Nonmetro","F Pop <= 500",null,null,69,0,null,null,null,"Refer to Distribution Partner",21.666666666666668,null,2,2,0,0,0,0,3,null,null,null,null,null,6628]
[6628,"A","Other","Regional","508 WA  Rural - Outback","Nonmetro","F Pop <= 500",null,null,34,0,null,null,null,"Refer to Distribution Partner",21.666666666666668,null,2,2,0,0,0,0,3,null,null,null,null,null,6630]
[6630,"A","Other","Regional","508 WA  Rural - Outback","Nonmetro","E Pop > 500",null,null,622,0,null,null,null,"Refer to Distribution Partner",21.666666666666668,null,2,2,0,0,0,0,3,null,null,null,null,null,6631]
[6631,"A","Other","Regional","508 WA  Rural - Outback","Nonmetro","F Pop <= 500",null,null,30,0,null,null,null,"Refer to Distribution Partner",21.666666666666668,null,2,2,0,0,0,0,3,null,null,null,null,null,6632]
[6632,"A","Other","Regional","508 WA  Rural - Outback","Nonmetro","F Pop <= 500",null,null,69,0,null,null,null,"Refer to Distribution Partner",21.666666666666668,null,2,2,0,0,0,0,3,null,null,null,null,null,6635]
[6635,"A","Other","Regional","508 WA  Rural - Outback","Nonmetro","E Pop > 500",null,null,344,0,"Mining",null,null,"Refer to Distribution Partner",16.666666666666664,null,2,2,0,0,0,0,0,null,null,null,null,null,6638]
[6638,"A","Other","Regional","508 WA  Rural - Outback","Nonmetro","E Pop > 500",null,null,482,0,"Mining",null,null,"Refer to Distribution Partner",16.666666666666664,null,2,2,0,0,0,0,0,null,null,null,null,null,6639]
[6639,"A","Other","Regional","508 WA  Rural - Outback","Nonmetro","F Pop <= 500",null,null,89,0,null,null,null,"Refer to Distribution Partner",21.666666666666668,null,2,2,0,0,0,0,3,null,null,null,null,null,6640]
[6640,"A","Other","Regional","508 WA  Rural - Outback","Nonmetro","F Pop <= 500",null,null,196,0,"Mining",null,null,"Refer to Distribution Partner",16.666666666666664,null,2,2,0,0,0,0,0,null,null,null,null,null,6642]
[6642,"A","Other","Regional","508 WA  Rural - Outback","Nonmetro","E Pop > 500",null,null,1067,0,"Mining",null,null,"Refer to Distribution Partner",16.666666666666664,null,2,2,0,0,0,0,0,null,null,null,null,null,6646]
[6646,"A","Other","Regional","508 WA  Rural - Outback","Nonmetro","E Pop > 500",null,null,742,0,"Mining",null,null,"Refer to Distribution Partner",16.666666666666664,null,2,2,0,0,0,0,0,null,null,null,null,null,6701]
[6701,"A","Other","Regional","508 WA  Rural - Outback","Nonmetro","D Pop > 2,000",null,null,5544,820.9,null,null,"Not Acceptable","Not Acceptable",35,null,2,2,1,0,1,0,3,null,null,null,null,null,6705]
[6705,"A","Other","Regional","508 WA  Rural - Outback","Nonmetro","F Pop <= 500",null,null,278,0,null,null,null,"Refer to Distribution Partner",21.666666666666668,null,2,2,0,0,0,0,3,null,null,null,null,null,6707]
[6707,"A","Other","Regional","508 WA  Rural - Outback","Nonmetro","D Pop > 2,000",null,null,2713,1127.0999999999999,null,null,null,"Refer to Distribution Partner",28.333333333333332,null,2,2,1,0,0,0,3,null,null,null,null,null,6710]
[6710,"A","Other","Regional","508 WA  Rural - Outback","Nonmetro","D Pop > 2,000",null,null,4002,0,null,null,null,"Refer to Distribution Partner",28.333333333333332,null,2,2,1,0,0,0,3,null,null,null,null,null,6712]
[6712,"A","Other","Regional","508 WA  Rural - Outback","Nonmetro","F Pop <= 500",null,null,1965,0,null,null,null,"Refer to Distribution Partner",21.666666666666668,null,2,2,0,0,0,0,3,null,null,null,null,null,6713]
[6713,"A","Regional","Regional","508 WA  Rural - Outback","Nonmetro","B Regional",3,null,1104,1258.0999999999999,"Mining",null,null,"Regional",36.666666666666664,null,2,2,2,1,0,0,0,null,null,null,null,null,6714]
[6714,"A","Regional","Regional","508 WA  Rural - Outback","Nonmetro","B Regional",3,null,16829,1251.0999999999999,"Mining",null,null,"Regional",50,null,2,2,2,1,2,0,0,null,null,null,null,null,6716]
[6716,"A","Other","Regional","508 WA  Rural - Outback","Nonmetro","E Pop > 500",null,null,751,0,"Mining",null,null,"Refer to Distribution Partner",16.666666666666664,null,2,2,0,0,0,0,0,null,null,null,null,null,6718]
[6718,"A","Other","Regional","508 WA  Rural - Outback","Nonmetro","E Pop > 500",null,null,1010,0,"Mining",null,null,"Refer to Distribution Partner",16.666666666666664,null,2,2,0,0,0,0,0,null,null,null,null,null,6720]
[6720,"A","Other","Regional","508 WA  Rural - Outback","Nonmetro","D Pop > 2,000",null,null,2528,1263.5,"Mining",null,null,"Refer to Distribution Partner",23.333333333333332,null,2,2,1,0,0,0,0,null,null,null,null,null,6721]
[6721,"A","Regional","Regional","508 WA  Rural - Outback","Nonmetro","B Regional",null,null,4512,1323.5,"Mining",null,"Regional","Regional",30,null,2,2,2,0,0,0,0,null,null,null,null,null,6722]
[6722,"A","Regional","Regional","508 WA  Rural - Outback","Nonmetro","B Regional",null,null,9848,1313.1,"Mining",null,null,"Refer to Distribution Partner",36.666666666666664,null,2,2,2,0,1,0,0,null,null,null,null,null,6725]
[6725,"A","Regional","Regional","508 WA  Rural - Outback","Nonmetro","B Regional",2,null,10795,1684.2,null,null,null,"Non Metro",61.666666666666671,null,2,2,2,2,2,0,3,null,null,null,null,null,6726]
[6726,"A","Regional","Regional","508 WA  Rural - Outback","Nonmetro","B Regional",2,null,5436,1684.2,null,null,null,"Regional",55.000000000000007,null,2,2,2,2,1,0,3,null,null,null,null,null,6728]
[6728,"A","Other","Regional","508 WA  Rural - Outback","Nonmetro","D Pop > 2,000",null,null,5946,1805.2,null,null,null,"Refer to Distribution Partner",35,null,2,2,1,0,1,0,3,null,null,null,null,null,6740]
[6740,"A","Other","Regional","508 WA  Rural - Outback","Nonmetro","E Pop > 500",null,null,1289,0,null,null,null,"Refer to Distribution Partner",21.666666666666668,null,2,2,0,0,0,0,3,null,null,null,null,null,6743]
[6743,"A","Other","Regional","508 WA  Rural - Outback","Nonmetro","D Pop > 2,000",null,null,6232,2220.6,"Mining",null,null,"Refer to Distribution Partner",30,null,2,2,1,0,1,0,0,null,null,null,null,null,6751]
[6751,"A","Other","Regional","508 WA  Rural - Outback","Nonmetro","D Pop > 2,000",null,null,4927,0,"Mining",null,null,"Refer to Distribution Partner",23.333333333333332,null,2,2,1,0,0,0,0,null,null,null,null,null,6753]
[6753,"A","Other","Regional","508 WA  Rural - Outback","Nonmetro","C Pop > 7,000",null,null,7238,1029,"Mining",null,null,{"$f":"IF(ISBLANK(N2524),IF(AND(H2524<>\"\",IF(I2524=\"High Density\",\"High Density\",IF(AND(P2524<=45,P2524>0),\"Refer to Distribution Partner\",IF(AND(P2524<=55,P2524>45),\"Regional\",IF(AND(P2524>55,P2524<=70),\"Non Metro\",IF(F2524=\"Nonmetro\",\"Non Metro\",IF(P2524>70,\"Metro\",\"\"))))))=\"Refer to Distribution Partner\"),\"Regional\",IF(I2524=\"High Density\",\"High Density\",IF(AND(P2524<=45,P2524>0),\"Refer to Distribution Partner\",IF(AND(P2524<=55,P2524>45),\"Regional\",IF(AND(P2524>55,P2524<=70),\"Non Metro\",IF(F2524=\"Nonmetro\",\"Non Metro\",IF(P2524>70,\"Metro\",\"\"))))))),N2524)","v":"Refer to Distribution Partner"},{"$f":"(R2524/$AB$3*$AA$3+S2524/$AB$4*$AA$4+T2524/$AB$5*$AA$5+U2524/$AB$6*$AA$6+V2524/$AB$7*$AA$7+W2524/$AB$8*$AA$8+X2524/$AB$9*$AA$9)*100","v":30},null,{"$f":"IF(ISNUMBER(SEARCH(\"Metro\",E2524)),3,IF(ISNUMBER(SEARCH(\"Rural\",E2524)),2,1))","v":2},{"$f":"IF(ISNUMBER(FIND(\"Metro\",F2524)),3,IF(ISNUMBER(FIND(\"Nonmetro\",F2524)),2,3))","v":2},{"$f":"IF(G2524=\"A Metro\",3,IF(G2524=\"B Regional\",2,IF(G2524=\"C Pop > 7,000\",1,IF(G2524=\"D Pop > 2,000\",1,0))))","v":1},{"$f":"IF(H2524=1,3,IF(H2524=2,2,IF(H2524=3,1,0)))","v":0},{"$f":"IF(J2524>=100000,3,IF(AND(J2524>=10000,J2524<100000),2,IF(AND(J2524>=5000,J2524<10000),1,0)))","v":1},{"$f":"IF(AND(K2524>=0.1,K2524<25),3,IF(AND(K2524>=25,K2524<50),2,IF(AND(K2524>=50,K2524<150),1,0)))","v":0},{"$f":"IF(L2524=\"\",3,0)","v":0},null,null,null,null,null,6754]
[6754,"A","Other","Regional","508 WA  Rural - Outback","Nonmetro","E Pop > 500",null,null,1380,989.5,"Mining",null,null,"Refer to Distribution Partner",16.666666666666664,null,2,2,0,0,0,0,0,null,null,null,null,null,6758]
[6758,"A","Other","Regional","508 WA  Rural - Outback","Nonmetro","F Pop <= 500",null,null,1701,0,"Mining",null,null,"Refer to Distribution Partner",16.666666666666664,null,2,2,0,0,0,0,0,null,null,null,null,null,6760]
[6760,"A","Other","Regional","508 WA  Rural - Outback","Nonmetro","F Pop <= 500",null,null,634,0,"Mining",null,null,"Refer to Distribution Partner",16.666666666666664,null,2,2,0,0,0,0,0,null,null,null,null,null,6762]
[6762,"A","Other","Regional","508 WA  Rural - Outback","Nonmetro","E Pop > 500",null,null,875,0,"Mining",null,null,"Refer to Distribution Partner",16.666666666666664,null,2,2,0,0,0,0,0,null,null,null,null,null,6765]
[6765,"A","Other","Regional","Unknown","Nonmetro","E Pop > 500",null,null,1757,0,null,null,null,"Refer to Distribution Partner",20,null,1,2,0,0,0,0,3,null,null,null,null,null,6770]
[6770,"A","Other","Regional","508 WA  Rural - Outback","Nonmetro","D Pop > 2,000",null,null,2904,0,null,null,null,"Refer to Distribution Partner",28.333333333333332,null,2,2,1,0,0,0,3,null,null,null,null,null,6798]
[6798,"A","Other","Regional","901 OTH Other Territories","Nonmetro","D Pop > 2,000",null,null,1843,2612.6,"Mining",null,null,"Refer to Distribution Partner",21.666666666666668,null,1,2,1,0,0,0,0,null,null,null,null,null,6799]
[6799,"A","Other","Regional","901 OTH Other Territories","Nonmetro","E Pop > 500",null,null,544,0,null,null,null,"Refer to Distribution Partner",20,null,1,2,0,0,0,0,3,null,null,null,null,null,7000]
[7000,"A","Metro","Inner City","601 TAS Metro - Hobart","Metro","A Metro",1,null,13837,1.7,null,null,null,"Metro",93.333333333333329,null,3,3,3,3,2,3,3,null,null,null,null,null,7004]
[7004,"A","Metro","Metro","601 TAS Metro - Hobart","Metro","A Metro",1,null,7481,2.6,null,null,null,"Metro",86.666666666666671,null,3,3,3,3,1,3,3,null,null,null,null,null,7005]
[7005,"A","Metro","Metro","601 TAS Metro - Hobart","Metro","A Metro",1,null,13305,3.1,null,null,null,"Metro",93.333333333333329,null,3,3,3,3,2,3,3,null,null,null,null,null,7007]
[7007,"A","Metro","Metro","601 TAS Metro - Hobart","Metro","A Metro",1,null,3066,4,null,null,null,"Metro",80,null,3,3,3,3,0,3,3,null,null,null,null,null,7008]
[7008,"A","Metro","Metro","601 TAS Metro - Hobart","Metro","A Metro",1,null,11981,3.7,null,null,null,"Metro",93.333333333333329,null,3,3,3,3,2,3,3,null,null,null,null,null,7009]
[7009,"A","Metro","Metro","601 TAS Metro - Hobart","Metro","A Metro",1,null,12453,5.3,null,null,null,"Metro",93.333333333333329,null,3,3,3,3,2,3,3,null,null,null,null,null,7010]
[7010,"A","Metro","Metro","601 TAS Metro - Hobart","Metro","A Metro",1,null,16842,7.6,null,null,null,"Metro",93.333333333333329,null,3,3,3,3,2,3,3,null,null,null,null,null,7011]
[7011,"A","Metro","Metro","601 TAS Metro - Hobart","Metro","A Metro",1,null,14696,12.2,null,null,null,"Metro",93.333333333333329,null,3,3,3,3,2,3,3,null,null,null,null,null,7012]
[7012,"A","Other","Metro","601 TAS Metro - Hobart","Metro","E Pop > 500",1,null,838,12.4,null,null,null,"Non Metro",60.000000000000007,null,3,3,0,3,0,3,3,null,null,null,null,null,7015]
[7015,"A","Metro","Metro","601 TAS Metro - Hobart","Metro","A Metro",1,null,10332,4.9000000000000004,null,null,null,"Metro",93.333333333333329,null,3,3,3,3,2,3,3,null,null,null,null,null,7016]
[7016,"A","Other","Metro","601 TAS Metro - Hobart","Metro","D Pop > 2,000",1,null,2872,8,null,null,null,"Non Metro",66.666666666666657,null,3,3,1,3,0,3,3,null,null,null,null,null,7017]
[7017,"A","Other","Metro","601 TAS Metro - Hobart","Metro","D Pop > 2,000",1,null,5614,13.4,null,null,null,"Metro",73.333333333333329,null,3,3,1,3,1,3,3,null,null,null,null,null,7018]
[7018,"A","Metro","Metro","601 TAS Metro - Hobart","Metro","A Metro",1,null,21027,5.8,null,null,null,"Metro",93.333333333333329,null,3,3,3,3,2,3,3,null,null,null,null,null,7019]
[7019,"A","Regional","Metro","601 TAS Metro - Hobart","Metro","B Regional",1,null,6107,9.6999999999999993,null,null,null,"Metro",80,null,3,3,2,3,1,3,3,null,null,null,null,null,7020]
[7020,"A","Other","Metro","601 TAS Metro - Hobart","Metro","D Pop > 2,000",null,null,2472,17,null,null,null,"Regional",46.666666666666664,null,3,3,1,0,0,3,3,null,null,null,null,null,7021]
[7021,"A","Regional","Metro","601 TAS Metro - Hobart","Metro","B Regional",1,null,2411,13.4,null,null,null,"Metro",73.333333333333329,null,3,3,2,3,0,3,3,null,null,null,null,null,7022]
[7022,"A","Regional","Metro","601 TAS Metro - Hobart","Metro","B Regional",null,null,880,17.600000000000001,null,null,null,"Regional",53.333333333333336,null,3,3,2,0,0,3,3,null,null,null,null,null,7023]
[7023,"A","Other","Metro","601 TAS Metro - Hobart","Metro","F Pop <= 500",null,null,329,0,null,null,null,"Refer to Distribution Partner",30,null,3,3,0,0,0,0,3,null,null,null,null,null,7024]
[7024,"A","Other","Metro","601 TAS Metro - Hobart","Metro","F Pop <= 500",null,null,526,0,null,null,null,"Refer to Distribution Partner",30,null,3,3,0,0,0,0,3,null,null,null,null,null,7025]
[7025,"A","Metro","Metro","601 TAS Metro - Hobart","Metro","A Metro",2,null,1697,17.399999999999999,null,null,null,"Metro",73.333333333333343,null,3,3,3,2,0,3,3,null,null,null,null,null,7026]
[7026,"A","Other","Metro","603 TAS Rural - South East","Metro","E Pop > 500",null,null,934,26.1,null,null,null,"Refer to Distribution Partner",35,null,2,3,0,0,0,2,3,null,null,null,null,null,7027]
[7027,"A","Other","Metro","603 TAS Rural - South East","Metro","F Pop <= 500",null,null,294,0,null,null,null,"Refer to Distribution Partner",28.333333333333332,null,2,3,0,0,0,0,3,null,null,null,null,null,7030]
[7030,"A","Regional","Metro","601 TAS Metro - Hobart","Metro","B Regional",3,null,17404,33.6,null,null,null,"Non Metro",70,null,3,3,2,1,2,2,3,null,null,null,null,null,7050]
[7050,"A","Regional","Metro","601 TAS Metro - Hobart","Metro","B Regional",1,null,12405,11.1,null,null,null,"Metro",86.666666666666657,null,3,3,2,3,2,3,3,null,null,null,null,null,7052]
[7052,"A","Regional","Metro","601 TAS Metro - Hobart","Metro","B Regional",1,null,7145,13.5,null,null,null,"Metro",80,null,3,3,2,3,1,3,3,null,null,null,null,null,7053]
[7053,"A","Metro","Metro","601 TAS Metro - Hobart","Metro","A Metro",1,null,3574,7.5,null,null,null,"Metro",80,null,3,3,3,3,0,3,3,null,null,null,null,null,7054]
[7054,"A","Metro","Metro","601 TAS Metro - Hobart","Metro","A Metro",1,null,8745,18.399999999999999,null,null,null,"Metro",86.666666666666671,null,3,3,3,3,1,3,3,null,null,null,null,null,7055]
[7055,"A","Metro","Metro","601 TAS Metro - Hobart","Metro","A Metro",1,null,428,0,null,null,null,"Non Metro",70,null,3,3,3,3,0,0,3,null,null,null,null,null,7109]
[7109,"A","Other","Metro","603 TAS Rural - South East","Metro","C Pop > 7,000",null,null,8808,32.9,null,null,null,"Regional",48.333333333333329,null,2,3,1,0,1,2,3,null,null,null,null,null,7112]
[7112,"A","Other","Metro","603 TAS Rural - South East","Metro","D Pop > 2,000",null,null,3066,39.9,null,null,null,"Refer to Distribution Partner",41.666666666666664,null,2,3,1,0,0,2,3,null,null,null,null,null,7113]
[7113,"A","Other","Metro","603 TAS Rural - South East","Metro","E Pop > 500",null,null,1094,35.1,null,null,null,"Refer to Distribution Partner",35,null,2,3,0,0,0,2,3,null,null,null,null,null,7116]
[7116,"A","Other","Metro","603 TAS Rural - South East","Metro","D Pop > 2,000",null,null,2253,44.9,null,null,null,"Refer to Distribution Partner",41.666666666666664,null,2,3,1,0,0,2,3,null,null,null,null,null,7117]
[7117,"A","Other","Metro","603 TAS Rural - South East","Metro","E Pop > 500",null,null,854,54.8,null,null,null,"Refer to Distribution Partner",31.666666666666664,null,2,3,0,0,0,1,3,null,null,null,null,null,7119]
[7119,"A","Other","Metro","603 TAS Rural - South East","Metro","F Pop <= 500",null,null,41,0,null,null,null,"Refer to Distribution Partner",28.333333333333332,null,2,3,0,0,0,0,3,null,null,null,null,null,7120]
[7120,"A","Other","Metro","603 TAS Rural - South East","Metro","D Pop > 2,000",null,null,1826,61.7,null,null,null,"Refer to Distribution Partner",38.333333333333329,null,2,3,1,0,0,1,3,null,null,null,null,null,7140]
[7140,"A","Other","Metro","601 TAS Metro - Hobart","Metro","C Pop > 7,000",null,null,10974,37.6,null,null,null,"Non Metro",56.666666666666664,null,3,3,1,0,2,2,3,null,null,null,null,null,7150]
[7150,"A","Other","Metro","603 TAS Rural - South East","Metro","D Pop > 2,000",null,null,2837,36.6,null,null,null,"Refer to Distribution Partner",41.666666666666664,null,2,3,1,0,0,2,3,null,null,null,null,null,7155]
[7155,"A","Other","Metro","603 TAS Rural - South East","Metro","E Pop > 500",null,null,803,28.1,null,null,null,"Refer to Distribution Partner",35,null,2,3,0,0,0,2,3,null,null,null,null,null,7162]
[7162,"A","Other","Metro","603 TAS Rural - South East","Metro","E Pop > 500",null,null,594,0,null,null,null,"Refer to Distribution Partner",28.333333333333332,null,2,3,0,0,0,0,3,null,null,null,null,null,7163]
[7163,"A","Other","Metro","603 TAS Rural - South East","Metro","F Pop <= 500",null,null,330,0,null,null,null,"Refer to Distribution Partner",28.333333333333332,null,2,3,0,0,0,0,3,null,null,null,null,null,7170]
[7170,"A","Metro","Metro","601 TAS Metro - Hobart","Metro","A Metro",1,null,5008,12.4,null,null,null,"Metro",86.666666666666671,null,3,3,3,3,1,3,3,null,null,null,null,null,7171]
[7171,"A","Regional","Metro","601 TAS Metro - Hobart","Metro","B Regional",1,null,3283,18.899999999999999,null,null,null,"Metro",73.333333333333329,null,3,3,2,3,0,3,3,null,null,null,null,null,7172]
[7172,"A","Regional","Metro","601 TAS Metro - Hobart","Metro","B Regional",1,null,3650,23,null,null,null,"Metro",73.333333333333329,null,3,3,2,3,0,3,3,null,null,null,null,null,7173]
[7173,"A","Regional","Metro","601 TAS Metro - Hobart","Metro","B Regional",2,null,6595,25.3,null,null,null,"Non Metro",70,null,3,3,2,2,1,2,3,null,null,null,null,null,7174]
[7174,"A","Other","Metro","601 TAS Metro - Hobart","Metro","F Pop <= 500",null,null,183,0,null,null,null,"Refer to Distribution Partner",30,null,3,3,0,0,0,0,3,null,null,null,null,null,7175]
[7175,"A","Other","Metro","601 TAS Metro - Hobart","Metro","F Pop <= 500",null,null,199,0,null,null,null,"Refer to Distribution Partner",30,null,3,3,0,0,0,0,3,null,null,null,null,null,7176]
[7176,"A","Other","Metro","601 TAS Metro - Hobart","Metro","F Pop <= 500",null,null,164,0,null,null,null,"Refer to Distribution Partner",30,null,3,3,0,0,0,0,3,null,null,null,null,null,7177]
[7177,"A","Other","Metro","601 TAS Metro - Hobart","Metro","F Pop <= 500",null,null,406,0,null,null,null,"Refer to Distribution Partner",30,null,3,3,0,0,0,0,3,null,null,null,null,null,7178]
[7178,"A","Other","Metro","603 TAS Rural - South East","Metro","F Pop <= 500",null,null,309,42.9,null,null,null,"Refer to Distribution Partner",35,null,2,3,0,0,0,2,3,null,null,null,null,null,7179]
[7179,"A","Other","Metro","603 TAS Rural - South East","Metro","F Pop <= 500",null,null,385,49.9,null,null,null,"Refer to Distribution Partner",35,null,2,3,0,0,0,2,3,null,null,null,null,null,7180]
[7180,"A","Other","Metro","603 TAS Rural - South East","Metro","F Pop <= 500",null,null,156,0,null,null,null,"Refer to Distribution Partner",28.333333333333332,null,2,3,0,0,0,0,3,null,null,null,null,null,7182]
[7182,"A","Other","Metro","603 TAS Rural - South East","Metro","F Pop <= 500",null,null,264,0,null,null,null,"Refer to Distribution Partner",28.333333333333332,null,2,3,0,0,0,0,3,null,null,null,null,null,7183]
[7183,"A","Other","Metro","603 TAS Rural - South East","Metro","F Pop <= 500",null,null,45,0,null,null,null,"Refer to Distribution Partner",28.333333333333332,null,2,3,0,0,0,0,3,null,null,null,null,null,7184]
[7184,"A","Other","Metro","603 TAS Rural - South East","Metro","E Pop > 500",null,null,798,40.700000000000003,null,null,null,"Refer to Distribution Partner",35,null,2,3,0,0,0,2,3,null,null,null,null,null,7185]
[7185,"A","Other","Metro","603 TAS Rural - South East","Metro","F Pop <= 500",null,null,99,0,null,null,null,"Refer to Distribution Partner",28.333333333333332,null,2,3,0,0,0,0,3,null,null,null,null,null,7186]
[7186,"A","Other","Metro","603 TAS Rural - South East","Metro","F Pop <= 500",null,null,171,32.299999999999997,null,null,null,{"$f":"IF(ISBLANK(N2588),IF(AND(H2588<>\"\",IF(I2588=\"High Density\",\"High Density\",IF(AND(P2588<=45,P2588>0),\"Refer to Distribution Partner\",IF(AND(P2588<=55,P2588>45),\"Regional\",IF(AND(P2588>55,P2588<=70),\"Non Metro\",IF(F2588=\"Nonmetro\",\"Non Metro\",IF(P2588>70,\"Metro\",\"\"))))))=\"Refer to Distribution Partner\"),\"Regional\",IF(I2588=\"High Density\",\"High Density\",IF(AND(P2588<=45,P2588>0),\"Refer to Distribution Partner\",IF(AND(P2588<=55,P2588>45),\"Regional\",IF(AND(P2588>55,P2588<=70),\"Non Metro\",IF(F2588=\"Nonmetro\",\"Non Metro\",IF(P2588>70,\"Metro\",\"\"))))))),N2588)","v":"Refer to Distribution Partner"},{"$f":"(R2588/$AB$3*$AA$3+S2588/$AB$4*$AA$4+T2588/$AB$5*$AA$5+U2588/$AB$6*$AA$6+V2588/$AB$7*$AA$7+W2588/$AB$8*$AA$8+X2588/$AB$9*$AA$9)*100","v":35},null,{"$f":"IF(ISNUMBER(SEARCH(\"Metro\",E2588)),3,IF(ISNUMBER(SEARCH(\"Rural\",E2588)),2,1))","v":2},{"$f":"IF(ISNUMBER(FIND(\"Metro\",F2588)),3,IF(ISNUMBER(FIND(\"Nonmetro\",F2588)),2,3))","v":3},{"$f":"IF(G2588=\"A Metro\",3,IF(G2588=\"B Regional\",2,IF(G2588=\"C Pop > 7,000\",1,IF(G2588=\"D Pop > 2,000\",1,0))))","v":0},{"$f":"IF(H2588=1,3,IF(H2588=2,2,IF(H2588=3,1,0)))","v":0},{"$f":"IF(J2588>=100000,3,IF(AND(J2588>=10000,J2588<100000),2,IF(AND(J2588>=5000,J2588<10000),1,0)))","v":0},{"$f":"IF(AND(K2588>=0.1,K2588<25),3,IF(AND(K2588>=25,K2588<50),2,IF(AND(K2588>=50,K2588<150),1,0)))","v":2},{"$f":"IF(L2588=\"\",3,0)","v":3},null,null,null,null,null,7187]
[7187,"A","Other","Metro","603 TAS Rural - South East","Metro","F Pop <= 500",null,null,134,0,null,null,null,"Refer to Distribution Partner",28.333333333333332,null,2,3,0,0,0,0,3,null,null,null,null,null,7190]
[7190,"A","Regional","Metro","603 TAS Rural - South East","Metro","B Regional",null,null,3110,69,null,null,null,"Refer to Distribution Partner",45,null,2,3,2,0,0,1,3,null,null,null,null,null,7209]
[7209,"A","Other","Regional","602 TAS Rural - Launceston","Nonmetro","F Pop <= 500",null,null,401,0,null,null,null,"Refer to Distribution Partner",21.666666666666668,null,2,2,0,0,0,0,3,null,null,null,null,null,7210]
[7210,"A","Other","Regional","602 TAS Rural - Launceston","Nonmetro","E Pop > 500",null,null,1040,106.4,null,null,null,"Refer to Distribution Partner",25,null,2,2,0,0,0,1,3,null,null,null,null,null,7211]
[7211,"A","Other","Regional","602 TAS Rural - Launceston","Nonmetro","E Pop > 500",null,null,239,0,null,null,null,"Refer to Distribution Partner",21.666666666666668,null,2,2,0,0,0,0,3,null,null,null,null,null,7212]
[7212,"A","Regional","Regional","602 TAS Rural - Launceston","Nonmetro","B Regional",null,null,1931,146.5,null,null,null,"Refer to Distribution Partner",38.333333333333329,null,2,2,2,0,0,1,3,null,null,null,null,null,7213]
[7213,"A","Other","Regional","602 TAS Rural - Launceston","Nonmetro","F Pop <= 500",null,null,298,132,null,null,null,"Refer to Distribution Partner",25,null,2,2,0,0,0,1,3,null,null,null,null,null,7214]
[7214,"A","Other","Regional","602 TAS Rural - Launceston","Nonmetro","E Pop > 500",null,null,611,151.5,null,null,null,"Refer to Distribution Partner",21.666666666666668,null,2,2,0,0,0,0,3,null,null,null,null,null,7215]
[7215,"A","Other","Regional","602 TAS Rural - Launceston","Nonmetro","D Pop > 2,000",null,null,3381,152.1,null,null,null,"Refer to Distribution Partner",28.333333333333332,null,2,2,1,0,0,0,3,null,null,null,null,null,7216]
[7216,"A","Regional","Regional","602 TAS Rural - Launceston","Nonmetro","B Regional",null,null,3356,191.2,null,null,null,"Refer to Distribution Partner",35,null,2,2,2,0,0,0,3,null,null,null,null,null,7248]
[7248,"A","Metro","Regional","602 TAS Rural - Launceston","Nonmetro","A Metro",1,null,15776,165.9,null,null,null,"Non Metro",75,null,2,2,3,3,2,0,3,null,null,null,null,null,7249]
[7249,"A","Metro","Regional","602 TAS Rural - Launceston","Nonmetro","A Metro",1,null,12774,158.19999999999999,null,null,null,"Non Metro",75,null,2,2,3,3,2,0,3,null,null,null,null,null,7250]
[7250,"A","Metro","Regional","602 TAS Rural - Launceston","Nonmetro","A Metro",1,null,48050,160.6,null,null,null,"Non Metro",75,null,2,2,3,3,2,0,3,null,null,null,null,null,7252]
[7252,"A","Other","Regional","602 TAS Rural - Launceston","Nonmetro","D Pop > 2,000",null,null,2783,190.9,null,null,null,"Refer to Distribution Partner",28.333333333333332,null,2,2,1,0,0,0,3,null,null,null,null,null,7253]
[7253,"A","Other","Regional","602 TAS Rural - Launceston","Nonmetro","D Pop > 2,000",null,null,4925,202.7,null,null,null,"Refer to Distribution Partner",28.333333333333332,null,2,2,1,0,0,0,3,null,null,null,null,null,7254]
[7254,"A","Other","Regional","602 TAS Rural - Launceston","Nonmetro","F Pop <= 500",null,null,487,0,null,null,null,"Refer to Distribution Partner",21.666666666666668,null,2,2,0,0,0,0,3,null,null,null,null,null,7255]
[7255,"A","Other","Regional","602 TAS Rural - Launceston","Nonmetro","E Pop > 500",null,null,833,319.7,null,null,null,"Refer to Distribution Partner",21.666666666666668,null,2,2,0,0,0,0,3,null,null,null,null,null,7256]
[7256,"A","Other","Regional","604 TAS Rural - Burnie & West Coast","Nonmetro","E Pop > 500",null,null,1585,430,null,null,null,"Refer to Distribution Partner",21.666666666666668,null,2,2,0,0,0,0,3,null,null,null,null,null,7257]
[7257,"A","Other","Regional","602 TAS Rural - Launceston","Nonmetro","F Pop <= 500",null,null,66,0,null,null,null,"Refer to Distribution Partner",21.666666666666668,null,2,2,0,0,0,0,3,null,null,null,null,null,7258]
[7258,"A","Regional","Regional","602 TAS Rural - Launceston","Nonmetro","B Regional",1,null,962,154.1,null,null,null,"Regional",55.000000000000007,null,2,2,2,3,0,0,3,null,null,null,null,null,7259]
[7259,"A","Other","Regional","602 TAS Rural - Launceston","Nonmetro","F Pop <= 500",null,null,459,0,null,null,null,"Refer to Distribution Partner",21.666666666666668,null,2,2,0,0,0,0,3,null,null,null,null,null,7260]
[7260,"A","Other","Regional","602 TAS Rural - Launceston","Nonmetro","D Pop > 2,000",null,null,3218,191.7,null,null,null,"Refer to Distribution Partner",28.333333333333332,null,2,2,1,0,0,0,3,null,null,null,null,null,7261]
[7261,"A","Other","Regional","602 TAS Rural - Launceston","Nonmetro","F Pop <= 500",null,null,266,193.7,null,null,null,"Refer to Distribution Partner",21.666666666666668,null,2,2,0,0,0,0,3,null,null,null,null,null,7262]
[7262,"A","Other","Regional","602 TAS Rural - Launceston","Nonmetro","E Pop > 500",null,null,1707,210.3,null,null,null,"Refer to Distribution Partner",21.666666666666668,null,2,2,0,0,0,0,3,null,null,null,null,null,7263]
[7263,"A","Other","Regional","602 TAS Rural - Launceston","Nonmetro","E Pop > 500",null,null,594,0,null,null,null,"Refer to Distribution Partner",21.666666666666668,null,2,2,0,0,0,0,3,null,null,null,null,null,7264]
[7264,"A","Other","Regional","602 TAS Rural - Launceston","Nonmetro","E Pop > 500",null,null,643,214.5,null,null,null,"Refer to Distribution Partner",21.666666666666668,null,2,2,0,0,0,0,3,null,null,null,null,null,7265]
[7265,"A","Other","Regional","602 TAS Rural - Launceston","Nonmetro","F Pop <= 500",null,null,228,0,null,null,null,"Refer to Distribution Partner",21.666666666666668,null,2,2,0,0,0,0,3,null,null,null,null,null,7267]
[7267,"A","Other","Regional","602 TAS Rural - Launceston","Nonmetro","E Pop > 500",null,null,768,0,null,null,null,"Refer to Distribution Partner",21.666666666666668,null,2,2,0,0,0,0,3,null,null,null,null,null,7268]
[7268,"A","Other","Regional","602 TAS Rural - Launceston","Nonmetro","E Pop > 500",null,null,1036,179.2,null,null,null,"Refer to Distribution Partner",21.666666666666668,null,2,2,0,0,0,0,3,null,null,null,null,null,7270]
[7270,"A","Other","Regional","602 TAS Rural - Launceston","Nonmetro","D Pop > 2,000",null,null,4087,197.7,null,null,null,"Refer to Distribution Partner",28.333333333333332,null,2,2,1,0,0,0,3,null,null,null,null,null,7275]
[7275,"A","Other","Regional","602 TAS Rural - Launceston","Nonmetro","D Pop > 2,000",null,null,3138,180.4,null,null,null,"Refer to Distribution Partner",28.333333333333332,null,2,2,1,0,0,0,3,null,null,null,null,null,7276]
[7276,"A","Other","Regional","602 TAS Rural - Launceston","Nonmetro","E Pop > 500",null,null,567,0,null,null,null,"Refer to Distribution Partner",21.666666666666668,null,2,2,0,0,0,0,3,null,null,null,null,null,7277]
[7277,"A","Metro","Regional","602 TAS Rural - Launceston","Nonmetro","A Metro",1,null,5713,171.5,null,null,null,"Non Metro",68.333333333333329,null,2,2,3,3,1,0,3,null,null,null,null,null,7290]
[7290,"A","Metro","Regional","602 TAS Rural - Launceston","Nonmetro","A Metro",1,null,2275,154.69999999999999,null,null,null,"Non Metro",61.666666666666671,null,2,2,3,3,0,0,3,null,null,null,null,null,7291]
[7291,"A","Other","Regional","602 TAS Rural - Launceston","Nonmetro","E Pop > 500",null,null,559,0,null,null,null,"Refer to Distribution Partner",21.666666666666668,null,2,2,0,0,0,0,3,null,null,null,null,null,7292]
[7292,"A","Other","Regional","602 TAS Rural - Launceston","Nonmetro","E Pop > 500",null,null,606,0,null,null,null,"Refer to Distribution Partner",21.666666666666668,null,2,2,0,0,0,0,3,null,null,null,null,null,7300]
[7300,"A","Other","Regional","602 TAS Rural - Launceston","Nonmetro","D Pop > 2,000",1,null,3423,146.6,null,null,null,"Regional",51.666666666666671,null,2,2,1,3,0,1,3,null,null,null,null,null,7301]
[7301,"A","Regional","Regional","602 TAS Rural - Launceston","Nonmetro","B Regional",null,null,4304,143.1,null,null,"Regional","Regional",38.333333333333329,null,2,2,2,0,0,1,3,null,null,null,null,null,7302]
[7302,"A","Other","Regional","602 TAS Rural - Launceston","Nonmetro","E Pop > 500",null,null,1668,134.6,null,null,null,"Refer to Distribution Partner",25,null,2,2,0,0,0,1,3,null,null,null,null,null,7303]
[7303,"A","Other","Regional","602 TAS Rural - Launceston","Nonmetro","D Pop > 2,000",null,null,2712,156.5,null,null,null,"Refer to Distribution Partner",28.333333333333332,null,2,2,1,0,0,0,3,null,null,null,null,null,7304]
[7304,"A","Other","Regional","602 TAS Rural - Launceston","Nonmetro","D Pop > 2,000",null,null,5939,155.5,null,null,null,"Refer to Distribution Partner",35,null,2,2,1,0,1,0,3,null,null,null,null,null,7305]
[7305,"A","Other","Regional","604 TAS Rural - Burnie & West Coast","Nonmetro","E Pop > 500",null,null,1170,186.3,null,null,null,"Refer to Distribution Partner",21.666666666666668,null,2,2,0,0,0,0,3,null,null,null,null,null,7306]
[7306,"A","Other","Regional","604 TAS Rural - Burnie & West Coast","Nonmetro","D Pop > 2,000",null,null,3956,187.7,null,null,null,"Refer to Distribution Partner",28.333333333333332,null,2,2,1,0,0,0,3,null,null,null,null,null,7307]
[7307,"A","Regional","Regional","604 TAS Rural - Burnie & West Coast","Nonmetro","B Regional",2,null,10125,200.4,null,null,null,"Non Metro",61.666666666666671,null,2,2,2,2,2,0,3,null,null,null,null,null,7310]
[7310,"A","Regional","Regional","604 TAS Rural - Burnie & West Coast","Nonmetro","B Regional",2,null,27101,205.9,null,null,null,"Non Metro",61.666666666666671,null,2,2,2,2,2,0,3,null,null,null,null,null,7315]
[7315,"A","Regional","Regional","604 TAS Rural - Burnie & West Coast","Nonmetro","B Regional",2,null,14658,213.6,null,null,null,"Non Metro",61.666666666666671,null,2,2,2,2,2,0,3,null,null,null,null,null,7316]
[7316,"A","Regional","Regional","604 TAS Rural - Burnie & West Coast","Nonmetro","B Regional",3,null,5889,222.6,null,null,null,"Regional",48.333333333333329,null,2,2,2,1,1,0,3,null,null,null,null,null,7320]
[7320,"A","Regional","Regional","604 TAS Rural - Burnie & West Coast","Nonmetro","B Regional",3,null,16238,234.7,null,null,null,"Regional",55.000000000000007,null,2,2,2,1,2,0,3,null,null,null,null,null,7321]
[7321,"A","Other","Regional","604 TAS Rural - Burnie & West Coast","Nonmetro","D Pop > 2,000",null,null,4672,240,"Mining",null,null,"Refer to Distribution Partner",23.333333333333332,null,2,2,1,0,0,0,0,null,null,null,null,null,7322]
[7322,"A","Other","Regional","604 TAS Rural - Burnie & West Coast","Nonmetro","D Pop > 2,000",null,null,3903,239.4,null,null,null,"Refer to Distribution Partner",28.333333333333332,null,2,2,1,0,0,0,3,null,null,null,null,null,7325]
[7325,"A","Other","Regional","604 TAS Rural - Burnie & West Coast","Nonmetro","C Pop > 7,000",3,null,8586,249.1,null,null,null,"Regional",41.666666666666664,null,2,2,1,1,1,0,3,null,null,null,null,null,7330]
[7330,"A","Regional","Regional","604 TAS Rural - Burnie & West Coast","Nonmetro","B Regional",null,null,6592,290.5,null,null,null,"Refer to Distribution Partner",41.666666666666664,null,2,2,2,0,1,0,3,null,null,null,null,null,7331]
[7331,"A","Other","Regional","604 TAS Rural - Burnie & West Coast","Nonmetro","F Pop <= 500",null,null,553,289.89999999999998,"Mining",null,null,"Refer to Distribution Partner",16.666666666666664,null,2,2,0,0,0,0,0,null,null,null,null,null,7466]
[7466,"A","Other","Regional","604 TAS Rural - Burnie & West Coast","Nonmetro","E Pop > 500",null,null,17,0,null,null,null,"Refer to Distribution Partner",21.666666666666668,null,2,2,0,0,0,0,3,null,null,null,null,null,7467]
[7467,"A","Other","Regional","604 TAS Rural - Burnie & West Coast","Nonmetro","E Pop > 500",null,null,1790,170.7,null,null,null,"Refer to Distribution Partner",21.666666666666668,null,2,2,0,0,0,0,3,null,null,null,null,null,7468]
[7468,"A","Other","Regional","604 TAS Rural - Burnie & West Coast","Nonmetro","E Pop > 500",null,null,708,183.1,null,null,null,"Refer to Distribution Partner",21.666666666666668,null,2,2,0,0,0,0,3,null,null,null,null,null,7469]
[7469,"A","Other","Regional","604 TAS Rural - Burnie & West Coast","Nonmetro","E Pop > 500",null,null,768,198.4,"Mining",null,null,"Refer to Distribution Partner",16.666666666666664,null,2,2,0,0,0,0,0,null,null,null,null,null,7470]
[7470,"A","Other","Regional","604 TAS Rural - Burnie & West Coast","Nonmetro","E Pop > 500",null,null,708,192.6,"Mining",null,null,"Refer to Distribution Partner",16.666666666666664,null,2,2,0,0,0,0,0,null,null,null,null,null,"Postcode"]

{"sheet":"Score Guide","index":2,"n_rows":23,"n_cols":12,"rows_kept":23,"cut":false,"hidden":true,"merged":[[8,10,8,11],[17,7,17,8],[8,2,9,2],[8,3,9,3],[8,4,9,4],[8,5,8,7]]}
[1,"Geographic Region","Contain Metro ","Contain Rural ","Unknown"]
[null,null,3,2,1]
[2,"S&P Rating","Metro/inner City","Non Metro "]
[null,null,3,2]
[3,"La Trobe  Risk Location ","A","B","C/D","E/F"]
[null,null,3,2,1,0]
[4,"Origin",1,2,3,"blank "]
[null,null,3,2,1,0]
[5,"Population ABS 2016","Major Cities (100000+)","Large Towns 50000-100000","Medium Towns (10000-50000)","Small towns",null,null,null,null,"Population ABS 2016"]
[null,null,null,null,null,"5000-10000","1000-5000","less than 1000",null,null,0,5]
[null,null,3,2,2,1,0,0,null,null,1000,822]
[6,"Distance from PO",25,"25-50","50 - 150","other or 0",null,null,null,null,5000,671]
[null,null,3,2,1,0,null,null,null,null,10000,334]
[7,"Mining","Empty","Mining ",null,null,null,null,null,null,50000,767]
[null,null,3,0,null,null,null,null,null,null,100000,42]
[null,null,null,null,null,null,null,null,null,null,150000,3]
[]
[null,null,null,null,null,null,null,"Distance from PO"]
[null,null,null,null,null,null,null,0,536]
[null,null,null,null,null,null,null,25,627]
[null,null,null,null,null,null,null,50,262]
[null,null,null,null,null,null,null,150,456]
[null,null,null,null,null,null,null,"Other",763]

{"sheet":"Quick Reference Guide","index":3,"n_rows":123,"n_cols":9,"rows_kept":123,"cut":false,"hidden":false,"merged":[[112,0,119,1],[64,0,83,1],[84,0,95,1],[96,0,106,1],[107,0,111,1],[29,0,57,1],[108,7,108,8],[109,5,109,6],[58,0,63,1],[58,2,63,2],[58,5,63,6],[109,7,109,8],[107,2,111,2],[107,7,107,8],[108,5,108,6],[3,2,4,2],[3,3,4,4],[3,5,4,6],[3,7,4,8],[5,0,28,1]]}
[]
["Postcode Quick Reference Guide"]
[]
[null,null,"High Density ","Metro",null,"Non Metro",null,"Regional"]
[]
["New South Wales"]
[null,null,null,null,null,2006,"2477-2481"]
[null,null,null,null,null,"2250-2251","2483-2490",2326,2555]
[null,null,null,null,null,"2256-2265",2500,"2334-2335","2578-2579"]
[null,null,null,"2007-2011","2190-2200",2267,2502,2360,"2582-2583"]
[null,null,null,"2015-2016","2203-2214",2278,"2505-2506",2380,2594]
[null,null,null,"2018-2050","2216-2234","2280-2287",2508,2400,2628]
[null,null,null,"2060-2077","2558-2560","2289-2300","2515-2519",2427,2630]
[null,null,null,"2079-2090","2564-2567","2302-2308","2525-2530",2429,"2642-2643"]
[null,null,null,"2092-2097","2570-2574","2315-2325","2533-2535",2431,2647]
[null,null,2000,"2099-2108","2619-2621",2327,"2539-2541",2440,2651]
[null,null,2017,"2110-2122",2745,2330,"2556-2557",2443,2710]
[null,null,2127,"2125-2126","2747-2750",2333,2563,2445,2720]
[null,null,2150,2128,"2752-2754",2340,"2568-2569","2447-2448",2731]
[null,null,2155,"2130-2138","2756-2763",2350,"2575-2577","2454-2455","2738-2739"]
[null,null,null,"2140-2148","2765-2770",2428,2580,"2463-2464",2775]
[null,null,null,"2151-2154","2773-2774",2430,2618,2466,2790]
[null,null,null,"2156-2168","2776-2780",2444,"2640-2641",2470,2794]
[null,null,null,"2170-2179","2782-2785",2446,2650,2482,2850]
[null,null,null,null,null,2450,2680,"2536-2538",2870]
[null,null,null,null,null,2452,2795,2546,2880]
[null,null,null,null,null,2456,2800,"2548-2551"]
[null,null,null,null,null,2460,2830]
[]
["Victoria"]
[null,null,null,null,null,null,null,3221,3658]
[null,null,null,"3012-3013","3212-3216",null,null,"3230-3231",3660]
[null,null,null,"3015-3016",3335,null,null,3234,3672]
[null,null,null,"3018-3025","3337-3338",3026,3755,"3249-3250",3677]
[null,null,null,"3027-3034",3340,3045,3757,3300,3691]
[null,null,null,"3036-3044",3429,3086,3759,3305,3722]
[null,null,null,"3046-3068",3437,3211,3761,3331,3730]
[null,null,3000,"3070-3076",3752,"3217-3220",3764,3341,3758]
[null,null,3002,"3078-3079",3754,"3222-3228",3770,3351,3797]
[null,null,3003,"3081-3085",3756,"3232-3233",3775,3357,3799]
[null,null,3004,"3087-3091","3765-3767",3280,3782,"3363-3364","3814-3816"]
[null,null,3005,"3093-3097",3777,3350,3785,3377,3818]
[null,null,3006,3099,3781,3352,3789,3400,"3823-3824"]
[null,null,3008,"3101-3109",3783,"3355-3356",3812,3427,3842]
[null,null,3010,3111,"3786-3788",3431,3820,"3434-3435",3850]
[null,null,3011,"3113-3116","3791-3793",3438,3825,3440,3875]
[null,null,3122,3121,"3795-3796",3500,3840,3442,3880]
[null,null,3128,"3123-3127","3802-3810","3550-3551",3844,3444,3909]
[null,null,3141,"3129-3140",3910,"3555-3556","3911-3912","3450-3451","3915-3916"]
[null,null,3145,"3142-3144",3913,3564,3920,"3460-3461","3918-3919"]
[null,null,null,"3146-3156","3926-3927","3630-3631",3928,3465,3922]
[null,null,null,"3158-3163","3929-3931",3690,3933,3501,3925]
[null,null,null,"3165-3175",3934,"3750-3751",3995,3585,3953]
[null,null,null,"3177-3202","3936-3944",3753,null,3616,"3980-3981"]
[null,null,null,"3204-3207","3975-3978",null,null,3620,3984]
[null,null,null,null,null,null,null,3629,3996]
[null,null,null,null,null,null,null,3636]
[]
["Australian Capital Territory",null,null,null,null,2609]
[null,null,null,"2600-2607",2900]
[null,null,null,"2611-2612","2902-2906"]
[null,null,null,"2614-2615","2911-2914"]
[null,null,null,2617]
[]
["Queensland"]
[null,null,null,null,null,4072,"4572-4573",4029,4710]
[null,null,null,null,null,4111,4575,4183,4737]
[null,null,null,4000,"4151-4161",4207,4655,4270,4751]
[null,null,null,"4005-4014","4163-4165","4209-4221",4670,4311,4753]
[null,null,null,"4017-4022","4169-4174","4223-4229",4680,4341,4800]
[null,null,null,"4030-4032","4178-4179","4271-4272","4700-4701",4343,4802]
[null,null,null,"4034-4037",4205,4280,4703,4356,4805]
[null,null,null,4051,4208,4285,4711,4401,"4807-4808"]
[null,null,null,"4053-4055","4300-4301",4350,4720,4405,4816]
[null,null,null,"4059-4061","4303-4306",4352,4740,4515,"4819-4821"]
[null,null,null,"4064-4070","4500-4508",4370,4750,4554,4823]
[null,null,null,"4073-4078","4510-4512",4509,"4810-4812",4568,4825]
[null,null,null,"4101-4110",4516,4514,"4814-4815",4610,4850]
[null,null,null,"4112-4125","4518-4520",4517,"4817-4818",4615,4860]
[null,null,null,"4127-4133",null,4521,4865,4650,"4880-4881"]
[null,null,null,null,null,"4550-4553","4868-4870",4659,4883]
[null,null,null,null,null,"4555-4567","4877-4879",4702]
[null,null,null,null,null,4570]
[]
["South Australia"]
[null,null,null,5000,"5112-5116",5106,5160,"5201-5204",5360]
[null,null,null,"5006-5025",5118,5111,5211,"5212-5214",5453]
[null,null,null,"5031-5035",5121,5117,"5231-5234",5255,5540]
[null,null,null,"5037-5052","5125-5127",5120,"5240-5245",5280,5554]
[null,null,null,"5061-5070",5136,"5131-5134","5250-5253",5291,5556]
[null,null,null,"5072-5076",5140,"5137-5139",5290,5333,5558]
[null,null,null,"5081-5098","5152-5159","5141-5142",5355,5341,5600]
[null,null,null,"5107-5110","5161-5174",5144,5501,5343,"5606-5609"]
[null,null,null,null,null,"5150-5151",null,5345,5700]
[null,null,null,null,null,null,null,"5350-5354",5719]
[]
["Western Australia"]
[null,null,null,6000,"6107-6112","6032-6033",6181,"6067-6068",6290]
[null,null,null,"6003-6012","6121-6122","6041-6044",6230,6126,6333]
[null,null,null,"6014-6031","6147-6160",6074,"6232-6233",6207,6401]
[null,null,null,"6034-6038","6162-6164","6078-6079","6280-6281","6213-6214",6430]
[null,null,null,"6050-6066","6166-6176","6081-6084",6285,6225,6432]
[null,null,null,"6069-6073",6180,6090,6330,6229,"6713-6714"]
[null,null,null,"6076-6077","6208-6211",6106,6450,6282,6721]
[null,null,null,"6100-6105",null,"6123-6125",6530,6284,6726]
[null,null,null,null,null,6165,6725]
[]
["Northern Territory",null,800]
[null,null,null,810,"828-830","835-836",null,822]
[null,null,null,812,832,870,null,850]
[null,null,null,820]
[]
["Tasmania"]
[null,null,null,7000,7021,7012,"7248-7250",7020,"7300-7301"]
[null,null,null,"7004-7005",7025,7016,7277,7022,7316]
[null,null,null,"7007-7011",7050,7030,7290,7109,7320]
[null,null,null,7015,"7052-7054",7055,7307,7258,7325]
[null,null,null,"7017-7019","7170-7172",7140,7310]
[null,null,null,null,null,7173,7315]
[]
[]
[null,"*Unclassified - refer to distribution partner"]
[null,"*Not Acceptable postcode 3308,4184,6701"]