{"text_format":"1","workbook":"xlsx","n_sheets":4,"sheets":["Post Code Calculator","Post Code data","Score Guide","Quick Reference Guide"],"not_rendered":{"charts":0,"images":1,"macros":1,"external_links":1,"defined_names":6,"comments":0,"pivot_tables":0},"unopened":[],"bounds":{"document_bytes":16777216,"sheet_cells":100000,"rows_first":2000,"rows_last":500,"rows_between":2000,"halvings":0,"cell_chars":16384,"cell_head_chars":4096},"cells_cut":0,"cells_raw":0,"read":"whole","date_system":"1900"}

{"sheet":"Post Code Calculator","index":0,"n_rows":117,"n_cols":22,"rows_kept":117,"cut":false,"hidden":false,"merged":[[2,3,2,4],[1,3,1,4]]}
[null,null,null,null,null,null,null,null,null,null,null,null,null,null," ",{"$f":"IF(B4<=H2,2,IF(AND(B4>H2,B4<=I2),3,IF(AND(B4>I2,B4<=J2),4,IF(AND(B4>J2,B4<=K2),5,IF(AND(B4>K2,B4<=L2),6,IF(AND(B4>L2,B4<=M2),7,\"N/A\"))))))","v":2},null,"Rating","Type","Product"]
["Input Post Code",null,"Funder Rating",{"$f":"IF(OR(B2=3308,B2=4184,B2=6701),\"Not Acceptable Postcode\",IF(_xlfn.XLOOKUP('Post Code Calculator'!B2,'Post Code data'!A:A,'Post Code data'!O:O,\"\",0,1)=\"\",\"\",_xlfn.XLOOKUP('Post Code Calculator'!B2,'Post Code data'!A:A,'Post Code data'!O:O,\"\",0,1)))","v":""},null,null,"Products - Max LVR",0.6,0.7,0.75,0.8,0.9,0.95,"Comments",null,null,null,"High Density","House/Townhouse/Unit","Residential - Owner OCC (metro)","High Density"]
["Select type of security",null,"Geographic Region",{"$f":"IF(OR(B2=3308,B2=4184,B2=6701),\"Not Acceptable Postcode\",IF(_xlfn.XLOOKUP(B2,'Post Code data'!A:A,'Post Code data'!E:E,\"\",0,1)=\"\",\"\",_xlfn.XLOOKUP(B2,'Post Code data'!A:A,'Post Code data'!E:E,\"\",0,1)))","v":""},null,null,"Residential - Owner OCC (metro)",0.6,0.7,0.75,0.8,{"$f":"IF($D$2=\"High Density\",\"N/A\",L66)","v":0.9},{"$f":"IF($D$2=\"High Density\",\"N/A\",M66)","v":"95%"},{"$f":"IF($B$4>80%,\"Approval is subject to LMI\",\"\")","v":""},{"$f":"MAX(IFERROR(_xlfn.NUMBERVALUE(H3:M3),0))","v":0.95},null,null,"High Density","House/Townhouse/Unit","Residential - Investment (metro)","Metro"]
["Requested LVR",null,null,null,null,null,"Residential - Investment (metro)",0.6,0.7,0.75,0.8,{"$f":"IF($D$2=\"High Density\",\"N/A\",L67)","v":0.9},"95%",{"$f":"IF($B$4>80%,\"Approval is subject to LMI\",\"\")","v":""},{"$f":"MAX(IFERROR(_xlfn.NUMBERVALUE(H4:M4),0))","v":0.95},null,null,"High Density","House/Townhouse/Unit","Residential - Non Coded","Non Metro "]
[null,null,null,null,null,null,"Residential - Owner Occ (Non Metro)",0.6,0.7,0.75,0.8,0.9,"95%",{"$f":"IF($B$4>80%,\"Approval is subject to LMI\",\"\")","v":""},{"$f":"MAX(IFERROR(_xlfn.NUMBERVALUE(H5:M5),0))","v":0.95},null,null,"High Density","House/Townhouse/Unit","Residential - Non Conforming Full/Alt Doc","Regional"]
["Available Products","Max LVR","Requested LVR and pricing band","Max Loan Amount within LVR Band","Funder Comments",null,"Residential - Investment (Non Metro) ",0.6,0.7,0.75,0.8,0.9,"95%",{"$f":"IF($B$4>80%,\"Approval is subject to LMI\",\"\")","v":""},{"$f":"MAX(IFERROR(_xlfn.NUMBERVALUE(H6:M6),0))","v":0.95},null,null,"High Density","House/Townhouse/Unit","SMSF - Residential","Refer to Distribution Partner"]
[{"$f":"IF(_xlfn._xlws.SORT(_xlfn.UNIQUE(_xlfn._xlws.FILTER(T:T, (R:R=D2) *(S:S=B3), \"--\")))=0,\"\",_xlfn._xlws.SORT(_xlfn.UNIQUE(_xlfn._xlws.FILTER(T:T, (R:R=D2) *(S:S=B3), \"--\"))))","v":""},{"$f":"IFERROR(VLOOKUP(_xlfn.ANCHORARRAY(A7),G2:O27,9,FALSE),\"\")","v":""},{"$f":"IFERROR(VLOOKUP(_xlfn.ANCHORARRAY(A7),G2:M27,P1,FALSE),\"\")","v":""},{"$f":"IFERROR(VLOOKUP(_xlfn.ANCHORARRAY(A7),G30:M54,P1,FALSE),\"\")","v":""},{"$f":"IFERROR(IF(VLOOKUP(_xlfn.ANCHORARRAY(A7),G2:N27,8,FALSE)=\"\",\"\",VLOOKUP(_xlfn.ANCHORARRAY(A7),G2:N27,8,FALSE)),\"\")","v":""},null,"Residential - Regional Full Doc",0.6,0.7,0.75,0.8,0.9,"N/A",{"$f":"IF(ISNUMBER(SEARCH(\"Apartment\",$B$3)),\"See Credit Help prior to proceeding\",IF($B$4>80%,\"Approval is subject to LMI\",\"\"))","v":""},{"$f":"MAX(IFERROR(_xlfn.NUMBERVALUE(H7:M7),0))","v":0.9},null,null,"High Density","House/Townhouse/Unit","Non Resident"]
[null,null,null,null,null,null,"Residential - Regional Alt Doc",0.6,"N/A","N/A","N/A","N/A","N/A","",{"$f":"MAX(IFERROR(_xlfn.NUMBERVALUE(H8:M8),0))","v":0.6},null,null,"High Density","House/Townhouse/Unit","Ex Pat","House/Townhouse/Unit","Apartments >10 (OTP/New/Existing)"]
[null,null,null,null,null,null,"Residential - Non Coded",0.6,{"$f":"IF(B4<=65%,65%,70%)","v":0.65},0.75,0.8,"N/A","N/A","",{"$f":"MAX(IFERROR(_xlfn.NUMBERVALUE(H9:M9),0))","v":0.8},null,null,"High Density","Apartments >10 (OTP/New/Existing)","Residential - Owner OCC (metro)","Apartments >10 (OTP/New/Existing)","House/Townhouse/Unit"]
[null,null,null,null,null,null,"Residential - Non Conforming Full/Alt Doc",0.6,{"$f":"IF($B$4<=65%,65%,70%)","v":0.65},0.75,0.8,"N/A","N/A","See Credit Help prior to proceeding",{"$f":"MAX(IFERROR(_xlfn.NUMBERVALUE(H10:M10),0))","v":0.8},null,null,"High Density","Apartments >10 (OTP/New/Existing)","Residential - Investment (metro)","Construction","Construction"]
[null,null,null,null,null,null,"Residential - Non Conforming Regional",0.6,"N/A","N/A","N/A","N/A","N/A","See Credit Help prior to proceeding",{"$f":"MAX(IFERROR(_xlfn.NUMBERVALUE(H11:M11),0))","v":0.6},null,null,"High Density","Apartments >10 (OTP/New/Existing)","Residential - Non Conforming Full/Alt Doc","Commercial","Commercial"]
[null,null,null,null,null,null,"SMSF - Residential",0.6,{"$f":"IF($B$4<=65%,65%,70%)","v":0.65},0.75,0.8,"N/A","N/A",null,{"$f":"MAX(IFERROR(_xlfn.NUMBERVALUE(H12:M12),0))","v":0.8},null,null,"High Density","Apartments >10 (OTP/New/Existing)","Residential - Non Coded","Vacant Land","Vacant Land"]
[null,null,null,null,null,null,"SMSF - Residential Regional",0.6,"N/A","N/A","N/A","N/A","N/A",null,{"$f":"MAX(IFERROR(_xlfn.NUMBERVALUE(H13:M13),0))","v":0.6},null,null,"High Density","Apartments >10 (OTP/New/Existing)","SMSF - Residential"]
[null,null,null,null,null,null,"SMSF - Commercial",0.6,{"$f":"IF($B$4<=65%,65%,70%)","v":0.65},0.75,{"$f":"IF(AND($B$4>70%,$B$4<=80%),\"N/A\",\"N/A\")","v":"N/A"},"N/A","N/A",null,{"$f":"MAX(IFERROR(_xlfn.NUMBERVALUE(H14:M14),0))","v":0.75},null,null,"High Density","Apartments >10 (OTP/New/Existing)","Non Resident"]
[null,null,null,null,null,null,"SMSF - Commercial Regional",0.6,"N/A","N/A","N/A","N/A","N/A",null,{"$f":"MAX(IFERROR(_xlfn.NUMBERVALUE(H15:M15),0))","v":0.6},null,null,"High Density","Apartments >10 (OTP/New/Existing)","Ex Pat"]
[null,null,null,null,null,null,"Commercial - Residential",0.6,{"$f":"IF($B$4<=65%,65%,70%)","v":0.65},{"$f":"IF($B$4<=80%,80%,\"N/A\")","v":0.8},0.8,"N/A","N/A","See Credit Help prior to proceeding",{"$f":"MAX(IFERROR(_xlfn.NUMBERVALUE(H16:M16),0))","v":0.8},null,null,"High Density","Construction","Construction - Prime (Owner OCC)"]
[null,null,null,null,null,null,"Commercial - Commercial",0.6,{"$f":"IF($B$4<=65%,65%,70%)","v":0.65},0.75,{"$f":"IF(AND($B$4>70%,$B$4<=80%),\"N/A\",\"N/A\")","v":"N/A"},"N/A","N/A","See Credit Help prior to proceeding",{"$f":"MAX(IFERROR(_xlfn.NUMBERVALUE(H17:M17),0))","v":0.75},null,null,"High Density","Construction","Construction - Prime (Investment)"]
[null,null,null,null,null,null,"Vacant Land",0.5,"N/A","N/A","N/A","N/A","N/A","See Credit Help prior to proceeding",{"$f":"MAX(IFERROR(_xlfn.NUMBERVALUE(H18:M18),0))","v":0.5},null,null,"High Density","Construction","Construction - Alt Doc"]
[null,null,null,null,null,null,"Construction - Prime (Owner OCC)",0.6,0.7,0.75,0.8,0.9,0.95,{"$f":"IF(ISNUMBER(SEARCH(\"Apartment\",$B$3)),\"See Credit Help prior to proceeding\",IF($B$4>80%,\"Approval is subject to LMI\",\"\"))","v":""},{"$f":"MAX(IFERROR(_xlfn.NUMBERVALUE(H19:M19),0))","v":0.95},null,null,"High Density","Construction","Construction - Foreign"]
[null,null,null,null,null,null,"Construction - Prime (Investment)",0.6,0.7,0.75,0.8,0.9,"N/A",{"$f":"IF(ISNUMBER(SEARCH(\"Apartment\",$B$3)),\"See Credit Help prior to proceeding\",IF($B$4>80%,\"Approval is subject to LMI\",\"\"))","v":""},{"$f":"MAX(IFERROR(_xlfn.NUMBERVALUE(H20:M20),0))","v":0.9},null,null,"High Density","Commercial","Commercial - Residential"]
[null,null,null,null,null,null,"Construction - Alt Doc",0.6,0.7,0.75,0.8,"N/A","N/A",{"$f":"IF(ISNUMBER(SEARCH(\"Apartment\",$B$3)),\"See Credit Help prior to proceeding\",IF($B$4>80%,\"Approval is subject to LMI\",\"\"))","v":""},{"$f":"MAX(IFERROR(_xlfn.NUMBERVALUE(H21:M21),0))","v":0.8},null,null,"High Density","Commercial","SMSF - Commercial"]
[null,null,null,null,null,null,"Construction - Foreign",0.6,0.7,0.75,"N/A","N/A","N/A","See Credit Help prior to proceeding",{"$f":"MAX(IFERROR(_xlfn.NUMBERVALUE(H22:M22),0))","v":0.75},null,null,"Metro","House/Townhouse/Unit","Residential - Owner OCC (metro)"]
[null,null,null,null,null,null,"Non Resident",0.6,0.7,0.75,"N/A","N/A","N/A","See Credit Help prior to proceeding",{"$f":"MAX(IFERROR(_xlfn.NUMBERVALUE(H23:M23),0))","v":0.75},null,null,"Metro","House/Townhouse/Unit","Residential - Investment (metro)"]
[null,null,null,null,null,null,"Ex Pat",0.6,0.7,0.75,"N/A","N/A","N/A","See Credit Help prior to proceeding",{"$f":"MAX(IFERROR(_xlfn.NUMBERVALUE(H24:M24),0))","v":0.75},null,null,"Metro","House/Townhouse/Unit","Residential - Non Coded"]
[null,null,null,null,null,null,"Construction - Foreign (Non Metro)","Quote","Quote","Quote","N/A","N/A","N/A","See Credit Help prior to proceeding","Quote",null,null,"Metro","House/Townhouse/Unit","Residential - Non Conforming Full/Alt Doc"]
[null,null,null,null,null,null,"Non Resident (Non Metro)",0.6,0.7,0.75,"N/A","N/A","N/A","See Credit Help prior to proceeding",{"$f":"MAX(IFERROR(_xlfn.NUMBERVALUE(H26:M26),0))","v":0.75},null,null,"Metro","House/Townhouse/Unit","SMSF - Residential"]
[null,null,null,null,null,null,"Ex Pat (Non Metro)",0.6,0.7,0.75,"N/A","N/A","N/A","See Credit Help prior to proceeding",{"$f":"MAX(IFERROR(_xlfn.NUMBERVALUE(H27:M27),0))","v":0.75},null,null,"Metro","House/Townhouse/Unit","Non Resident"]
[null,null,null,null,null,null,null,null,null,null,null,null,null,null,null,null,null,"Metro","House/Townhouse/Unit","Ex Pat"]
[null,null,null,null,null,null,"Products - Max Loan amount",0.6,0.7,0.75,0.8,0.9,0.95,"Comments",null,null,null,"Metro","Apartments >10 (OTP/New/Existing)","Residential - Owner OCC (metro)"]
[null,null,null,null,null,null,"Residential - Owner OCC (metro)",2000000,2000000,1500000,1500000,{"$f":"IF($D$2=\"High Density\",\"N/A\",L93)","v":1000000},{"$f":"IF($D$2=\"High Density\",\"N/A\",M93)","v":500000},{"$f":"IF(ISNUMBER(SEARCH(\"Apartment\",$B$3)),\"See Credit Help prior to proceeding\",IF($B$4>80%,\"Approval is subject to LMI\",\"\"))","v":""},null,null,null,"Metro","Apartments >10 (OTP/New/Existing)","Residential - Investment (metro)"]
{"$rows_left_out":88}
{"sheet":"Post Code data","index":1,"n_rows":2646,"n_cols":30,"rows_kept":2646,"cut":false,"hidden":true,"merged":[]}
["Postcode","Active/Retired","LMI Location","Ratings Location","Geographic Region","S&P Rating","La Trobe Risk Location","Origin rating","Genworth rating","Population ABS 2016","Avg Distance from Post Office","Extra Data","Exposure","BC Overwrite","BC Rating","BC Score Test",null,"Geographic Region","S&P","Latrobe","Origin ","ABS","Distance Po ","Mining",null,null,null,null,null,{"$f":"_xlfn._xlws.SORT(_xlfn._xlws.FILTER(A:A,ISNUMBER(SEARCH('Post Code Calculator'!B2,A:A)),\"not found\"))","v":800}]
[800,"A","Metro","Metro","701 NT  Metro - Darwin","Metro","A Metro",1,"High Density",6464,0.5,null,null,null,{"$f":"IF(ISBLANK(N2),IF(AND(H2<>\"\",IF(I2=\"High Density\",\"High Density\",IF(AND(P2<=45,P2>0),\"Refer to Distribution Partner\",IF(AND(P2<=55,P2>45),\"Regional\",IF(AND(P2>55,P2<=70),\"Non Metro\",IF(F2=\"Nonmetro\",\"Non Metro\",IF(P2>70,\"Metro\",\"\"))))))=\"Refer to Distribution Partner\"),\"Regional\",IF(I2=\"High Density\",\"High Density\",IF(AND(P2<=45,P2>0),\"Refer to Distribution Partner\",IF(AND(P2<=55,P2>45),\"Regional\",IF(AND(P2>55,P2<=70),\"Non Metro\",IF(F2=\"Nonmetro\",\"Non Metro\",IF(P2>70,\"Metro\",\"\"))))))),N2)","v":"High Density"},{"$f":"(R2/$AB$3*$AA$3+S2/$AB$4*$AA$4+T2/$AB$5*$AA$5+U2/$AB$6*$AA$6+V2/$AB$7*$AA$7+W2/$AB$8*$AA$8+X2/$AB$9*$AA$9)*100","v":86.666666666666671},null,{"$f":"IF(ISNUMBER(SEARCH(\"Metro\",E2)),3,IF(ISNUMBER(SEARCH(\"Rural\",E2)),2,1))","v":3},{"$f":"IF(ISNUMBER(FIND(\"Metro\",F2)),3,IF(ISNUMBER(FIND(\"Nonmetro\",F2)),2,3))","v":3},{"$f":"IF(G2=\"A Metro\",3,IF(G2=\"B Regional\",2,IF(G2=\"C Pop > 7,000\",1,IF(G2=\"D Pop > 2,000\",1,0))))","v":3},{"$f":"IF(H2=1,3,IF(H2=2,2,IF(H2=3,1,0)))","v":3},{"$f":"IF(J2>=100000,3,IF(AND(J2>=10000,J2<100000),2,IF(AND(J2>=5000,J2<10000),1,0)))","v":1},{"$f":"IF(AND(K2>=0.1,K2<25),3,IF(AND(K2>=25,K2<50),2,IF(AND(K2>=50,K2<150),1,0)))","v":3},{"$f":"IF(L2=\"\",3,0)","v":3},null,null,null,null,null,810]
[810,"A","Metro","Metro","701 NT  Metro - Darwin","Metro","A Metro",1,null,33302,10.1,null,null,null,"Metro",93.333333333333329,null,3,3,3,3,2,3,3,null,null,0.05,3,null,812]
[812,"A","Metro","Metro","701 NT  Metro - Darwin","Metro","A Metro",1,null,18873,10.5,null,null,null,"Metro",93.333333333333329,null,3,3,3,3,2,3,3,null,null,0.2,3,null,820]
[820,"A","Metro","Metro","701 NT  Metro - Darwin","Metro","A Metro",1,null,19447,3.2,null,null,null,"Metro",93.333333333333329,null,3,3,3,3,2,3,3,null,null,0.2,3,null,822]
[822,"A","Regional","Regional","702 NT  Rural - Outback","Nonmetro","B Regional",null,null,25560,38.1,null,null,null,"Regional",55.000000000000007,null,2,2,2,0,2,2,3,null,null,0.2,3,null,828]
[828,"A","Metro","Metro","701 NT  Metro - Darwin","Metro","A Metro",1,null,1201,11.1,null,null,null,"Metro",80,null,3,3,3,3,0,3,3,null,null,0.2,3,null,829]
[829,"A","Metro","Metro","701 NT  Metro - Darwin","Metro","A Metro",1,null,1839,11.1,null,null,null,"Metro",80,null,3,3,3,3,0,3,3,null,null,0.1,3,null,830]
[830,"A","Metro","Metro","701 NT  Metro - Darwin","Metro","A Metro",1,null,18207,15.4,null,null,null,"Metro",93.333333333333329,null,3,3,3,3,2,3,3,null,null,0.05,3,null,832]
[832,"A","Metro","Metro","701 NT  Metro - Darwin","Metro","A Metro",1,null,15570,17.399999999999999,null,null,null,"Metro",93.333333333333329,null,3,3,3,3,2,3,3,null,null,{"$f":"SUM(AA3:AA9)","v":1},{"$f":"SUM(AB3:AB9)","v":21},null,834]
[834,"A","Regional","Regional","Unknown","Nonmetro","B Regional",null,null,1836,23.1,null,null,null,"Refer to Distribution Partner",43.333333333333329,null,1,2,2,0,0,3,3,null,null,null,null,null,835]
[835,"A","Regional","Regional","701 NT  Metro - Darwin","Nonmetro","B Regional",2,null,5132,23.6,null,null,null,"Non Metro",66.666666666666657,null,3,2,2,2,1,3,3,null,null,null,null,null,836]
[836,"A","Regional","Regional","701 NT  Metro - Darwin","Nonmetro","B Regional",2,null,7756,33,null,null,null,"Non Metro",63.333333333333329,null,3,2,2,2,1,2,3,null,null,null,null,null,837]
[837,"A","Other","Regional","701 NT  Metro - Darwin","Nonmetro","E Pop > 500",null,null,412,33,null,null,null,"Refer to Distribution Partner",30,null,3,2,0,0,0,2,3,null,null,null,null,null,838]
[838,"A","Other","Regional","701 NT  Metro - Darwin","Nonmetro","E Pop > 500",null,null,818,34.700000000000003,null,null,null,"Refer to Distribution Partner",30,null,3,2,0,0,0,2,3,null,null,null,null,null,839]
[839,"A","Other","Regional","Unknown","Nonmetro","F Pop <= 500",null,null,548,61,null,null,null,"Refer to Distribution Partner",23.333333333333332,null,1,2,0,0,0,1,3,null,null,null,null,null,840]
[840,"A","Other","Regional","702 NT  Rural - Outback","Nonmetro","E Pop > 500",null,null,363,61,"Mining",null,null,"Refer to Distribution Partner",20,null,2,2,0,0,0,1,0,null,null,null,null,null,841]
[841,"A","Other","Regional","701 NT  Metro - Darwin","Nonmetro","E Pop > 500",null,null,696,61,null,null,null,"Refer to Distribution Partner",26.666666666666668,null,3,2,0,0,0,1,3,null,null,null,null,null,845]
[845,"A","Other","Regional","702 NT  Rural - Outback","Nonmetro","F Pop <= 500",null,null,507,271.3,"Mining",null,null,"Refer to Distribution Partner",16.666666666666664,null,2,2,0,0,0,0,0,null,null,null,null,null,846]
[846,"A","Other","Regional","702 NT  Rural - Outback","Nonmetro","F Pop <= 500",null,null,353,271.3,null,null,null,"Refer to Distribution Partner",21.666666666666668,null,2,2,0,0,0,0,3,null,null,null,null,null,847]
[847,"A","Other","Regional","702 NT  Rural - Outback","Nonmetro","F Pop <= 500",null,null,358,271.3,"Mining",null,null,"Refer to Distribution Partner",16.666666666666664,null,2,2,0,0,0,0,0,null,null,null,null,null,850]
[850,"A","Other","Regional","702 NT  Rural - Outback","Nonmetro","C Pop > 7,000",3,null,8138,271.3,null,null,null,"Regional",41.666666666666664,null,2,2,1,1,1,0,3,null,null,null,null,null,852]
[852,"A","Other","Regional","702 NT  Rural - Outback","Nonmetro","C Pop > 7,000",null,null,8299,271.3,null,null,null,"Refer to Distribution Partner",35,null,2,2,1,0,1,0,3,null,null,null,null,null,853]
[853,"A","Other","Regional","702 NT  Rural - Outback","Nonmetro","E Pop > 500",null,null,857,271.3,null,null,null,"Refer to Distribution Partner",21.666666666666668,null,2,2,0,0,0,0,3,null,null,null,null,null,854]
[854,"A","Other","Regional","702 NT  Rural - Outback","Nonmetro","E Pop > 500",null,null,871,271.3,"Mining",null,null,"Refer to Distribution Partner",16.666666666666664,null,2,2,0,0,0,0,0,null,null,null,null,null,860]
[860,"A","Other","Regional","702 NT  Rural - Outback","Nonmetro","D Pop > 2,000",null,null,2991,875.8,null,null,null,"Refer to Distribution Partner",28.333333333333332,null,2,2,1,0,0,0,3,null,null,null,null,null,862]
[862,"A","Other","Regional","702 NT  Rural - Outback","Nonmetro","E Pop > 500",null,null,765,875.8,null,null,null,"Refer to Distribution Partner",21.666666666666668,null,2,2,0,0,0,0,3,null,null,null,null,null,870]
[870,"A","Regional","Regional","702 NT  Rural - Outback","Nonmetro","B Regional",2,null,19628,1290.4000000000001,null,null,null,"Non Metro",61.666666666666671,null,2,2,2,2,2,0,3,null,null,null,null,null,872]
[872,"A","Other","Regional","702 NT  Rural - Outback","Nonmetro","C Pop > 7,000",null,null,15469,1290.4000000000001,null,null,null,"Refer to Distribution Partner",41.666666666666671,null,2,2,1,0,2,0,3,null,null,null,null,null,874]
[874,"A","Other","Regional","Unknown","Nonmetro","F Pop <= 500",null,null,553,1290.4000000000001,null,null,null,"Refer to Distribution Partner",20,null,1,2,0,0,0,0,3,null,null,null,null,null,875]
{"$rows_left_out":2617}
{"sheet":"Score Guide","index":2,"n_rows":23,"n_cols":12,"rows_kept":23,"cut":false,"hidden":true,"merged":[[8,10,8,11],[17,7,17,8],[8,2,9,2],[8,3,9,3],[8,4,9,4],[8,5,8,7]]}
[1,"Geographic Region","Contain Metro ","Contain Rural ","Unknown"]
[null,null,3,2,1]
[2,"S&P Rating","Metro/inner City","Non Metro "]
[null,null,3,2]
[3,"La Trobe  Risk Location ","A","B","C/D","E/F"]
[null,null,3,2,1,0]
[4,"Origin",1,2,3,"blank "]
[null,null,3,2,1,0]
[5,"Population ABS 2016","Major Cities (100000+)","Large Towns 50000-100000","Medium Towns (10000-50000)","Small towns",null,null,null,null,"Population ABS 2016"]
[null,null,null,null,null,"5000-10000","1000-5000","less than 1000",null,null,0,5]
[null,null,3,2,2,1,0,0,null,null,1000,822]
[6,"Distance from PO",25,"25-50","50 - 150","other or 0",null,null,null,null,5000,671]
[null,null,3,2,1,0,null,null,null,null,10000,334]
[7,"Mining","Empty","Mining ",null,null,null,null,null,null,50000,767]
[null,null,3,0,null,null,null,null,null,null,100000,42]
[null,null,null,null,null,null,null,null,null,null,150000,3]
[]
[null,null,null,null,null,null,null,"Distance from PO"]
[null,null,null,null,null,null,null,0,536]
[null,null,null,null,null,null,null,25,627]
[null,null,null,null,null,null,null,50,262]
[null,null,null,null,null,null,null,150,456]
[null,null,null,null,null,null,null,"Other",763]

{"sheet":"Quick Reference Guide","index":3,"n_rows":123,"n_cols":9,"rows_kept":123,"cut":false,"hidden":false,"merged":[[112,0,119,1],[64,0,83,1],[84,0,95,1],[96,0,106,1],[107,0,111,1],[29,0,57,1],[108,7,108,8],[109,5,109,6],[58,0,63,1],[58,2,63,2],[58,5,63,6],[109,7,109,8],[107,2,111,2],[107,7,107,8],[108,5,108,6],[3,2,4,2],[3,3,4,4],[3,5,4,6],[3,7,4,8],[5,0,28,1]]}
[]
["Postcode Quick Reference Guide"]
[]
[null,null,"High Density ","Metro",null,"Non Metro",null,"Regional"]
[]
["New South Wales"]
[null,null,null,null,null,2006,"2477-2481"]
[null,null,null,null,null,"2250-2251","2483-2490",2326,2555]
[null,null,null,null,null,"2256-2265",2500,"2334-2335","2578-2579"]
[null,null,null,"2007-2011","2190-2200",2267,2502,2360,"2582-2583"]
[null,null,null,"2015-2016","2203-2214",2278,"2505-2506",2380,2594]
[null,null,null,"2018-2050","2216-2234","2280-2287",2508,2400,2628]
[null,null,null,"2060-2077","2558-2560","2289-2300","2515-2519",2427,2630]
[null,null,null,"2079-2090","2564-2567","2302-2308","2525-2530",2429,"2642-2643"]
[null,null,null,"2092-2097","2570-2574","2315-2325","2533-2535",2431,2647]
[null,null,2000,"2099-2108","2619-2621",2327,"2539-2541",2440,2651]
[null,null,2017,"2110-2122",2745,2330,"2556-2557",2443,2710]
[null,null,2127,"2125-2126","2747-2750",2333,2563,2445,2720]
[null,null,2150,2128,"2752-2754",2340,"2568-2569","2447-2448",2731]
[null,null,2155,"2130-2138","2756-2763",2350,"2575-2577","2454-2455","2738-2739"]
[null,null,null,"2140-2148","2765-2770",2428,2580,"2463-2464",2775]
[null,null,null,"2151-2154","2773-2774",2430,2618,2466,2790]
[null,null,null,"2156-2168","2776-2780",2444,"2640-2641",2470,2794]
[null,null,null,"2170-2179","2782-2785",2446,2650,2482,2850]
[null,null,null,null,null,2450,2680,"2536-2538",2870]
[null,null,null,null,null,2452,2795,2546,2880]
[null,null,null,null,null,2456,2800,"2548-2551"]
[null,null,null,null,null,2460,2830]
[]
["Victoria"]
{"$rows_left_out":93}