{"text_format":"1","workbook":"xlsx","n_sheets":25,"sheets":["logo","Sheet1","Serviceability Calculator","HEM","Change Log","SME Servicing Calculator","SMSF Servicing Calculator","Calculations breakdown","Self Employed Calculator","Self Employed Calculator (SME)","Rental & Gearing","Rental & Gearing (SME)","SME Calculator 2","Year To Date Calc","Lease Doc Serviceability","Sheet2","Marginalisation Calculator","SMSF Refinance Prime","BackEnd","Definitions","Scales Tax","Tax Scales","RepayCalculator","Cost of Living Index","Live Currency Rates"],"not_rendered":{"charts":0,"images":10,"macros":1,"external_links":0,"defined_names":156,"comments":2,"pivot_tables":0},"unopened":[],"bounds":{"document_bytes":16777216,"sheet_cells":100000,"rows_first":2000,"rows_last":500,"rows_between":2000,"halvings":0,"cell_chars":16384,"cell_head_chars":4096},"cells_cut":0,"cells_raw":0,"read":"whole","date_system":"1900"}

{"sheet":"logo","index":0,"n_rows":0,"n_cols":0,"rows_kept":0,"cut":false,"hidden":true,"merged":[]}

{"sheet":"Sheet1","index":1,"n_rows":0,"n_cols":0,"rows_kept":0,"cut":false,"hidden":true,"merged":[]}

{"sheet":"Serviceability Calculator","index":2,"n_rows":112,"n_cols":23,"rows_kept":112,"cut":false,"hidden":false,"merged":[[70,2,70,6],[67,17,70,18],[19,17,31,18],[55,17,57,18],[61,17,62,18],[63,17,64,18],[65,17,66,18],[110,2,110,5],[111,2,111,5],[50,2,50,5],[51,2,51,5],[92,2,92,5],[93,2,93,5],[96,2,96,5],[108,2,109,6],[100,2,100,5],[99,2,99,5],[106,2,106,5],[102,2,102,5],[71,2,71,5],[72,2,72,5],[73,2,73,5],[75,2,75,5]]}
[]
[null,null,"Servicing Calculator V2.43",null,null,null,"For 5 to 10 loans ",null,null,null,null,null,null,null,null,null,null,null,null,null,null,"Date:"]
[null,null,{"$f":"TODAY()","v":"2025-12-04"}]
[null,null,"New Loan Commitment(s)","Loan 1","Loan 2","Loan 3","Loan 4","Loan 5","Loan 6","Loan 7","Loan 8","Loan 9","Loan 10"]
[null,null,"Application No"]
[null,null,"Repayment Type",{"$f":"IF(D8=0,\"\",IF(D8>D9,\"Principal & Interest\",\"Interest Only\"))","v":""},"","","","","","","","",""]
{"$rows_left_out":107}
{"sheet":"HEM","index":3,"n_rows":99,"n_cols":16,"rows_kept":99,"cut":false,"hidden":true,"merged":[]}
[]
[]
[]
[null,null,null,"\"HEM Table 1\" equivalent: by Income Level and Residency"]
[null,null,null,null,null,"BASED ON PREDICTED VALUES FROM THE QUANTILE REGRESSIONS",null,null,null,null,null,null,null,null,null,"2025Q3"]
[null,null,null,null,null,null,null,"Smoothed HEM"]
{"$rows_left_out":94}
{"sheet":"Change Log","index":4,"n_rows":37,"n_cols":3,"rows_kept":37,"cut":false,"hidden":true,"merged":[[0,0,0,2]]}
["Change Log"]
["Calculator","Date","Change"]
["Serviceability Calculator","2021-09-06","Assessment rate amended floor - 5.29%\nAssessment rate amended buffer - 2.50%"]
["Lease Doc Calculator","2021-06-06","Added with 1.75 times ICR required"]
["Serviceability Calculator","2021-10-11","NDI ratio > 1.00 pass (was 1.01)"]
["Serviceability Calculator","2022-06-06","Add Genworth DTI®\nChange to show both code and non-coded result\nupdate HEM table Q1 2022\nAssessment rate buffer change to -3.00% (Coded)\nMove Insurance to standard living expense to compare with HEM\n"]
{"$rows_left_out":32}
{"sheet":"SME Servicing Calculator","index":5,"n_rows":111,"n_cols":16,"rows_kept":111,"cut":false,"hidden":false,"merged":[[100,2,100,5],[102,2,102,5],[106,2,106,5],[108,2,109,6],[110,2,110,5],[99,2,99,5],[63,10,64,11],[65,10,66,11],[67,10,70,11],[70,2,70,6],[71,2,71,5],[72,2,72,5],[73,2,73,5],[75,2,75,5],[92,2,92,5],[93,2,93,5],[96,2,96,5],[61,10,62,11],[1,5,1,6],[19,10,31,11],[50,2,50,5],[51,2,51,5],[55,10,57,11]]}
[]
[null,null,"SME Servicing Calculator V2.43",null,null,null,null,null,null,null,null,null,null,null,"Date:"]
[]
[null,null,"New Loan Commitment(s)","Loan 1","Loan 2","Loan 3"]
[null,null,"Application No"]
[null,null,"Repayment Type",{"$f":"IF(D8=0,\"\",IF(D8>D9,\"Principal & Interest\",\"Interest Only\"))","v":""},{"$f":"IF(E8=0,\"\",IF(E8>E9,\"Principal & Interest\",\"Interest Only\"))","v":""},{"$f":"IF(F8=0,\"\",IF(F8>F9,\"Principal & Interest\",\"Interest Only\"))","v":""}]
{"$rows_left_out":106}
{"sheet":"SMSF Servicing Calculator","index":6,"n_rows":122,"n_cols":15,"rows_kept":122,"cut":false,"hidden":false,"merged":[[42,4,42,5],[43,4,43,5],[10,4,10,6],[12,4,12,5],[14,4,14,5],[15,4,15,5],[16,4,16,5],[29,4,29,5],[30,4,30,5],[20,4,20,6],[21,4,21,5],[22,4,22,5],[23,4,23,5],[24,4,24,5],[5,4,5,5],[121,4,121,5],[100,13,100,14],[2,5,2,6],[38,4,38,5],[33,4,33,5],[36,4,36,5],[11,4,11,5],[4,3,4,6],[6,4,6,5],[7,4,7,5],[8,4,8,5],[13,4,13,5],[28,4,28,5],[26,4,26,6],[27,4,27,5]]}
[]
[]
[null,null,"SMSF Servicing Calculator V2.43",null,null,{"$f":"TODAY()","v":"2025-12-04"}]
[null,null,"Application Details"]
[null,null,"Applicant / SMSF Name","Enter Name Here"]
[null,null,"Loan Value",null,"Loan Term"]
{"$rows_left_out":117}
{"sheet":"Calculations breakdown","index":7,"n_rows":29,"n_cols":6,"rows_kept":29,"cut":false,"hidden":true,"merged":[[25,3,25,4],[26,3,26,4],[27,3,27,4],[24,3,24,4]]}
[]
[null,null,"Annual","Monthly","Assessed %"]
[null,"Mandatory contributions",{"$f":"SUM('SMSF Servicing Calculator'!D12*E3)","v":0},{"$f":"C3/12","v":0},1]
[null,"Other income ",{"$f":"SUM('SMSF Servicing Calculator'!D17*E4)","v":0},{"$f":"C4/12","v":0},0.8]
[null,"Rental income",{"$f":"SUM('SMSF Servicing Calculator'!D14*E5)","v":0},{"$f":"C5/12","v":0},0.8]
[null,"Total gross income",{"$f":"SUM(C3:C5)","v":0},{"$f":"C6/12","v":0}]
{"$rows_left_out":24}
{"sheet":"Self Employed Calculator","index":8,"n_rows":98,"n_cols":49,"rows_kept":98,"cut":false,"hidden":true,"merged":[[57,7,57,10],[59,7,59,10],[60,2,60,3],[27,7,27,10],[28,2,28,3],[39,7,39,10],[42,7,53,10],[41,7,41,10],[2,1,2,2],[3,3,3,5],[7,7,7,10],[25,7,25,10],[9,7,9,10],[10,7,21,10]]}
[]
[]
[]
[null,null,"Self employed worksheet"]
[null,null,"Self employed - Business 1"]
[]
{"$rows_left_out":93}
{"sheet":"Self Employed Calculator (SME)","index":9,"n_rows":98,"n_cols":49,"rows_kept":98,"cut":false,"hidden":true,"merged":[[25,7,25,10],[2,1,2,2],[3,3,3,5],[7,7,7,10],[9,7,9,10],[10,7,21,10],[59,7,59,10],[60,2,60,3],[27,7,27,10],[28,2,28,3],[39,7,39,10],[41,7,41,10],[42,7,53,10],[57,7,57,10]]}
[]
[]
[]
[null,null,"Self employed worksheet"]
[null,null,"Self employed - Business 1"]
[]
{"$rows_left_out":93}
{"sheet":"Rental & Gearing","index":10,"n_rows":34,"n_cols":29,"rows_kept":34,"cut":false,"hidden":true,"merged":[[26,5,26,7],[30,17,32,19],[31,5,31,7],[32,5,32,7],[33,5,33,7],[27,5,27,7],[28,5,28,7],[29,5,29,7],[29,13,29,16],[30,5,30,7],[30,13,32,16],[21,5,21,7],[22,5,22,7],[23,5,23,7],[24,5,24,7],[25,5,25,7],[16,5,16,7],[17,5,17,7],[18,5,18,7],[19,5,19,7],[20,5,20,7],[11,5,11,7],[12,5,12,7],[13,5,13,7],[14,5,14,7],[15,5,15,7],[6,5,6,7],[7,5,7,7],[8,5,8,7],[9,5,9,7],[10,5,10,7],[2,5,2,8],[2,17,2,20],[3,5,3,7],[4,5,4,7],[5,5,5,7]]}
[]
[]
[null,null,null,null,null,"Rental Income",null,null,null,null,null,null,null,null,null,null,null,"Negative Gearing",null,null,null,null,null,null,"Rental"]
[null,null,null,null,null,"Property Address",null,null,"Gross Rental"," Frequency",null,"Annual Rental","Verification","App 1","App 2","App 3","App 4","Amount Owing","Interest Rate","Annual Gearing","App 1","App 2","App 3","App 4","App 1","App 2","App 3","App 4"]
[null,null,null,null,null,null,null,null,0,null,{"$f":"IF(J5=\"Weekly\",52,IF(J5=\"Fortnightly\",26,IF(J5=\"Monthly\",12,IF(J5=\"Quarterly\",4,1))))","v":1},{"$f":"I5*K5","v":0},null,null,null,null,null,0,null,{"$f":"R5*S5","v":0},{"$f":"T5*N5","v":0},{"$f":"T5*O5","v":0},{"$f":"T5*P5","v":0},{"$f":"Q5*T5","v":0},{"$f":"N5*L5","v":0},{"$f":"O5*L5","v":0},{"$f":"P5*L5","v":0},{"$f":"Q5*L5","v":0},{"$f":"IF(M5=\"New NDIS\",1,0)","v":0}]
[null,null,null,null,null,null,null,null,0,null,{"$f":"IF(J6=\"Weekly\",52,IF(J6=\"Fortnightly\",26,IF(J6=\"Monthly\",12,IF(J6=\"Quarterly\",4,1))))","v":1},{"$f":"I6*K6","v":0},null,null,null,null,null,0,null,0,0,0,0,0,0,0,0,0,{"$f":"IF(M6=\"New NDIS\",1,0)","v":0}]
{"$rows_left_out":29}
{"sheet":"Rental & Gearing (SME)","index":11,"n_rows":34,"n_cols":29,"rows_kept":34,"cut":false,"hidden":true,"merged":[[6,5,6,7],[2,5,2,8],[2,17,2,20],[3,5,3,7],[4,5,4,7],[5,5,5,7],[18,5,18,7],[7,5,7,7],[8,5,8,7],[9,5,9,7],[10,5,10,7],[11,5,11,7],[12,5,12,7],[13,5,13,7],[14,5,14,7],[15,5,15,7],[16,5,16,7],[17,5,17,7],[29,13,29,16],[19,5,19,7],[20,5,20,7],[21,5,21,7],[22,5,22,7],[23,5,23,7],[24,5,24,7],[25,5,25,7],[26,5,26,7],[27,5,27,7],[28,5,28,7],[29,5,29,7],[30,13,32,16],[30,17,32,19],[31,5,31,7],[32,5,32,7],[33,5,33,7],[30,5,30,7]]}
[]
[]
[null,null,null,null,null,"Rental Income",null,null,null,null,null,null,null,null,null,null,null,"Negative Gearing",null,null,null,null,null,null,"Rental"]
[null,null,null,null,null,"Property Address",null,null,"Gross Rental"," Frequency",null,"Annual Rental","Verification","App 1","App 2","App 3","App 4","Amount Owing","Interest Rate","Annual Gearing","App 1","App 2","App 3","App 4","App 1","App 2","App 3","App 4"]
[null,null,null,null,null,null,null,null,0,null,{"$f":"IF(J5=\"Weekly\",52,IF(J5=\"Fortnightly\",26,IF(J5=\"Monthly\",12,IF(J5=\"Quarterly\",4,1))))","v":1},{"$f":"I5*K5","v":0},null,null,null,null,null,0,null,{"$f":"R5*S5","v":0},{"$f":"T5*N5","v":0},{"$f":"T5*O5","v":0},{"$f":"T5*P5","v":0},{"$f":"Q5*T5","v":0},{"$f":"N5*L5","v":0},{"$f":"O5*L5","v":0},{"$f":"P5*L5","v":0},{"$f":"Q5*L5","v":0},{"$f":"IF(M5=\"New NDIS\",1,0)","v":0}]
[null,null,null,null,null,null,null,null,0,null,{"$f":"IF(J6=\"Weekly\",52,IF(J6=\"Fortnightly\",26,IF(J6=\"Monthly\",12,IF(J6=\"Quarterly\",4,1))))","v":1},{"$f":"I6*K6","v":0},null,null,null,null,null,0,null,0,0,0,0,0,0,0,0,0,{"$f":"IF(M6=\"New NDIS\",1,0)","v":0}]
{"$rows_left_out":29}
{"sheet":"SME Calculator 2","index":12,"n_rows":0,"n_cols":0,"rows_kept":0,"cut":false,"hidden":true,"merged":[]}

{"sheet":"Year To Date Calc","index":13,"n_rows":52,"n_cols":8,"rows_kept":52,"cut":false,"hidden":false,"merged":[[6,2,6,4],[18,2,18,4],[30,2,30,4],[42,2,42,4]]}
[]
[]
[null,"Application Number"]
[]
[null,"PAYG Income Year to Date"]
[null,"Applicant 1"]
{"$rows_left_out":47}
{"sheet":"Lease Doc Serviceability","index":14,"n_rows":24,"n_cols":4,"rows_kept":24,"cut":false,"hidden":false,"merged":[[18,0,18,1],[23,0,23,2],[11,2,11,3],[12,2,12,3],[13,2,13,3],[14,2,14,3],[15,2,15,3],[16,2,16,3],[17,2,17,3],[19,2,19,3],[18,2,18,3],[20,2,20,3],[21,2,21,3],[8,2,8,3],[7,2,7,3],[7,0,7,1],[8,0,8,1],[10,0,10,3]]}
[]
[]
[null,null,"Lease Doc Serviceability "]
[]
[]
[]
{"$rows_left_out":19}
{"sheet":"Sheet2","index":15,"n_rows":0,"n_cols":0,"rows_kept":0,"cut":false,"hidden":true,"merged":[]}

{"sheet":"Marginalisation Calculator","index":16,"n_rows":24,"n_cols":13,"rows_kept":24,"cut":false,"hidden":true,"merged":[[5,4,5,5]]}
[]
[]
[]
[]
[]
[null,null,"Marginalisation Calculator",null,{"$f":"TODAY()","v":"2025-12-04"}]
{"$rows_left_out":19}
{"sheet":"SMSF Refinance Prime","index":17,"n_rows":35,"n_cols":10,"rows_kept":35,"cut":false,"hidden":false,"merged":[[8,1,9,7],[36,1,43,7]]}
[]
[]
[]
[]
[]
[null,"WLTH SMSF Refinance Serviceability",null,null,null,null,"Date:",{"$f":"NOW()","v":"2025-12-04T10:01:12.750"}]
{"$rows_left_out":30}
{"sheet":"BackEnd","index":18,"n_rows":107,"n_cols":17,"rows_kept":107,"cut":false,"hidden":true,"merged":[]}
["Security Type","Repayment Type",null,"Security Type","Min Loan Amount","Max Loan Amount","LVR",null,"Data Test"]
["Residential","Principal & Interest",null,"Residential",150000,1500000,0.7,null,{"$f":"OR('SMSF Refinance Prime'!H13=\"\",'SMSF Refinance Prime'!H14=\"\",'SMSF Refinance Prime'!H15=\"\")","v":true}]
["Commercial","Interest Only",null,"Commercial",150000,2000000,0.7]
[]
[]
[null,"Current User:","Kailun Huang",null,null,null,null,null,null,null,null,null,null,null,null,"Allowed Users To Edit",{"$f":"IF(ISERROR(VLOOKUP(C6,P7:P50,1,0)),\"Not Found!\",VLOOKUP(C6,P7:P50,1,0))","v":"Not Found!"}]
{"$rows_left_out":102}
{"sheet":"Definitions","index":19,"n_rows":48,"n_cols":2,"rows_kept":48,"cut":false,"hidden":true,"merged":[[0,0,0,1]]}
["Definitions"]
["Definitions"]
[]
["Household Numer","The household group that an individual applicant is attached to."]
[]
["Status","Individual applicants household status (single or couple)"]
{"$rows_left_out":43}
{"sheet":"Scales Tax","index":20,"n_rows":130,"n_cols":55,"rows_kept":130,"cut":false,"hidden":true,"merged":[]}
["Annual Salary Guide - Standard",null,null,null,null,null,null,null,null,null,null,null,null,null,null,"Annual Salary Guide - SMSF",null,null,null,null,null,null,null,null,null,null,null,null,null,null,"Annual Salary Guide - Non Resident",null,null,null,null,null,null,null,null,null,null,null,null,null,null,"Annual Salary Guide - ICR"]
["Tax Scales ",null,null,null,null,null,null,null,null,null,null,null,null,null,null,"Tax Scales ",null,null,null,null,null,null,null,null,null,null,null,null,null,null,"Tax Scales ",null,null,null,null,null,null,null,null,null,null,null,null,null,null,"Tax Scales "]
["Applicant 1",null,null,null,null,null,null,null,null,null,null,null,null,null,null,"Applicant 1",null,null,null,null,null,null,null,null,null,null,null,null,null,null,"Applicant 1",null,null,null,null,null,null,null,null,null,null,null,null,null,null,"Applicant 1"]
["Gross Taxable Income",null,null,"Tax Rate",null,"Gross",null,"Tax",null,"Net",null,null,null,null,null,"Gross Taxable Income",null,null,"Tax Rate",null,"Gross",null,"Tax",null,"Net",null,"Flood Levy Calculations",null,null,null,"Gross Taxable Income",null,null,"Tax Rate",null,"Gross",null,"Tax",null,"Net",null,"Flood Levy Calculations",null,null,null,"Gross Taxable Income",null,null,"Tax Rate",null,"Gross",null,"Tax",null,"Net"]
[1,18200,{"$f":"B5-A5+1","v":18200},0,null,{"$f":"IF('SME Servicing Calculator'!O33<B5,'SME Servicing Calculator'!O33,C5)","v":0},{"$f":"F5","v":0},{"$f":"F5*D5","v":0},null,{"$f":"F5-H5","v":0},null,null,null,null,null,{"$f":"A5","v":1},18200,18200,0,null,{"$f":"IF('SMSF Servicing Calculator'!N67<Q5,'SMSF Servicing Calculator'!N67,R5)","v":0},{"$f":"U5","v":0},{"$f":"U5*S5","v":0},null,{"$f":"U5-W5","v":0},null,null,null,null,null,{"$f":"P5","v":1},18200,18200,0,null,{"$f":"IF(#REF!<AF5,#REF!,AG5)","v":{"$error":"#REF!"}},{"$f":"AJ5","v":{"$error":"#REF!"}},{"$f":"AJ5*AH5","v":{"$error":"#REF!"}},null,{"$f":"AJ5-AL5","v":{"$error":"#REF!"}},null,null,null,null,null,{"$f":"A5","v":1},18200,18200,0,null,0,{"$f":"AY5","v":0},{"$f":"AY5*AW5","v":0},null,{"$f":"AY5-BA5","v":0}]
[18201,45000,{"$f":"B6-A6+1","v":26800},0.16,null,{"$f":"IF(G5='SME Servicing Calculator'!O33,0,IF(('SME Servicing Calculator'!O33-G5)>C6,C6,('SME Servicing Calculator'!O33-G5)))","v":0},{"$f":"G5+F6","v":0},{"$f":"F6*D6","v":0},null,{"$f":"F6-H6","v":0},null,null,null,null,null,18201,45000,{"$f":"C6","v":26800},0.16,null,{"$f":"IF(V5='SMSF Servicing Calculator'!$N$67,0,IF(('SMSF Servicing Calculator'!$N$67-V5)>R6,R6,('SMSF Servicing Calculator'!$N$67-V5)))","v":0},{"$f":"V5+U6","v":0},{"$f":"U6*S6","v":0},null,{"$f":"U6-W6","v":0},null,null,null,null,null,18201,45000,26800,0.16,null,{"$f":"IF(AK5=#REF!,0,IF((#REF!-0)>AG6,AG6,(#REF!-0)))","v":{"$error":"#REF!"}},{"$f":"AK5+AJ6","v":{"$error":"#REF!"}},{"$f":"AJ6*AH6","v":{"$error":"#REF!"}},null,{"$f":"AJ6-AL6","v":{"$error":"#REF!"}},null,null,null,null,null,18201,45000,26800,0.16,null,0,{"$f":"AZ5+AY6","v":0},{"$f":"AY6*AW6","v":0},null,{"$f":"AY6-BA6","v":0}]
{"$rows_left_out":125}
{"sheet":"Tax Scales","index":21,"n_rows":156,"n_cols":55,"rows_kept":156,"cut":false,"hidden":true,"merged":[]}
["Annual Salary Guide - Standard",null,null,null,null,null,null,null,null,null,null,null,null,null,null,"Annual Salary Guide - SMSF",null,null,null,null,null,null,null,null,null,null,null,null,null,null,"Annual Salary Guide - Non Resident",null,null,null,null,null,null,null,null,null,null,null,null,null,null,"Annual Salary Guide - ICR"]
["Tax Scales ",null,null,null,null,null,null,null,null,null,null,null,null,null,null,"Tax Scales ",null,null,null,null,null,null,null,null,null,null,null,null,null,null,"Tax Scales ",null,null,null,null,null,null,null,null,null,null,null,null,null,null,"Tax Scales "]
["Applicant 1",null,null,null,null,null,null,null,null,null,null,null,null,null,null,"Applicant 1",null,null,null,null,null,null,null,null,null,null,null,null,null,null,"Applicant 1",null,null,null,null,null,null,null,null,null,null,null,null,null,null,"Applicant 1"]
["Gross Taxable Income",null,null,"Tax Rate",null,"Gross",null,"Tax",null,"Net",null,null,null,null,null,"Gross Taxable Income",null,null,"Tax Rate",null,"Gross",null,"Tax",null,"Net",null,"Flood Levy Calculations",null,null,null,"Gross Taxable Income",null,null,"Tax Rate",null,"Gross",null,"Tax",null,"Net",null,"Flood Levy Calculations",null,null,null,"Gross Taxable Income",null,null,"Tax Rate",null,"Gross",null,"Tax",null,"Net"]
[1,18200,{"$f":"B5-A5+1","v":18200},0,null,{"$f":"IF('Serviceability Calculator'!V33<B5,'Serviceability Calculator'!V33,C5)","v":0},{"$f":"F5","v":0},{"$f":"F5*D5","v":0},null,{"$f":"F5-H5","v":0},null,null,null,null,null,{"$f":"A5","v":1},18200,18200,0,null,{"$f":"IF('SMSF Servicing Calculator'!N67<Q5,'SMSF Servicing Calculator'!N67,R5)","v":0},{"$f":"U5","v":0},{"$f":"U5*S5","v":0},null,{"$f":"U5-W5","v":0},null,null,null,null,null,{"$f":"P5","v":1},18200,{"$f":"R5","v":18200},0,null,{"$f":"IF(#REF!<AF5,#REF!,AG5)","v":{"$error":"#REF!"}},{"$f":"AJ5","v":{"$error":"#REF!"}},{"$f":"AJ5*AH5","v":{"$error":"#REF!"}},null,{"$f":"AJ5-AL5","v":{"$error":"#REF!"}},null,null,null,null,null,{"$f":"A5","v":1},18200,18200,0,null,0,{"$f":"AY5","v":0},{"$f":"AY5*AW5","v":0},null,{"$f":"AY5-BA5","v":0}]
[18201,45000,{"$f":"B6-A6+1","v":26800},0.16,null,{"$f":"IF(G5='Serviceability Calculator'!V33,0,IF(('Serviceability Calculator'!V33-G5)>C6,C6,('Serviceability Calculator'!V33-G5)))","v":0},{"$f":"G5+F6","v":0},{"$f":"F6*D6","v":0},null,{"$f":"F6-H6","v":0},null,null,null,null,null,18201,45000,{"$f":"C6","v":26800},0.16,null,{"$f":"IF(V5='SMSF Servicing Calculator'!$N$67,0,IF(('SMSF Servicing Calculator'!$N$67-V5)>R6,R6,('SMSF Servicing Calculator'!$N$67-V5)))","v":0},{"$f":"V5+U6","v":0},{"$f":"U6*S6","v":0},null,{"$f":"U6-W6","v":0},null,null,null,null,null,18201,45000,26800,0.16,null,{"$f":"IF(AK5=#REF!,0,IF((#REF!-0)>AG6,AG6,(#REF!-0)))","v":{"$error":"#REF!"}},{"$f":"AK5+AJ6","v":{"$error":"#REF!"}},{"$f":"AJ6*AH6","v":{"$error":"#REF!"}},null,{"$f":"AJ6-AL6","v":{"$error":"#REF!"}},null,null,null,null,null,18201,45000,26800,0.16,null,0,{"$f":"AZ5+AY6","v":0},{"$f":"AY6*AW6","v":0},null,{"$f":"AY6-BA6","v":0}]
{"$rows_left_out":151}
{"sheet":"RepayCalculator","index":22,"n_rows":50,"n_cols":10,"rows_kept":50,"cut":false,"hidden":true,"merged":[]}
["Dropdown box data"]
["Principal & Interest"]
["Interest Only"]
[]
["PRIME Serviceability Sensitivity",0.02]
["SME Serviceability Sensitivity",0.02]
{"$rows_left_out":45}
{"sheet":"Cost of Living Index","index":23,"n_rows":157,"n_cols":7,"rows_kept":157,"cut":false,"hidden":true,"merged":[[2,4,2,6]]}
[]
[]
[null,null,"Single","Joint","Living Allowance Calculation"]
[]
[null,0,{"$f":"#REF!","v":{"$error":"#REF!"}},{"$f":"#REF!","v":{"$error":"#REF!"}},null,"$ per Week","$ per Month"]
[null,999,{"$f":"#REF!","v":{"$error":"#REF!"}},{"$f":"#REF!","v":{"$error":"#REF!"}},"Single",null,{"$f":"F6*52/12","v":0}]
{"$rows_left_out":152}
{"sheet":"Live Currency Rates","index":24,"n_rows":168,"n_cols":8,"rows_kept":168,"cut":false,"hidden":true,"merged":[]}
["Currency code ▲▼","Currency name ▲▼","Units per AUD","AUD per Unit",null,null,"ex rate 1",{"$f":"VLOOKUP(#REF!,'Live Currency Rates'!A:D,3,FALSE)","v":{"$error":"#REF!"}}]
["USD","US Dollar",0.77541398610000001,1.2896336897,null,null,"ex rate 2",{"$f":"VLOOKUP(#REF!,'Live Currency Rates'!A:D,3,FALSE)","v":{"$error":"#REF!"}}]
["EUR","Euro",0.64166821730000001,1.5584377923999999]
["GBP","British Pound",0.55453509940000001,1.8033123622]
["INR","Indian Rupee",56.847773984500002,1.7590838300000002E-2]
["AUD","Australian Dollar",1,1]
{"$rows_left_out":162}