{"text_format":"1","workbook":"xlsx","n_sheets":4,"sheets":["MENU","Premium","Rate Cards","DATA"],"not_rendered":{"charts":1,"images":4,"macros":1,"external_links":1,"defined_names":31,"comments":0,"pivot_tables":0},"unopened":[],"bounds":{"document_bytes":16777216,"sheet_cells":100000,"rows_first":2000,"rows_last":500,"rows_between":2000,"halvings":0,"cell_chars":16384,"cell_head_chars":4096},"cells_cut":0,"cells_raw":0,"read":"whole","date_system":"1900"}

{"sheet":"MENU","index":0,"n_rows":36,"n_cols":9,"rows_kept":36,"cut":false,"hidden":false,"merged":[[28,5,28,11],[29,5,31,11],[135,1,138,11],[9,12,9,14],[24,6,24,9],[25,6,25,7],[25,8,25,9],[26,6,26,7],[26,8,26,9]]}
[]
[]
[]
[]
[]
[null,null,null,null,null,"Enables you to calculate the Lenders Mortgage Insurance (LMI) "]
[null,null,null,null,null,"premium rate for your customers in our easy-to-use spreadsheet"]
[null,null,null,null,null,"In just a few steps, you will obtain the applicable premium rate"]
[null,null,null,null,null,"The calculator will be updated and reissued to you by Helia to "]
[null,null,null,null,null,"reflect any changes to our policy or pricing, ensuring you receive the"]
[null,null,null,null,null,"most accurate premium rate."]
[]
[]
[]
[]
[]
[]
[null,null,null,null,null,"The Quick Guide details how to use the Helia LMI Premium"]
[null,null,null,null,null,"Calculator. If you have any questions please contact your"]
[null,null,null,null,null,"Helia Relationship Manager."]
[]
[]
[]
[null,null,null,null,null,"Disclaimer"]
[null,null,null,null,null,null,{"$f":"Premium!O54","v":"VERSION NO. 20250525"}]
[null,null,null,null,null,null,"Effective date",null,{"$f":"Premium!G54","v":"2026-07-01"}]
[null,null,null,null,null,null,"Valid until ",null,{"$f":"Premium!K54","v":"2028-07-30"}]
[]
[null,null,null,null,null,"Prepared for:"]
[null,null,null,null,null,{"$f":"Premium!G4","v":"BC Invest LMI Premium Calculator"}]
[]
[]
[null,null,null,null,null," "]
["  Confidential. Helia Insurance Pty Limited ABN 60 106 974 305. "]
["  ® Helia and the Helia logo are registered service marks of Helia Insurance Pty Limited and used pursuant to licence."]
["  © 2022 Helia Group Limited. All rights reserved."]

{"sheet":"Premium","index":1,"n_rows":79,"n_cols":26,"rows_kept":79,"cut":false,"hidden":false,"merged":[[47,13,47,14],[4,4,4,6],[48,13,48,14]]}
[]
[]
[]
[null,null,null,null,null,null,"BC Invest LMI Premium Calculator"]
[null,null,null,null,"Click on any field label below for a description of required content.",null,null,null,null,null,null,null,null,null,null,null,null,null,null,null,null,"RITC - (1=Yes, 2=No)",{"$f":"DATA!$C$80","v":1}]
[]
[null,null,null,null,"POLICY DETAILS",null,null,null,"LOAN DETAILS",null,null,null,null,null,"TOTAL LOAN AMOUNT"]
[]
[null,null,null,null,"Borrower Name",null,null,null,"Predominant Loan Purpose",null,1]
[]
[null,null,null,null,"Lenders Reference Number",null,null,null,"New Loan or Top-up?",null,1,null,null,null,"TOTAL CAPITALISED LOAN AMOUNT"]
[]
[null,null,null,null,"LMI Product",null,1,null,"New Loan Amount"]
[]
[null,null,null,null,"Self Employed?",null,1,null,"Existing Loan Balance",null,null,null,null,null,"TOTAL SECURITY VALUE"]
[]
[null,null,null,null,"First Home Buyer?",null,2,null,"Loan Term",null,1]
[]
[null,null,null,null,"Capitalise premium?",null,2,null,{"$f":"IF($K$11=2,\"Premium credit amount\",\"\")","v":""},null,null,null,null,null,"TOTAL PREMIUM PAYABLE"]
[]
[null,null,null,null,{"$f":"IF(AND($G$17=1,$K$9>1),\"Error: FHB Not eligible\",\"\")","v":""},null,{"$f":"IF($G$13=2,IF($G$17=1,\"Error: FHB not eligible\",\"\"),\"\")","v":""},null,{"$f":"IF( OR($G$13=2,$G$13=3),IF($K$17>1,\"Error: LMI Product Mismatch\",\"\"),\"\")","v":""},null,{"$f":"IF($K$11=1,IF($K$19<>\"Not Used\",IF($K$19>0,\"Error: Reset\",\"\"),\"\"),\"\")","v":""},null,null,null,null,null,null,null,null,null,null,null,null,null,null,{"$f":"K13/I30","v":{"$error":"#DIV/0!"}}]
[null,null,null,null,null,null,null,null,null,null,null,null,null,null,null,null,null,null,null,null,null,null,null,null,null,{"$f":"1-Z21","v":{"$error":"#DIV/0!"}}]
[null,null,null,null,{"$f":"IF($K$11=2,IF($G$17=1,\"Note: FHB eligible for Construction Top Ups only\",\"\"),\"\")","v":""},null,{"$f":"IF( OR($G$13=2,$G$13=3,$G$13=4),IF($K$28<>1,\"Error: Monthly premium not eligible\",\"\"),\"\")","v":""}]
[]
[]
[null,null,null,null,"SECURITY DETAILS",null,{"$f":"IF(AND($I$30>0,OR($E$30=1,$G$30=1)),\"Please enter State & Occupancy Type\",IF(AND($I$32>0,OR($E$32=1,$G$32=1)),\"Please enter State & Occupancy Type\",IF(AND($I$34>0,OR($E$34=1,$G$34=1)),\"Please enter State & Occupancy Type\",IF(AND($I$36>0,OR($E$36=1,$G$36=1)),\"Please enter State & Occupancy Type\",IF(AND($I$38>0,OR($E$38=1,$G$38=1)),\"Please enter State & Occupancy Type\",\"\")))))","v":""},null,null,null,"PAYMENT OPTION"]
[]
[null,null,null,null,"STATE OF SECURITY",null,"OCCUPANCY TYPE",null,"VALUE",null,1]
[]
[null,null,null,null,1,null,1,null,null,null,null,null,null,null,"BASE LVR %"]
[]
[null,null,null,null,1,null,1]
[]
[null,null,null,null,1,null,1,null,null,null,null,null,null,null,"CAPITALISED LVR %"]
[]
[null,null,null,null,1,null,1]
[]
[null,null,null,null,1,null,1]
[]
[]
{"$rows_left_out":40}
{"sheet":"Rate Cards","index":2,"n_rows":328,"n_cols":25,"rows_kept":328,"cut":false,"hidden":true,"merged":[[117,2,117,11],[117,15,117,24],[177,15,177,24],[27,2,27,11],[27,15,27,24],[57,2,57,11],[57,15,57,24],[87,2,87,11],[87,15,87,24],[207,2,207,11],[207,15,207,24],[177,2,177,11],[147,2,147,11],[147,15,147,24],[297,2,297,11],[297,15,297,24],[327,2,327,11],[327,15,327,24],[237,2,237,11],[237,15,237,24],[267,2,267,11],[267,15,267,24]]}
["STANDARD\n\n",null,"TO $300,000","FROM $300,001 TO $500,000","FROM $500,001 TO $600,000","FROM $600,001 TO $750,000","FROM $750,001 TO $1.0M","FROM $1.0M TO $1.5M","FROM $1.5M TO $2.0M","FROM $2.0M TO $2.5M","FROM $2.5M TO $3.0M","FROM $3.0M TO $5.0M",null,"STANDARD\nFirst Home Buyer",null,"TO $300,000","FROM $300,001 TO $500,000","FROM $500,001 TO $600,000","FROM $600,001 TO $750,000","FROM $750,001 TO $1.0M","FROM $1.0M TO $1.5M","FROM $1.5M TO $2.0M","FROM $2.0M TO $2.5M","FROM $2.5M TO $3.0M","FROM $3.0M TO $5.0M"]
[null,null,0,300001,500001,600001,750001,1000001,1500001,2000001,2500001,3000001,null,null,null,0,300001,500001,600001,750001,1000001,1500001,2000001,2500001,3000001]
["Up to 60%",1.0000000000000001E-5,0.4,0.42,0.44999999999999996,0.44999999999999996,0.44999999999999996,0.5,0.5,0.5,0.5,0.5,null,"Up to 60%",1.0000000000000001E-5,0.36,0.38,0.41,0.41,0.41,0.45,0.45,0.45,0.45,0.45]
["above 60% to 65%",0.60001000000000004,0.42,0.45999999999999996,0.57999999999999996,0.57999999999999996,0.57999999999999996,0.64,0.64,0.64,0.64,0.64,null,"above 60% to 65%",0.60001000000000004,0.38,0.41,0.52,0.52,0.52,0.57999999999999996,0.57999999999999996,0.57999999999999996,0.57999999999999996,0.57999999999999996]
["above 65% to 70%",0.65000999999999998,0.44,0.48,0.66,0.66,0.66,0.73,0.73,0.73,0.73,0.73,null,"above 65% to 70%",0.65000999999999998,0.4,0.43,0.59,0.59,0.59,0.66,0.66,0.66,0.66,0.66]
["above 70% to 75%",0.70001000000000002,0.45999999999999996,0.53,0.89,0.89,0.89,0.98,0.98,0.98,0.98,0.98,null,"above 70% to 75%",0.70001000000000002,0.41,0.48,0.8,0.8,0.8,0.88,0.88,0.88,0.88,0.88]
["above 75% to 80%",0.75000999999999995,0.51,0.57999999999999996,0.96,0.96,0.96,1.06,1.06,1.06,1.06,1.06,null,"above 75% to 80%",0.75000999999999995,0.46,0.52,0.86,0.86,0.86,0.95,0.95,0.95,0.95,0.95]
["above 80% to 81%",0.80001,0.57000000000000006,0.66,1.05,1.05,1.05,1.1599999999999999,1.1599999999999999,1.1599999999999999,1.1599999999999999,1.1599999999999999,null,"above 80% to 81%",0.80001,0.51,0.59,0.95,0.95,0.95,1.04,1.04,1.04,1.04,1.04]
["above 81% to 82%",0.81001000000000001,0.57999999999999996,0.66,1.05,1.05,1.05,1.1599999999999999,1.1599999999999999,1.1599999999999999,1.1599999999999999,1.1599999999999999,null,"above 81% to 82%",0.81001000000000001,0.52,0.59,0.95,0.95,0.95,1.04,1.04,1.04,1.04,1.04]
["above 82% to 83%",0.82001000000000002,0.80999999999999994,1,1.23,1.23,1.23,1.35,1.35,1.35,1.35,1.35,null,"above 82% to 83%",0.82001000000000002,0.73,0.9,1.1100000000000001,1.1100000000000001,1.1100000000000001,1.22,1.22,1.22,1.22,1.22]
["above 83% to 84%",0.83001000000000003,0.80999999999999994,1,1.31,1.31,1.31,1.44,1.44,1.44,1.44,1.44,null,"above 83% to 84%",0.83001000000000003,0.73,0.9,1.18,1.18,1.18,1.3,1.3,1.3,1.3,1.3]
["above 84% to 85%",0.84001000000000003,1.02,1.32,1.51,1.51,1.51,1.66,1.66,1.66,1.66,1.66,null,"above 84% to 85%",0.84001000000000003,0.92,1.19,1.36,1.36,1.36,1.49,1.49,1.49,1.49,1.49]
["above 85% to 86%",0.85001000000000004,1.05,1.32,1.6500000000000001,1.6500000000000001,1.6500000000000001,1.81,1.81,1.81,1.81,1.81,null,"above 85% to 86%",0.85001000000000004,0.95,1.19,1.49,1.49,1.49,1.63,1.63,1.63,1.63,1.63]
["above 86% to 87%",0.86001000000000005,1.24,1.5,1.83,1.83,1.83,2.0099999999999998,2.0099999999999998,2.0099999999999998,2.0099999999999998,2.0099999999999998,null,"above 86% to 87%",0.86001000000000005,1.1200000000000001,1.35,1.65,1.65,1.65,1.81,1.81,1.81,1.81,1.81]
["above 87% to 88%",0.87000999999999995,1.24,1.5,1.9300000000000002,1.9300000000000002,1.9300000000000002,2.13,2.13,2.13,2.13,2.13,null,"above 87% to 88%",0.87000999999999995,1.1200000000000001,1.35,1.74,1.74,1.74,1.92,1.92,1.92,1.92,1.92]
["above 88% to 89%",0.88000999999999996,1.6099999999999999,2.11,2.4699999999999998,2.4699999999999998,2.4699999999999998,2.71,2.71,2.71,2.71,2.71,null,"above 88% to 89%",0.88000999999999996,1.45,1.9,2.2200000000000002,2.2200000000000002,2.2200000000000002,2.44,2.44,2.44,2.44,2.44]
["above 89% to 90%",0.89000999999999997,1.81,2.2999999999999998,2.93,2.93,2.93,3.2199999999999998,3.2199999999999998,3.2199999999999998,3.2199999999999998,3.2199999999999998,null,"above 89% to 90%",0.89000999999999997,1.63,2.0699999999999998,2.64,2.64,2.64,2.9,2.9,2.9,2.9,2.9]
["above 90% to 91%",0.90000999999999998,2.3199999999999998,2.9899999999999998,4.04,4.04,4.04,4.4400000000000004,4.4400000000000004,4.4400000000000004,4.4400000000000004,4.4400000000000004,null,"above 90% to 91%",0.90000999999999998,2.09,2.69,3.64,3.64,3.64,4,4,4,4,4]
["above 91% to 92%",0.91000999999999999,2.3199999999999998,2.9899999999999998,4.2,4.2,4.2,4.62,4.62,4.62,4.62,4.62,null,"above 91% to 92%",0.91000999999999999,2.09,2.69,3.78,3.78,3.78,4.16,4.16,4.16,4.16,4.16]
["above 92% to 93%",0.92000999999999999,2.67,3.38,4.3600000000000003,4.3600000000000003,4.3600000000000003,4.8,4.8,4.8,4.8,4.8,null,"above 92% to 93%",0.92000999999999999,2.4,3.04,3.92,3.92,3.92,4.32,4.32,4.32,4.32,4.32]
["above 93% to 94%",0.93001,2.67,3.38,4.7699999999999996,4.7699999999999996,4.7699999999999996,5.25,5.25,5.25,5.25,5.25,null,"above 93% to 94%",0.93001,2.4,3.04,4.29,4.29,4.29,4.7300000000000004,4.7300000000000004,4.7300000000000004,4.7300000000000004,4.7300000000000004]
["above 94% to 95%",0.94001000000000001,2.97,3.73,5.01,5.01,5.01,5.5100000000000007,5.5100000000000007,5.5100000000000007,5.5100000000000007,5.5100000000000007,null,"above 94% to 95%",0.94001000000000001,2.67,3.36,4.51,4.51,4.51,4.96,4.96,4.96,4.96,4.96]
["above 95% to 96%",0.95001000000000002,"Refer","Refer","Refer","Refer","Refer","Refer","Refer","Refer","Refer","Refer",null,"above 95% to 96%",0.95001000000000002,"Refer","Refer","Refer","Refer","Refer","Refer","Refer","Refer","Refer","Refer"]
["above 96% to 97%",0.96001000000000003,"Refer","Refer","Refer","Refer","Refer","Refer","Refer","Refer","Refer","Refer",null,"above 96% to 97%",0.96001000000000003,"Refer","Refer","Refer","Refer","Refer","Refer","Refer","Refer","Refer","Refer"]
["above 97% to 98%",0.97001000000000004,"Refer","Refer","Refer","Refer","Refer","Refer","Refer","Refer","Refer","Refer",null,"above 97% to 98%",0.97001000000000004,"Refer","Refer","Refer","Refer","Refer","Refer","Refer","Refer","Refer","Refer"]
["above 98% to 99%",0.98001000000000005,"Refer","Refer","Refer","Refer","Refer","Refer","Refer","Refer","Refer","Refer",null,"above 98% to 99%",0.98001000000000005,"Refer","Refer","Refer","Refer","Refer","Refer","Refer","Refer","Refer","Refer"]
["above 99% to 100%",0.99000999999999995,"Refer","Refer","Refer","Refer","Refer","Refer","Refer","Refer","Refer","Refer",null,"above 99% to 100%",0.99000999999999995,"Refer","Refer","Refer","Refer","Refer","Refer","Refer","Refer","Refer","Refer"]
[null,null,"MINIMUM PREMIUM - FLAT FEE (WHERE APPLICABLE) OTHERWISE $1200",null,null,null,null,null,null,null,null,null,null,null,null,"MINIMUM PREMIUM - FLAT FEE (WHERE APPLICABLE) OTHERWISE $1200"]
[]
[]
["Business Select",null,"TO $300,000","FROM $300,001 TO $500,000","FROM $500,001 TO $600,000","FROM $600,001 TO $750,000","FROM $750,001 TO $1.0M","FROM $1.0M TO $1.5M","FROM $1.5M TO $2.0M","FROM $2.0M TO $2.5M","FROM $2.5M TO $3.0M","FROM $3.0M TO $3.5M",null,"Business Select\nFirst Home Buyer",null,"TO $300,000","FROM $300,001 TO $500,000","FROM $500,001 TO $600,000","FROM $600,001 TO $750,000","FROM $750,001 TO $1.0M","FROM $1.0M TO $1.5M","FROM $1.5M TO $2.0M","FROM $2.0M TO $2.5M","FROM $2.5M TO $3.0M","FROM $3.0M TO $3.5M"]
[null,null,0,300001,500001,600001,750001,1000001,1500001,2000001,2500001,3000001,null,null,null,0,300001,500001,600001,750001,1000001,1500001,2000001,2500001,3000001]
["Up to 60%",1.0000000000000001E-5,0.6,0.63,0.68,0.68,0.68,0.75,0.75,0.75,0.75,0.75,null,"Up to 60%",1.0000000000000001E-5,"Refer","Refer","Refer","Refer","Refer","Refer","Refer","Refer","Refer","Refer"]
["above 60% to 65%",0.60001000000000004,0.66,0.72,0.99,0.99,0.99,1.1000000000000001,1.1000000000000001,1.1000000000000001,1.1000000000000001,1.1000000000000001,null,"above 60% to 65%",0.60001000000000004,"Refer","Refer","Refer","Refer","Refer","Refer","Refer","Refer","Refer","Refer"]
["above 65% to 70%",0.65000999999999998,0.66,0.72,0.99,0.99,0.99,1.1000000000000001,1.1000000000000001,1.1000000000000001,1.1000000000000001,1.1000000000000001,null,"above 65% to 70%",0.65000999999999998,"Refer","Refer","Refer","Refer","Refer","Refer","Refer","Refer","Refer","Refer"]
["above 70% to 75%",0.70001000000000002,0.89,1.02,1.68,1.68,1.68,1.86,1.86,1.86,1.86,1.86,null,"above 70% to 75%",0.70001000000000002,"Refer","Refer","Refer","Refer","Refer","Refer","Refer","Refer","Refer","Refer"]
["above 75% to 80%",0.75000999999999995,0.89,1.02,1.68,1.68,1.68,1.86,1.86,1.86,1.86,1.86,null,"above 75% to 80%",0.75000999999999995,"Refer","Refer","Refer","Refer","Refer","Refer","Refer","Refer","Refer","Refer"]
["above 80% to 81%",0.80001,"Refer","Refer","Refer","Refer","Refer","Refer","Refer","Refer","Refer","Refer",null,"above 80% to 81%",0.80001,"Refer","Refer","Refer","Refer","Refer","Refer","Refer","Refer","Refer","Refer"]
["above 81% to 82%",0.81001000000000001,"Refer","Refer","Refer","Refer","Refer","Refer","Refer","Refer","Refer","Refer",null,"above 81% to 82%",0.81001000000000001,"Refer","Refer","Refer","Refer","Refer","Refer","Refer","Refer","Refer","Refer"]
["above 82% to 83%",0.82001000000000002,"Refer","Refer","Refer","Refer","Refer","Refer","Refer","Refer","Refer","Refer",null,"above 82% to 83%",0.82001000000000002,"Refer","Refer","Refer","Refer","Refer","Refer","Refer","Refer","Refer","Refer"]
{"$rows_left_out":289}
{"sheet":"DATA","index":3,"n_rows":132,"n_cols":15,"rows_kept":132,"cut":false,"hidden":true,"merged":[[0,0,0,2],[0,4,0,11],[2,0,2,2],[2,4,2,11],[8,4,8,10],[37,4,37,11],[12,0,12,2],[21,0,21,2],[27,0,27,2],[30,4,30,11],[34,0,34,2],[129,0,129,2],[102,4,102,11],[46,0,46,2],[46,4,46,11],[53,0,53,2],[56,4,56,11],[66,0,66,2],[72,4,72,11],[76,10,76,11],[60,10,60,11],[115,0,115,2],[89,0,89,2],[76,0,76,2],[101,0,101,2],[105,0,105,2]]}
["LOADERS/STAMP DUTY",null,null,null,"CALCULATIONS"]
[]
["PURPOSE",null,null,null,"LOAN AMOUNT"]
[]
[null,null,"Loader",null,"Loan Amount",null,{"$f":"Premium!K13","v":0}]
[null,null,null,null,"Existing Loan Balances",null,{"$f":"Premium!K15","v":0}]
[1,"Purchase or Construction",1,null,"Total Loan Amount",null,{"$f":"SUM(G5:G6)","v":0}]
[2,"Home Improvement/Renovation",1]
[3,"Internal Refinance",1,null,"STAMP DUTY"]
[4,"External Refinance/Debt Consolidation",1]
[5,"Equity Release (or Cash-out)",1,null,"#","STATE","TYPE","VALUE","STAMP DUTY %","APPORTIONED","STAMP DUTY %"]
[null,null,null,null,1,{"$f":"INDEX($B$37:$B$45,Premium!E30)","v":"Select State of Security"},{"$f":"INDEX($B$50:$B$52,Premium!G30)","v":"Occupancy Type"},{"$f":"Premium!I30","v":0},{"$f":"IF(ISNA(VLOOKUP(F12,$B$57:$C$65,2,FALSE)),\"\",VLOOKUP(F12,$B$57:$C$65,2,FALSE))","v":0},{"$f":"IFERROR($H$12:$H$28/$H$29,\"\")","v":""},{"$f":"IFERROR(ROUND($L$119*I12*J12,2),0)","v":0}]
["Payment Option",null,null,null,2,{"$f":"INDEX($B$37:$B$45,Premium!E32)","v":"Select State of Security"},{"$f":"INDEX($B$50:$B$52,Premium!G32)","v":"Occupancy Type"},{"$f":"Premium!I32","v":0},{"$f":"IF(ISNA(VLOOKUP(F13,$B$57:$C$65,2,FALSE)),\"\",VLOOKUP(F13,$B$57:$C$65,2,FALSE))","v":0},{"$f":"IFERROR($H$12:$H$28/$H$29,\"\")","v":""},{"$f":"IFERROR(ROUND($L$119*I13*J13,2),0)","v":0}]
[null,null,null,null,3,{"$f":"INDEX($B$37:$B$45,Premium!E34)","v":"Select State of Security"},{"$f":"INDEX($B$50:$B$52,Premium!G34)","v":"Occupancy Type"},{"$f":"Premium!I34","v":0},0,"",{"$f":"IFERROR(ROUND($L$119*I14*J14,2),0)","v":0}]
[1,"Full upfront Premium",null,null,4,{"$f":"INDEX($B$37:$B$45,Premium!E36)","v":"Select State of Security"},{"$f":"INDEX($B$50:$B$52,Premium!G36)","v":"Occupancy Type"},{"$f":"Premium!I36","v":0},0,"",{"$f":"IFERROR(ROUND($L$119*I15*J15,2),0)","v":0}]
[2,"Monthly Premium - LVR 80% CUT OFF",null,null,5,{"$f":"INDEX($B$37:$B$45,Premium!E38)","v":"Select State of Security"},{"$f":"INDEX($B$50:$B$52,Premium!G38)","v":"Occupancy Type"},{"$f":"Premium!I38","v":0},0,"",{"$f":"IFERROR(ROUND($L$119*I16*J16,2),0)","v":0}]
[3,"Monthly Premium - LVR 75% CUT OFF"]
[4,"Monthly Premium (Homebuyer Plus) - LVR 75% CUT OFF"]
[5,"Monthly Premium (Homebuyer Plus) - LVR 80% CUT OFF"]
[6,"Weekly Premium"]
[]
["SELF-EMPLOYED"]
[]
[null,null,"Loader"]
[1,"No",1]
[2,"Yes",1]
[]
["LMI Product"]
[1,"Standard",null,null,null,null,null,{"$f":"SUM(H12:H28)","v":0},null,null,{"$f":"SUM(K12:K28)","v":0},null,null,null,{"$f":"SUM(O12:O28)","v":0}]
[2,"Business Select"]
[3,"SMSF",null,null,"SECURITIES"]
[4,"Non Resident"]
[null,null,null,null,null,null,"VALUE","% of Total "]
[null,null,null,null,"Owner Occupied",null,{"$f":"SUMIFS($H$12:$H$28,$G$12:$G$28,$E34)","v":0},{"$f":"IFERROR(G34/$G$36,0)","v":0},null,null,"Predominant Security Type"]
["SECURITY STATE",null,null,null,"Investment",null,{"$f":"SUMIFS($H$12:$H$28,$G$12:$G$28,$E35)","v":0},{"$f":"IFERROR(G35/$G$36,0)","v":0},null,null,{"$f":"IF(H35>H34,E35,E34)","v":"Owner Occupied"}]
[null,null,"Loader",null,null,null,{"$f":"SUM(G34:G35)","v":0}]
[1,"Select State of Security",0]
[2,"New South Wales",0,null,"LOAN VALUE"]
[3,"Queensland",0.09]
[4,"Victoria",0.1]
{"$rows_left_out":92}