{"text_format":"1","workbook":"xlsx","n_sheets":14,"sheets":["SMSF Servicing Calculator","Calculations breakdown","Non-Res Serviceability","HEM not in used","Self Employed Calculator","Rental & Gearing","China (USD) exportation limit","Numbeo Living Expense Reference","Log Change","Tax Scales","HEM2","RepayCalculator","Cost of Living Index","Live Currency Rates"],"not_rendered":{"charts":0,"images":4,"macros":1,"external_links":1,"defined_names":500,"comments":2,"pivot_tables":0},"unopened":[],"bounds":{"document_bytes":16777216,"sheet_cells":100000,"rows_first":2000,"rows_last":500,"rows_between":2000,"halvings":0,"cell_chars":16384,"cell_head_chars":4096},"cells_cut":0,"cells_raw":0,"read":"whole","date_system":"1900"}

{"sheet":"SMSF Servicing Calculator","index":0,"n_rows":115,"n_cols":15,"rows_kept":115,"cut":false,"hidden":true,"merged":[[93,13,93,14],[3,5,3,6],[38,4,38,5],[33,4,33,5],[36,4,36,5],[11,4,11,5],[5,3,5,6],[6,4,6,5],[7,4,7,5],[8,4,8,5],[13,4,13,5],[28,4,28,5],[26,4,26,6],[27,4,27,5],[42,4,42,5],[43,4,43,5],[10,4,10,6],[12,4,12,5],[14,4,14,5],[15,4,15,5],[16,4,16,5],[29,4,29,5],[30,4,30,5],[20,4,20,6],[21,4,21,5],[22,4,22,5],[23,4,23,5],[24,4,24,5]]}
[]
[]
[]
[null,null,"SMSF Servicing Calculator V1.2",null,null,{"$f":"TODAY()","v":"2025-12-04"}]
[null,null,"Application Details"]
[null,null,"Applicant / SMSF Name","Enter Name Here"]
[null,null,"Loan Value",null,"Loan Term"]
[null,null,"Security Value",null,"Interest Rate"]
[null,null,"LVR",{"$f":"D7/D8","v":{"$error":"#DIV/0!"}},"Assessment Rate",null,{"$f":"IF(G8<3.75%,5.75%,G8+2%)","v":5.7500000000000002E-2}]
[]
{"$rows_left_out":106}
{"sheet":"Calculations breakdown","index":1,"n_rows":29,"n_cols":6,"rows_kept":29,"cut":false,"hidden":true,"merged":[[25,3,25,4],[26,3,26,4],[27,3,27,4],[24,3,24,4]]}
[]
[null,null,"Annual","Monthly","Assessed %"]
[null,"Mandatory contributions",{"$f":"SUM('SMSF Servicing Calculator'!D12*E3)","v":0},{"$f":"C3/12","v":0},1]
[null,"Additional contributions",{"$f":"SUM('SMSF Servicing Calculator'!D13*E4)","v":0},{"$f":"C4/12","v":0},1]
[null,"Other income ",{"$f":"SUM('SMSF Servicing Calculator'!D17*E5)","v":0},{"$f":"C5/12","v":0},0.8]
[null,"Rental income",{"$f":"SUM('SMSF Servicing Calculator'!D14*E6)","v":0},{"$f":"C6/12","v":0},0.8]
[null,"Total gross income",{"$f":"SUM(C3:C6)","v":0},{"$f":"C7/12","v":0}]
[null,"less Other investment loans 1 add back",{"$f":"('SMSF Servicing Calculator'!D23*D8)+C19","v":0},{"$f":"IF('SMSF Servicing Calculator'!D24<E8,E8,'SMSF Servicing Calculator'!D24)","v":0.03},0.03,"Deemed rate"]
[null,"less Other investment loans 2 add back",{"$f":"('SMSF Servicing Calculator'!G23*D9)","v":0},{"$f":"IF('SMSF Servicing Calculator'!G24<E9,E9,'SMSF Servicing Calculator'!G24)","v":0.03},0.03]
[null,"less Other investment loans 3 add back",{"$f":"('SMSF Servicing Calculator'!D29*D10)","v":0},{"$f":"IF('SMSF Servicing Calculator'!D30<E10,E10,'SMSF Servicing Calculator'!D30)","v":0.03},0.03]
{"$rows_left_out":20}
{"sheet":"Non-Res Serviceability","index":2,"n_rows":130,"n_cols":19,"rows_kept":130,"cut":false,"hidden":false,"merged":[[108,15,108,18],[58,5,58,6],[60,5,60,6],[62,5,62,6],[56,5,56,6],[65,2,65,5],[66,2,66,5],[71,2,71,5],[73,2,73,5],[91,2,91,5],[92,2,92,5],[94,2,94,5],[96,2,96,5],[98,2,98,6],[99,2,99,5],[109,2,109,5],[103,2,103,5],[105,2,105,5],[124,11,124,12],[83,1,87,1],[83,5,87,6],[93,2,93,5],[106,2,106,5]]}
[]
[null,null,"Non-Res Serviceability Calculator 5.0",null,null,null,{"$f":"TODAY()","v":"2025-12-04"}]
[]
[null,null,"New Loan Commitment","Loan 1","Loan 2","Loan 3"]
[null,null,"Application No."]
[null,null,"Repayment Type",{"$f":"IF(D8=0,\"\",IF(D8>D9,\"Principal & Interest\",\"Interest Only\"))","v":""},{"$f":"IF(E8=0,\"\",IF(E8>E9,\"Principal & Interest\",\"Interest Only\"))","v":""},{"$f":"IF(F8=0,\"\",IF(F8>F9,\"Principal & Interest\",\"Interest Only\"))","v":""}]
[null,null,"New Loan Amount"]
[null,null,"New Loan Term (Years)"]
[null,null,"Interest Only Term (Years)"]
[null,null,"Interest Rate of New Loan"]
{"$rows_left_out":121}
{"sheet":"HEM not in used","index":3,"n_rows":34,"n_cols":16,"rows_kept":34,"cut":false,"hidden":true,"merged":[]}
[]
[]
[]
[null,null,null,"\"HEM Table 1\" equivalent: by Income Level and Residency"]
[null,null,null,null,null,"BASED ON PREDICTED VALUES FROM THE QUANTILE REGRESSIONS",null,null,null,null,null,null,null,null,null,"2024Q2"]
[null,null,null,null,null,null,null,"Smoothed HEM"]
[null,"Column for lookup","2","3","4","5","6","7","8","9","10","11","12","13","14","15"]
[null,null,null,null,null,"Total current gross HH income from all sources (measured in current dollars)"]
[null,null,-9999999999,26000,39000,51000,64000,77000,103000,129000,154000,180000,206000,257000,321000,386000]
[null,null,"or less","to","to","to","to","to","to","to","to","to","to","to","to","to"]
{"$rows_left_out":25}
{"sheet":"Self Employed Calculator","index":4,"n_rows":68,"n_cols":16,"rows_kept":68,"cut":false,"hidden":true,"merged":[[27,7,27,10],[60,2,60,3],[67,1,67,11],[28,2,28,3],[35,1,35,11],[39,7,39,10],[57,7,57,10],[59,7,59,10],[41,7,41,10],[42,7,53,10],[2,1,2,2],[3,3,3,5],[7,7,7,10],[25,7,25,10],[9,7,9,10],[10,7,21,10]]}
[]
[]
[]
[null,null,"Self employed worksheet"]
[null,null,{"$f":"\"Self employed - \"&'Non-Res Serviceability'!D15","v":"Self employed - China"}]
[]
[null,null,null,"Current year",null,"Previous year",null,"Comments"]
[null,null,"Tax year ending ",null,null,null,null,{"$f":"IF(OR(TaxYearPrev=0,TaxYearCur=0),IF(D24<F24,\"Please explain lower current year net income:\",IF(D24>F24*1.2,\"Please explain > 20% increase in net income:\",\"\")),IF(ISERROR(VALUE(D8)<>VALUE(F8)+1),IF(D24<F24,\"Please explain lower current year net income:\",IF(D24>F24*1.2,\"Please explain > 20% increase in net income:\",\"\")),IF(VALUE(D8)<>VALUE(F8)+1,\"Error - Tax years not in consecutive order\",IF(D24<F24,\"Please explain lower current year net income:\",IF(D24>F24*1.2,\"Please explain > 20% increase in net income:\",\"\")))))","v":""}]
[]
[null,null,"Profit/loss (after tax)",null,null,null,null,{"$f":"IF(AND(ProfitCur<>\"\",ProfitPrev<>\"\"),\"\",IF(OR(ProfitCur<>\"\",ProfitPrev<>\"\"),\"Please explain only one year income is being used: \",\"\"))","v":""}]
{"$rows_left_out":59}
{"sheet":"Rental & Gearing","index":5,"n_rows":34,"n_cols":33,"rows_kept":34,"cut":false,"hidden":true,"merged":[[33,5,33,7],[30,5,30,7],[30,13,32,16],[30,17,32,19],[31,5,31,7],[32,5,32,7],[26,5,26,7],[27,5,27,7],[28,5,28,7],[29,5,29,7],[29,13,29,16],[21,5,21,7],[22,5,22,7],[23,5,23,7],[24,5,24,7],[25,5,25,7],[16,5,16,7],[17,5,17,7],[18,5,18,7],[19,5,19,7],[20,5,20,7],[11,5,11,7],[12,5,12,7],[13,5,13,7],[14,5,14,7],[15,5,15,7],[6,5,6,7],[7,5,7,7],[8,5,8,7],[9,5,9,7],[10,5,10,7],[2,5,2,8],[2,17,2,20],[3,5,3,7],[4,5,4,7],[5,5,5,7]]}
[]
[]
[null,null,null,null,null,"Rental Income",null,null,null,null,null,null,null,null,null,null,null,"Negative Gearing",null,null,null,null,null,null,"Rental"]
[null,null,null,null,null,"Property Address",null,null,"Gross Rental"," Frequency",null,"Annual Rental","Verification","App 1","App 2","App 3","App 4","Amount Owing","Interest Rate","Annual Gearing","App 1","App 2","App 3","App 4","App 1","App 2","App 3","App 4"]
[null,null,null,null,null,null,null,null,0,null,{"$f":"IF(J5=\"Weekly\",52,IF(J5=\"Fortnightly\",26,IF(J5=\"Monthly\",12,IF(J5=\"Quarterly\",4,1))))","v":1},{"$f":"I5*K5","v":0},null,null,null,null,null,0,null,{"$f":"R5*S5","v":0},{"$f":"T5*N5","v":0},{"$f":"T5*O5","v":0},{"$f":"T5*P5","v":0},{"$f":"Q5*T5","v":0},{"$f":"N5*L5","v":0},{"$f":"O5*L5","v":0},{"$f":"P5*L5","v":0},{"$f":"Q5*L5","v":0}]
[null,null,null,null,null,null,null,null,0,null,1,0,null,null,null,null,null,0,null,0,0,0,0,0,0,0,0,0]
[null,null,null,null,null,null,null,null,0,null,1,0,null,null,null,null,null,0,null,0,0,0,0,0,0,0,0,0]
[null,null,null,null,null,null,null,null,0,null,1,0,null,null,null,null,null,0,null,0,0,0,0,0,0,0,0,0]
[null,null,null,null,null,null,null,null,0,null,1,0,null,null,null,null,null,0,null,0,0,0,0,0,0,0,0,0]
[null,null,null,null,null,null,null,null,0,null,1,0,null,null,null,null,null,0,null,0,0,0,0,0,0,0,0,0,null,null,null,"Weekly","Valuation"]
{"$rows_left_out":25}
{"sheet":"China (USD) exportation limit","index":6,"n_rows":20,"n_cols":5,"rows_kept":20,"cut":false,"hidden":false,"merged":[[15,2,15,3],[16,1,16,3],[17,1,17,3],[19,1,21,4],[2,2,2,4],[5,1,5,2],[12,1,14,1],[12,2,12,3],[13,2,13,3],[14,2,14,3],[1,2,1,4],[3,1,3,4],[4,1,4,3],[10,1,10,3],[11,1,11,3]]}
[]
[null,"Customer Name"]
[null,"Application Number"]
[]
[null,"Proposed Loan Facility",null,null,0]
[null,"China Limit Exportation Calculation",null,"Per annum","AUD Amt Per Mth"]
[null,"Australian PAYG or S/E income",1,0,{"$f":"SUM(C7*D7)/12","v":0}]
[null,"Proposed monthly rental income        (weekly x 52 / 12)",0.8,0,{"$f":"SUM(C8*D8)/12","v":0}]
[null,"All existing AUS property rental income ",0.8,{"$f":"900*52","v":46800},{"$f":"SUM(C9*D9)/12","v":3120}]
[null,"Each Applicant - USD50,000                  Annual Exportation Limit",0.66,50000,{"$f":"SUM(D10/C10)/12","v":6313.1313131313136}]
{"$rows_left_out":11}
{"sheet":"Numbeo Living Expense Reference","index":7,"n_rows":30,"n_cols":11,"rows_kept":30,"cut":false,"hidden":false,"merged":[[0,1,0,2],[2,10,10,14]]}
[null,"Type of Applicants",null,"Per Child 50% of Single"]
["Country ","Single","Couple(1.92 * Single)",null,null,null,"Country ","Single","Couple","ratio"]
["Australia",1599.3,{"$f":"B3*1.92","v":3070.6559999999999},{"$f":"+B3/2","v":799.65},null,null,"Australia",1438.44,2740.14,{"$f":"I3/H3","v":1.9049386835738715},"As NUMBEO does not release living expense for couple any more, we use the ratio (Couple/Single) from old data. See the left. And since the maximum ratio is 1.92, we use this maximum ratio in a conservative view.  "]
["Brazil",799.6,{"$f":"B4*1.92","v":1535.232},{"$f":"+B4/2","v":399.8},null,null,"Brazil",655.75,1238.71,{"$f":"I4/H4","v":1.8889973313000381}]
["Brunei",1207.7,2318.7840000000001,{"$f":"+B5/2","v":603.85},null,null,"Brunei",822.12,1569.89,1.9095630808154529]
["Canada",1607.1,3085.6319999999996,803.55,null,null,"Canada",1332.25,2549.16,1.9134246575342464]
["China",834.6,1602.432,417.3,null,null,"China",830.9,1580.92,1.9026597665182334]
["France",1570.2,3014.7840000000001,785.1,null,null,"France",1578.85,2980.97,1.8880640972859992]
["Germany",1651.4,3170.6880000000001,825.7,null,null,"Germany",1264.9100000000001,2309.12,1.8255211833252956]
["Hong Kong",1796.7,3449.6639999999998,898.35,null,null,"Hong Kong",1447.25,2714.08,1.8753359820348938]
{"$rows_left_out":21}
{"sheet":"Log Change","index":8,"n_rows":5,"n_cols":3,"rows_kept":5,"cut":false,"hidden":true,"merged":[[0,0,0,2]]}
["Change Log"]
["Calculator","Date","Change"]
["Non-Res Serviceability","4.1 -> 4.2","Assessment rate amended floor - 5.29%\nAssessment rate amended buffer - 2.50%"]
["Non-Res Serviceability","4.3\n25/07/2022","Assessment rate amended buffer  - 3.00%\nupdate HEM table Q1 2022\nAdd Genworth DTI®\nAdd Rental & Gearing Cal"]
["Non-Res Serviceability","4.4\n11/09/2023","Assessment rate amended buffer  - 2.5%\nupdate HEM table Q2 2023"]

{"sheet":"Tax Scales","index":9,"n_rows":130,"n_cols":55,"rows_kept":130,"cut":false,"hidden":true,"merged":[]}
["Annual Salary Guide - Standard",null,null,null,null,null,null,null,null,null,null,null,null,null,null,"Annual Salary Guide - SMSF",null,null,null,null,null,null,null,null,null,null,null,null,null,null,"Annual Salary Guide - Non Resident",null,null,null,null,null,null,null,null,null,null,null,null,null,null,"Annual Salary Guide - ICR"]
["Tax Scales ",null,null,null,null,null,null,null,null,null,null,null,null,null,null,"Tax Scales ",null,null,null,null,null,null,null,null,null,null,null,null,null,null,"Tax Scales ",null,null,null,null,null,null,null,null,null,null,null,null,null,null,"Tax Scales "]
["Applicant 1",null,null,null,null,null,null,null,null,null,null,null,null,null,null,"Applicant 1",null,null,null,null,null,null,null,null,null,null,null,null,null,null,"Applicant 1",null,null,null,null,null,null,null,null,null,null,null,null,null,null,"Applicant 1"]
["Gross Taxable Income",null,null,"Tax Rate",null,"Gross",null,"Tax",null,"Net",null,null,null,null,null,"Gross Taxable Income",null,null,"Tax Rate",null,"Gross",null,"Tax",null,"Net",null,"Flood Levy Calculations",null,null,null,"Gross Taxable Income",null,null,"Tax Rate",null,"Gross",null,"Tax",null,"Net",null,"Flood Levy Calculations",null,null,null,"Gross Taxable Income",null,null,"Tax Rate",null,"Gross",null,"Tax",null,"Net"]
[1,18200,{"$f":"B5-A5+1","v":18200},0,null,{"$f":"IF(#REF!<B5,#REF!,C5)","v":{"$error":"#REF!"}},{"$f":"F5","v":{"$error":"#REF!"}},{"$f":"F5*D5","v":{"$error":"#REF!"}},null,{"$f":"F5-H5","v":{"$error":"#REF!"}},null,null,null,null,null,{"$f":"A5","v":1},18200,18200,0,null,{"$f":"IF('SMSF Servicing Calculator'!N63<Q5,'SMSF Servicing Calculator'!N63,R5)","v":0},{"$f":"U5","v":0},{"$f":"U5*S5","v":0},null,{"$f":"U5-W5","v":0},null,null,null,null,null,1,18200,{"$f":"AF5-AE5+1","v":18200},0,null,{"$f":"IF('Non-Res Serviceability'!R41<AF5,'Non-Res Serviceability'!R41,AG5)","v":0},{"$f":"AJ5","v":0},{"$f":"AJ5*AH5","v":0},null,{"$f":"AJ5-AL5","v":0},null,null,null,null,null,{"$f":"A5","v":1},18200,18200,0,null,0,{"$f":"AY5","v":0},{"$f":"AY5*AW5","v":0},null,{"$f":"AY5-BA5","v":0}]
[18201,45000,{"$f":"B6-A6+1","v":26800},0.19,null,{"$f":"IF(G5=#REF!,0,IF((#REF!-G5)>C6,C6,(#REF!-G5)))","v":{"$error":"#REF!"}},{"$f":"G5+F6","v":{"$error":"#REF!"}},{"$f":"F6*D6","v":{"$error":"#REF!"}},null,{"$f":"F6-H6","v":{"$error":"#REF!"}},null,null,null,null,null,18201,45000,{"$f":"C6","v":26800},0.19,null,{"$f":"IF(V5='SMSF Servicing Calculator'!$N$63,0,IF(('SMSF Servicing Calculator'!$N$63-V5)>R6,R6,('SMSF Servicing Calculator'!$N$63-V5)))","v":0},{"$f":"V5+U6","v":0},{"$f":"U6*S6","v":0},null,{"$f":"U6-W6","v":0},null,null,null,null,null,18201,45000,{"$f":"AF6-AE6+1","v":26800},0.16,null,{"$f":"IF(AK5='Non-Res Serviceability'!R41,0,IF(('Non-Res Serviceability'!R41-AK5)>AG6,AG6,('Non-Res Serviceability'!R41-AK5)))","v":0},{"$f":"AK5+AJ6","v":0},{"$f":"AJ6*AH6","v":0},null,{"$f":"AJ6-AL6","v":0},null,null,null,null,null,18201,45000,26800,0.19,null,0,{"$f":"AZ5+AY6","v":0},{"$f":"AY6*AW6","v":0},null,{"$f":"AY6-BA6","v":0}]
[45001,120000,{"$f":"B7-A7+1","v":75000},0.32500000000000001,null,{"$f":"IF(G6=#REF!,0,IF((#REF!-G6)>C7,C7,(#REF!-G6)))","v":{"$error":"#REF!"}},{"$f":"G6+F7","v":{"$error":"#REF!"}},{"$f":"F7*D7","v":{"$error":"#REF!"}},null,{"$f":"F7-H7","v":{"$error":"#REF!"}},null,null,null,null,null,45001,120000,75000,0.32500000000000001,null,{"$f":"IF(V6='SMSF Servicing Calculator'!$N$63,0,IF(('SMSF Servicing Calculator'!$N$63-V6)>R7,R7,('SMSF Servicing Calculator'!$N$63-V6)))","v":0},{"$f":"V6+U7","v":0},{"$f":"U7*S7","v":0},null,{"$f":"U7-W7","v":0},null,{"$f":"IF(U7>13000,(U7-13000)*0.5%,0)","v":0},null,null,null,45001,135000,{"$f":"AF7-AE7+1","v":90000},0.3,null,{"$f":"IF(AK6='Non-Res Serviceability'!R41,0,IF(('Non-Res Serviceability'!R41-AK6)>AG7,AG7,('Non-Res Serviceability'!R41-AK6)))","v":0},{"$f":"AK6+AJ7","v":0},{"$f":"AJ7*AH7","v":0},null,{"$f":"AJ7-AL7","v":0},null,{"$f":"IF(AJ7>13000,(AJ7-13000)*0.5%,0)","v":0},null,null,null,45001,120000,75000,0.32500000000000001,null,0,{"$f":"AZ6+AY7","v":0},{"$f":"AY7*AW7","v":0},null,{"$f":"AY7-BA7","v":0}]
[120001,180000,{"$f":"B8-A8+1","v":60000},0.37,null,{"$f":"IF(G7=#REF!,0,IF((#REF!-G7)>C8,C8,(#REF!-G7)))","v":{"$error":"#REF!"}},{"$f":"G7+F8","v":{"$error":"#REF!"}},{"$f":"F8*D8","v":{"$error":"#REF!"}},null,{"$f":"F8-H8","v":{"$error":"#REF!"}},null,null,null,null,null,120001,180000,60000,0.37,null,{"$f":"IF(V7='SMSF Servicing Calculator'!$N$63,0,IF(('SMSF Servicing Calculator'!$N$63-V7)>R8,R8,('SMSF Servicing Calculator'!$N$63-V7)))","v":0},{"$f":"V7+U8","v":0},{"$f":"U8*S8","v":0},null,{"$f":"U8-W8","v":0},null,{"$f":"SUM(AB8:AC8)","v":0},{"$f":"IF(U8<=20000,U8*0.5%,0)","v":0},{"$f":"IF(U8>20000,((U8-20000)*1%)+100,0)","v":0},null,135001,190001,{"$f":"AF8-AE8+1","v":55001},0.37,null,{"$f":"IF(AK7='Non-Res Serviceability'!R41,0,IF(('Non-Res Serviceability'!R41-AK7)>AG8,AG8,('Non-Res Serviceability'!R41-AK7)))","v":0},{"$f":"AK7+AJ8","v":0},{"$f":"AJ8*AH8","v":0},null,{"$f":"AJ8-AL8","v":0},null,{"$f":"SUM(AQ8:AR8)","v":0},{"$f":"IF(AJ8<=20000,AJ8*0.5%,0)","v":0},{"$f":"IF(AJ8>20000,((AJ8-20000)*1%)+100,0)","v":0},null,120001,180000,60000,0.37,null,0,{"$f":"AZ7+AY8","v":0},{"$f":"AY8*AW8","v":0},null,{"$f":"AY8-BA8","v":0}]
[180001,100000000,{"$f":"B9-A9+1","v":99820000},0.45,null,{"$f":"IF(#REF!-G8<=0,0,(#REF!-G8))","v":{"$error":"#REF!"}},{"$f":"G8+F9","v":{"$error":"#REF!"}},{"$f":"F9*D9","v":{"$error":"#REF!"}},null,{"$f":"F9-H9","v":{"$error":"#REF!"}},null,null,null,null,null,180001,100000000,99820000,0.45,null,{"$f":"IF(V8='SMSF Servicing Calculator'!$N$63,0,IF(('SMSF Servicing Calculator'!$N$63-V8)>R9,R9,('SMSF Servicing Calculator'!$N$63-V8)))","v":0},{"$f":"V8+U9","v":0},{"$f":"U9*S9","v":0},null,{"$f":"U9-W9","v":0},null,{"$f":"U9*1%","v":0},null,null,null,190001,100000000,{"$f":"AF9-AE9+1","v":99810000},0.45,null,{"$f":"IF('Non-Res Serviceability'!R41-AK8<=0,0,('Non-Res Serviceability'!R41-AK8))","v":0},{"$f":"AK8+AJ9","v":0},{"$f":"AJ9*AH9","v":0},null,{"$f":"AJ9-AL9","v":0},null,{"$f":"AJ9*1%","v":0},null,null,null,180001,100000000,99820000,0.45,null,0,{"$f":"AZ8+AY9","v":0},{"$f":"AY9*AW9","v":0},null,{"$f":"AY9-BA9","v":0}]
[null,null,null,"Totals:",null,{"$f":"SUM(F5:F9)","v":{"$error":"#REF!"}},null,{"$f":"SUM(H5:H9)","v":{"$error":"#REF!"}},null,{"$f":"SUM(J5:J9)","v":{"$error":"#REF!"}},null,null,null,null,null,null,null,null,"Totals:",null,{"$f":"SUM(U5:U9)","v":0},null,{"$f":"SUM(W5:W9)","v":0},null,{"$f":"SUM(Y5:Y9)","v":0},null,{"$f":"SUM(AA7:AA9)","v":0},null,null,null,null,null,null,"Totals:",null,{"$f":"SUM(AJ5:AJ9)","v":0},null,{"$f":"SUM(AL5:AL9)","v":0},null,{"$f":"SUM(AN5:AN9)","v":0},null,{"$f":"SUM(AP7:AP9)","v":0},null,null,null,null,null,null,"Totals:",null,{"$f":"SUM(AY5:AY9)","v":0},null,{"$f":"SUM(BA5:BA9)","v":0},null,{"$f":"SUM(BC5:BC9)","v":0}]
{"$rows_left_out":121}
{"sheet":"HEM2","index":10,"n_rows":99,"n_cols":16,"rows_kept":99,"cut":false,"hidden":true,"merged":[]}
[]
[]
[]
[null,null,null,"\"HEM Table 1\" equivalent: by Income Level and Residency",null,null,null,null,null,null,null,null,null,null,null,"Q3 2025"]
[null,null,null,null,null,"BASED ON PREDICTED VALUES FROM THE QUANTILE REGRESSIONS"]
[null,null,null,null,null,null,null,"Smoothed HEM"]
[null,"Column for lookup","2","3","4","5","6","7","8","9","10","11","12","13","14","15"]
[null,null,null,null,null,"Total current gross HH income from all sources (measured in current dollars)"]
[null,null,-9999999999,27000,40000,53000,66000,80000,106000,133000,160000,186000,213000,266000,332000,399000]
[null,null,"or less","to","to","to","to","to","to","to","to","to","to","to","to","to"]
{"$rows_left_out":90}
{"sheet":"RepayCalculator","index":11,"n_rows":50,"n_cols":10,"rows_kept":50,"cut":false,"hidden":true,"merged":[]}
["Dropdown box data"]
["Principal & Interest"]
["Interest Only"]
[]
[]
["Serviceability Sensitivity",0.02]
[]
["Interest Rate Floor",5.7500000000000002E-2]
[]
["Interest Only Period","Loan Term","LoanType","Stressed","Status","Household","Dependents",null,null,"Non Res Commitment"]
{"$rows_left_out":41}
{"sheet":"Cost of Living Index","index":12,"n_rows":139,"n_cols":9,"rows_kept":139,"cut":false,"hidden":true,"merged":[[0,6,0,8]]}
["Country","Cost of Living Index","Currency Code",null,{"$f":"_xlfn._xlws.SORT(_xlfn._xlws.FILTER(A:A,ISNUMBER(SEARCH('Non-Res Serviceability'!D15,A:A)),\"not found\"))","v":"China"},{"$f":"_xlfn._xlws.SORT(_xlfn._xlws.FILTER(A:A,ISNUMBER(SEARCH('Non-Res Serviceability'!F15,A:A)),\"not found\"))","v":"Afghanistan"},"Living Allowance Calculation"]
["Afghanistan",26.33,"AFN",null,null,"Albania"]
["Albania",40.25,"ALL",null,null,"Algeria",null,"$ per Week","$ per Month"]
["Algeria",28.31,"DZD",null,null,"Argentina","Single",343,{"$f":"H4*52/12","v":1486.3333333333333}]
["Argentina",37.869999999999997,"ARS",null,null,"Armenia","Couples",526,{"$f":"H5*52/12","v":2279.3333333333335}]
["Armenia",31.68,"AMD",null,null,"Australia","Children",489.48,{"$f":"(H6-H4)*52/12","v":634.74666666666678}]
["Australia",84.14,"AUD",null,null,"Austria"]
["Austria",75.489999999999995,"EUR",null,null,"Azerbaijan"]
["Azerbaijan",30.9,"AZN",null,null,"Bahamas","Version Date: 1 March 2020"]
["Bahamas",85.85,"BSD",null,null,"Bahrain"]
{"$rows_left_out":130}
{"sheet":"Live Currency Rates","index":13,"n_rows":186,"n_cols":8,"rows_kept":186,"cut":false,"hidden":true,"merged":[]}
["Currency","Name","Units per AUD","AUD per unit",null,null,"ex rate 1",{"$f":"VLOOKUP('Non-Res Serviceability'!D16,'Live Currency Rates'!A:F,3,FALSE)","v":4.7565598361641603}]
["USD","US Dollar",0.67377806904169579,1.4841682238519349,null,null,"ex rate 2",{"$f":"VLOOKUP('Non-Res Serviceability'!F16,'Live Currency Rates'!A:F,3,FALSE)","v":{"$error":"#N/A"}}]
["EUR","Euro",0.61417382584782176,1.6282035441995164]
["GBP","British Pound",0.51462053080044168,1.9431793722737767]
["INR","Indian Rupee",56.57598831745576,1.7675343016349276E-2]
["AUD","Australian Dollar",1,1]
["CAD","Canadian Dollar",0.92058294772059857,1.0862682200186755]
["SGD","Singapore Dollar",0.87857544363467321,1.1382061805221786]
["CHF","Swiss Franc",0.57792730557321692,1.7303214268586089]
["MYR","Malaysian Ringgit",2.8883391310563988,0.34621973204173362]
{"$rows_left_out":176}